##TITLE=1H_DE-80H_X3
 200.13MHz, d2o
 8 sc
 
 19ns.26.2.2025
##JCAMPDX= 6.0         $$ Bruker NMR JCAMP-DX V2.0
##DATA TYPE= NMR SPECTRUM
##DATA CLASS= NTUPLES
##ORIGIN= UXNMR, Bruker Analytische Messtechnik GmbH
##OWNER= pz
$$ XWIN-NMR		Version 3.5
$$ Thu Dec 11 10:45:34 2025 Russian Standard Time (UT+4h)  Yarkov@DPX200
##.OBSERVE FREQUENCY= 200.1313
##.OBSERVE NUCLEUS= ^1H
##.ACQUISITION MODE= SIMULTANEOUS
##.ACQUISITION SCHEME= undefined
##.AVERAGES= 8
##.DIGITISER RES= 18
##SPECTROMETER/DATA SYSTEM= spect
##.PULSE SEQUENCE= zg30
##.SOLVENT NAME= CDCl3
##.SHIFT REFERENCE= (INTERNAL, CDCl3, 0, 15.4979)
##AUDIT TRAIL= $$ (NUMBER, WHEN, WHO, WHERE, WHAT)
$$ ##TITLE= Audit trail, XWIN-NMR		Version 3.5
$$ ##JCAMPDX= 5.01
$$ ##ORIGIN= Bruker BioSpin GmbH
$$ ##OWNER= Yarkov
$$ C:/Bruker/XWIN-NMR/data/yarkov2/nmr/H-C/1/pdata/1/auditp.txt
$$ ##AUDIT TRAIL=  $$ (NUMBER, WHEN, WHO, WHERE, WHAT)
(   1,<2025-12-11 10:44:44.76 +0400>,<Yarkov>,<DPX200>,
      <created by zg, POWCHK disabled, PULCHK disabled
       configuration hash MD5:
       00 E9 B6 7A A2 85 ED C7 34 08 36 98 17 FE 4E 26
       data hash MD5: 16K
       2A 6C 7B B2 7B 3F 7B 2E 7C A6 67 B8 DF B9 FC 0B>)
(   2,<2025-12-11 10:44:50.65 +0400>,<Yarkov>,<DPX200>,
      <Start of raw data processing
       efp BC_mod = 2 LB = 0.25 FT_mod = 6 PKNL = 1 PHC0 = -5306.083 PHC1 = 17.82193 SI = 16K 
       data hash MD5: 16K
       7F 1B 94 00 2A EF 62 CE CE 6D 98 77 3D 65 49 2A>)
(   3,<2025-12-11 10:44:57.60 +0400>,<Yarkov>,<DPX200>,
      <abs ABSG = 5 
       data hash MD5: 16K
       78 8D 94 EA F8 08 7A 70 98 26 4A 2D 80 D8 34 4C>)
$$ ##END=
$$ 
$$ hash MD5
$$ EA 71 1A F2 AB E8 06 08 C3 8A 00 8E EC 5E DE C6
##$RELAX= 
##$RELAX= 
##$RELAX= 
##$RELAX= 
##$RELAX= 
##$RELAX= 
$$ Bruker specific parameters
$$ --------------------------
##$DU= <C:/Bruker/XWIN-NMR>
##$EXPNO= 1
##$NAME= <H-C>
##$PROCNO= 1
##$TYPE= <nmr>
##$USER= <yarkov2>
##$AMP= (0..31)
100 100 100 100 100 100 100 100 100 100 100 100 100 100 100 100 100 100 
100 100 100 100 100 100 100 100 100 100 100 100 100 100 
##$AQSEQ= 0
##$AQ_mod= 1
##$AUNM= <au_zg>
##$AUTOPOS= <>
##$BF1= 200.13
##$BF2= 200.13
##$BF3= 200.13
##$BF4= 200.13
##$BF5= 200.13
##$BF6= 200.13
##$BF7= 200.13
##$BF8= 200.13
##$BYTORDA= 1
##$CFDGTYP= 0
##$CFRGTYP= 5
##$CHEMSTR= <none>
##$CNST= (0..31)
1 1 145 1 1 1 1 1 1 1 1 1 1 1 1 1 1 1 1 1 1 1 1 1 1 1 1 1 1 1 1 1 
##$CPDPRG= <>
##$CPDPRG1= <>
##$CPDPRG2= <>
##$CPDPRG3= <>
##$CPDPRG4= <mlev>
##$CPDPRG5= <mlev>
##$CPDPRG6= <mlev>
##$CPDPRG7= <mlev>
##$CPDPRG8= <mlev>
##$CPDPRGB= <>
##$CPDPRGT= <>
##$D= (0..31)
0 0.7 0 0 0 0 0 0 0 0 0 0.03 0 0 0 0 0 0 0 0 0 0 0 0 0 0 0 0 0 0 0 0 
##$DATE= 1765435484
##$DBL= (0..7)
120 120 120 120 120 120 120 120 
##$DBP= (0..7)
150 150 150 150 150 150 150 150 
##$DBP07= 0
##$DBPNAM0= <>
##$DBPNAM1= <>
##$DBPNAM2= <>
##$DBPNAM3= <>
##$DBPNAM4= <>
##$DBPNAM5= <>
##$DBPNAM6= <>
##$DBPNAM7= <>
##$DBPOAL= (0..7)
0.5 0.5 0.5 0.5 0.5 0.5 0.5 0.5 
##$DBPOFFS= (0..7)
0 0 0 0 0 0 0 0 
##$DE= 6
$$ [...]
##$SUBNAM3= <"">
##$SUBNAM4= <"">
##$SUBNAM5= <"">
##$SUBNAM6= <"">
##$SUBNAM7= <"">
##$SUBNAM8= <"">
##$SUBNAM9= <"">
##$SW= 18.0517328524113
##$SWIBOX= (0..15)
0 0 2 0 0 0 0 0 0 0 0 0 0 0 0 0 
##$SW_h= 3612.71676300578
##$TD= 16384
##$TD0= 1
##$TE= 0
##$TE2= 300
##$TE3= 300
##$TEG= 300
##$TL= (0..7)
0 120 120 120 120 120 120 120 
##$TP= (0..7)
150 150 150 150 150 150 150 150 
##$TP07= 0
##$TPNAME0= <>
##$TPNAME1= <>
##$TPNAME2= <>
##$TPNAME3= <>
##$TPNAME4= <>
##$TPNAME5= <>
##$TPNAME6= <>
##$TPNAME7= <>
##$TPOAL= (0..7)
0.5 0.5 0.5 0.5 0.5 0.5 0.5 0.5 
##$TPOFFS= (0..7)
0 0 0 0 0 0 0 0 
##$TUNHIN= 0
##$TUNHOUT= 0
##$TUNXOUT= 0
##$USERA1= <user>
##$USERA2= <user>
##$USERA3= <user>
##$USERA4= <user>
##$USERA5= <user>
##$V9= 5
##$VALIST= <valist>
##$VCLIST= <CCCCCCCCCCCCCCC>
##$VD= 0
##$VDLIST= <DDDDDDDDDDDDDDD>
##$VPLIST= <PPPPPPPPPPPPPPP>
##$VTLIST= <TTTTTTTTTTTTTTT>
##$WBST= 1024
##$WBSW= 4
##$XGAIN= (0..3)
0 0 0 0 
##$XL= 0
##$YL= 0
##$YMAX_a= 146655
##$YMIN_a= -102440
##$ZGOPTNS= <>
##$ZL1= 120
##$ZL2= 120
##$ZL3= 120
##$ZL4= 120
##$ABSF1= 15.47805
##$ABSF2= -2.573799
##$ABSG= 5
##$ABSL= 3
##$ALPHA= 0
##$AQORDER= 0
##$ASSFAC= 0
##$ASSFACI= 0
##$ASSFACX= 0
##$ASSWID= 0
##$AUNMP= <proc_1d>
##$AZFE= 0.1
##$AZFW= 0.1
##$BCFW= 0
##$BC_mod= 2
##$BYTORDP= 0
##$COROFFS= 0
##$CY= -3
##$DATMOD= 1
##$DC= 0
##$DFILT= <>
##$DTYPP= 0
##$F1P= 0
##$F2P= 0
##$FCOR= 1
##$FTSIZE= 16384
##$FT_mod= 6
##$GAMMA= 0
##$GB= 0
##$INTBC= 1
##$INTSCL= 3.241238e-09
##$ISEN= 128
##$LB= 0.25
##$LEV0= 0
##$LPBIN= 0
##$MAXI= 10000
##$MC2= 0
##$MEAN= 0
##$ME_mod= 0
##$MI= 1.114404
##$NCOEF= 0
##$NC_proc= -8
##$NLEV= 6
##$NOISF1= 3.799351
##$NOISF2= 2.8
##$NSP= 0
##$NTH_PI= 0
##$NZP= 0
##$OFFSET= 15.49788
##$PC= 1
##$PHC0= -5306.083
##$PHC1= 17.82193
##$PH_mod= 1
##$PKNL= yes
##$PPARMOD= 0
##$PSCAL= 0
##$PSIGN= 0
##$REVERSE= no
##$SF= 200.13000476705
##$SI= 16384
##$SIGF1= 3
##$SIGF2= 2
##$SINO= 0.751879
##$SIOLD= 32768
##$SREGLST= <19F.Aceton>
##$SSB= 0
##$STSI= 16384
##$STSR= 0
##$SW_p= 3612.71676300578
##$SYMM= 0
##$S_DEV= 0
##$TDeff= 16384
##$TDoff= 0
##$TI= <>
##$TILT= no
##$TM1= 0
##$TM2= 0
##$TOPLEV= 0
##$USERP1= <user>
##$USERP2= <user>
##$USERP3= <user>
##$USERP4= <user>
##$USERP5= <user>
##$WDW= 1
##$XDIM= 16384
##$YMAX_p= 459965354
##$YMIN_p= -757189
$$ End of Bruker specific parameters
$$ ---------------------------------
##NTUPLES= NMR SPECTRUM
##VAR_NAME=  FREQUENCY,     SPECTRUM/REAL,   SPECTRUM/IMAG
##SYMBOL=    X,             R,               I
##VAR_TYPE=  INDEPENDENT,   DEPENDENT,       DEPENDENT
##VAR_FORM=  AFFN,          ASDF,            ASDF
##VAR_DIM=   16384,         16384,           16384
##UNITS=     HZ,            ARBITRARY UNITS, ARBITRARY UNITS
##FACTOR=    0.220516191357247, 1,           1
##FIRST=     3101.59079467575, 0,            0
##LAST=      -511.125968330026, 0,           0
##MIN=       -511.125968330026, -757189,     0
##MAX=       3101.59079467575, 459965354,    0
$$ Real data points
##PAGE= N=1
##DATA TABLE= (X++(R..R)), XYDATA
$$ [...]
10216 153149 55939 -163227 -258891 -111416 -315151 -48296 193230 8674 25504 -58120
10206 -58120 -21091 -4972 88974 -124529 -135357 96707 211765 225922 8188 -65805 -50562
10195 -50562 -13112 243586 29936 216925 254624 198359 300993 226699 267666 166109 270739
10184 270739 41665 24891 183521 300500 342916 166448 32391 19592 66447 70846 10505
10173 10505 61614 136437 304710 131204 -191066 -32643 184288 87234 -62987 -50936
10163 -50936 87369 97677 194318 323682 37125 88520 11973 -195836 192210 152624 13360
10152 13360 -5308 -277447 -6393 19156 -85113 -257794 58698 210319 56965 -140647
10142 -140647 -149874 70833 233214 366034 359073 246369 250119 402958 229157 101499 70817
10131 70817 153728 317073 498287 337423 282456 100555 146698 -132253 -48971 114405
10121 114405 -16218 -217620 -90040 22 94487 265386 328306 176099 265805 215602
10111 215602 145644 39368 3002 196932 125558 18567 -37234 52799 -167774 32626
10101 32626 117986 -72466 287322 251517 127746 148516 147318 -56266 186172 234894 145040
10090 145040 149439 123945 156622 38175 240792 90127 340977 341072 436240 284024 -76241
10079 -76241 -163009 -19881 -49440 -103541 1366 -46869 -138939 -139815 255602 124744 43228
10068 43228 460989 456348 408832 321074 386835 138919 206256 354898 207838 90207 139780
10057 139780 189046 262444 141548 119371 264440 18374 291591 579961 350331 241043
10047 241043 312604 185057 190628 185368 95039 -79203 -39873 225586 250469 301886 256286
10036 256286 256388 151740 200591 -79526 -43726 361096 312363 427356 444283 277747 289057
10025 289057 141633 353770 222896 -23223 263847 297705 -141802 -151786 261221 325492
10015 325492 9988 -47762 402307 254766 121181 348493 281138 370330 455250 240083
10005 240083 206714 146632 -125107 28888 153815 193365 314544 153166 186342 374265
9995 374265 281341 328672 596212 587561 443082 520770 371343 202901 33504 -47823 137148
9984 137148 492934 650192 378638 422191 456488 361976 335165 510552 591959 502451 514225
9973 514225 653045 650252 349224 48995 204747 79738 229238 335989 337980 274124 397842
9962 397842 430763 341264 403513 715692 815068 785301 486091 618010 549593 312239 415949
9951 415949 509442 659763 535609 306083 506049 575529 339511 474514 376890 342894
9941 342894 533642 479189 618453 849458 746620 910850 601735 584942 899126 902757
9931 902757 777268 733427 733304 869279 974816 706181 336088 445018 336346 253796 384022
9920 384022 329631 248251 320414 407748 306266 302882 420763 483332 656719 447081 323464
9909 323464 432010 491615 304349 593396 640962 382139 237274 501710 727105 599157
9899 599157 713610 483519 361099 158942 244244 557733 610409 454177 477697 378269
9889 378269 426765 365935 157856 174813 571138 469959 559417 805760 573191 510453 518329
9878 518329 338560 344958 565542 784471 698665 550081 437390 428167 429121 629441 691508
9867 691508 611341 747872 784985 609686 687167 586818 385679 255614 359033 497562
9857 497562 470252 605668 782455 886616 845128 817586 568083 446227 429131 534192
9847 534192 604172 597688 499772 355798 416308 698464 507012 599057 767042 778852 654296
9836 654296 712173 720515 847470 765360 496344 536434 659637 772796 880024 894976 857697
9825 857697 876895 1099660 890497 884650 1342670 1405082 1599569 1565788 1624966 1663022 1682097
9814 1682097 1687773 1384746 1089120 1030503 1045958 883706 780191 626267 524943 641885
9804 641885 788435 703807 760631 785367 754956 1031717 919710 946826 962189 965221 1047993
9793 1047993 1019514 864545 782891 924736 994015 1023025 957611 762765 956225 1059218
9783 1059218 1074735 1233372 1121858 1125480 1157362 1050701 1184840 1334717 1505317 1415058
9773 1415058 1234062 1225133 1019295 1137924 1466670 1665025 1601943 1641941 1525603 1574164
9763 1574164 1586491 1892058 2090973 2396111 2567840 2663316 2549395 2267189 2282134 2327346
9753 2327346 2207613 2386949 2280400 2237967 2067743 1977254 1948722 1715562 1655748 1775468
9743 1775468 1718677 1566707 1652550 1663388 1694528 1694819 1751024 1994577 1985162 2139897 2271959
9732 2271959 2171508 2320825 2122006 2596184 2708562 2782372 2745416 2783813 2892800 3288339
9722 3288339 3498117 3801525 3582683 3723371 3649724 3327853 3283362 2980209 3158574 3065573
9712 3065573 2741371 2729848 2738181 2643598 2528666 2408700 2575381 2365497 2183768 2326832
9702 2326832 2477495 2428361 2291060 2427101 2490601 2362006 2209810 1970952 1909502 2316918
9692 2316918 2540937 2378205 2365291 2490056 2683582 2907014 2880518 2956175 3095546 2696599
9682 2696599 2274110 2715296 2994015 2797000 2855753 3068947 3037418 2886078 3081364 3249945
9672 3249945 3307973 3465442 3389537 3457311 3669915 3736805 3790004 4049666 3921936 4013414 4406946
9661 4406946 4408728 4598211 4995103 5152043 5521364 5850694 6130838 6496569 6546429 6394021
9651 6394021 6087733 5620988 5156746 4866720 4919153 5376987 5141331 4860491 4549022 4650612
9641 4650612 4683581 4437241 4471150 4452753 4154118 4283232 4510996 4476174 4421710 4658457
9631 4658457 4935726 5029672 4929985 5064278 5422237 5623125 5930491 6481504 6679530 6748698
9621 6748698 6515896 6681691 7507612 7964923 8797388 9337821 9437123 9297387 8899125 7969302
9611 7969302 7526237 7019514 6402519 6093248 5810164 5576993 5530461 5550106 5483457 5530896
9601 5530896 5451921 5240848 5337182 5290068 5434535 5499044 5159526 4765554 4630991 4657654
9591 4657654 4780591 5117257 5095031 5037124 4903055 5039086 5075879 5139846 5074003 5136799 5151664
9580 5151664 5373344 5075501 4733048 4776006 4956030 4991991 4656566 4714779 5033548 4856703
9570 4856703 4958900 4839757 4887566 4853359 4815857 5113192 5261187 5279283 5277137 5398486 5284929
9559 5284929 5155211 5350470 5249891 5038474 5184078 5405479 5504828 5600321 5586099 5570392
9549 5570392 5877091 5828622 5793938 6226496 6194119 6019502 6306777 6394783 6405658 6407113 6272180
9538 6272180 6762342 7197061 7343905 7696303 7646273 8027019 7829919 7925134 8123271 8332491
9528 8332491 8392002 8732796 9060543 9486356 9949033 10010706 9991316 9892150 9588460 9535460
9518 9535460 9421025 9615825 9724501 9987779 10134185 10360992 10347054 10413842 10739207 10647264
9508 10647264 10648473 10991797 11261309 11617153 12137966 12116963 12801071 13737950 14460372 15040824
9498 15040824 15658822 16617067 17675419 19094860 20639966 22149310 24568935 26849239
9490 26849239 29899493 33399596 37177035 40480350 43526152 45986907 47014938 46882437
9482 46882437 45715803 43920655 41806688 39164762 36701414 34461291 32401713 30385912
9474 30385912 28878098 27530549 25933998 24426060 22879132 22000113 21889910 21454963 21256268
9465 21256268 21505964 22028812 22990604 24266480 26050339 28068959 30082924 32558722 35213833
9456 35213833 37590401 40774306 44500196 48846562 53894894 60190421 67581218 74794600
9448 74794600 81020484 85374719 87473084 88309473 86704866 83050301 77912697 71564111
9440 71564111 64506293 58306290 52410331 47012658 42539856 38410477 34848984 31657115
9432 31657115 28880082 26733494 24978654 23836994 22681669 21954279 21530298 20955618 20602304
9423 20602304 20087475 20055481 20198799 20395010 20517680 20367724 20062073 20169638 20492080 20698769
9413 20698769 21236654 21638955 22417689 23391342 23826428 23897679 23696914 23224601 22727459 22782981
9403 22782981 22797532 23224585 23848941 24568577 25391245 26257910 27022065 27775984 28478033 29984887
9393 29984887 31798835 34146033 37139951 40385513 44146884 48660853 54111721 60270010
9385 60270010 67634109 75947837 84261898 91737351 96543477 98190712 96686412 92192601
9377 92192601 85273450 77306513 69709938 63243353 57798081 53610637 50283931 47267397
9369 47267397 44549480 41289715 38408774 35639675 33232700 31233329 29869210 29205284
9361 29205284 28822670 28649972 28529367 28332316 28596650 29019819 29884724 30950109 32282765
9352 32282765 33977125 35441560 36979587 38761282 40580440 42636694 45157144 47816607
9344 47816607 50665824 52892335 54318142 54469806 53571058 50716860 46950846 42856237
9336 42856237 38574435 34968743 31693896 29240424 26922117 24996776 23531191 22258514
9328 22258514 20909848 19937322 19322429 18467313 17632294 16957630 16710199 16540138 16349595
9319 16349595 16221759 16032856 15776642 15072636 15152268 15067012 14868934 14684627 14590427 14442560
9309 14442560 14010674 14133810 14389240 14487106 14304565 14206811 14329834 14648053 14423625 14139409
9299 14139409 14101386 13733935 13243205 13147750 12870747 12809871 12779180 12681777 12410810 12453258
9289 12453258 12398277 12160449 12117252 12273443 12032198 11864638 11845205 11867543 11645816 11476009
9279 11476009 11825575 11827102 11682469 11625094 11749203 11592909 11631254 11681556 11736174 12037709
9269 12037709 12140108 12178343 12299772 12625229 12501193 12288329 12505418 12690801 12274891 12197538
9259 12197538 12439804 12486568 12316556 12392124 12665175 12752409 12721294 12483873 12530377 12835613
9249 12835613 12800533 12694944 12730549 12788137 13103815 13337480 13310814 13587673 13624602 13657108
9239 13657108 13842502 13689026 13743028 13773225 13882117 14166896 14155951 14112847 14288343 14453239
9229 14453239 14597813 14457689 14447598 14411608 14641761 14581949 14710575 14970776 15002546 15129362
9219 15129362 15265752 15281524 15599236 15801078 15893455 16176649 16509498 16822954 17330019 17611025
9209 17611025 17825531 18404564 18850993 19106284 19617363 20109521 20419739 20481769 20648324 20444223
9199 20444223 20605903 20453567 20231129 19773513 19543311 19238553 19197281 19290266 19497889 19684975
9189 19684975 19631381 19911911 20204923 20295815 20218081 20274745 20480646 20440522 20805744 21350160
9179 21350160 21551824 21858020 22094324 22454445 22888053 23225477 23389317 24022876 24675584
9170 24675584 25089798 25571936 26223890 26630507 26962975 27059030 27076307 26943685 26743634 26378883
9160 26378883 25864716 25769930 25887589 26020922 26314289 26511055 26825873 26855554 26743404 26925103
9150 26925103 27148931 27131419 26948285 26881483 26989195 26755129 26830993 26508919 26282521 26147760
9140 26147760 26174198 26195892 26274246 26147375 26257762 26525765 26049007 25911880 25623007 25271282
9130 25271282 25331445 25296044 25591671 25854958 26023332 26161965 26596497 26869051 27454477 28269702
9120 28269702 28816605 29244399 29729752 30404680 31108117 31831417 32858650 33730035 34666294
9111 34666294 35274457 35509725 35443173 34969231 34389834 33673346 32992757 32396303 31704359 31049231
9101 31049231 30668645 30217784 29762637 28941351 28033252 27578104 27171118 26667663 26182556
9092 26182556 25982815 25577038 25220506 24868316 24500044 24345598 24327996 24472430 24406735 24445602
9082 24445602 24606634 24752534 25387778 25618165 25673169 26218756 26714683 27393539 27918119 28601652
9072 28601652 29077868 29580521 29935702 29746079 29366025 28969881 28315480 27783750 26845704
9063 26845704 25736016 25041727 24381849 23773579 23347408 22899188 22668875 22617340 22061799
9054 22061799 21732903 21302014 21040775 21010512 20862730 20627569 20296290 20455774 20366970 20228816
9044 20228816 20006976 19861452 20246712 20417001 20692121 20952305 21179446 21625179 21579285 21221227
9034 21221227 21117334 21250115 21016837 20695138 20649693 20280571 20075978 19877138 19980828 20070467
9024 20070467 19914182 19853529 19916667 19772257 19431762 19437449 19675519 19476747 19366803 19524132
9014 19524132 19582635 19544105 19595415 19925814 19917607 19948721 20365418 20724534 20657486 20792773 21017562
9003 21017562 21282517 21435325 21725529 21947535 22517571 22298258 22157567 21911485 21889794 21995672
8993 21995672 22141921 22271164 22675679 23067326 23431625 23289795 23459006 23683208 24143383
8984 24143383 24773963 25136619 25522565 25754619 26153810 26332958 26550054 26819098 26937549
8975 26937549 27015763 27172343 26699827 26351663 26488961 26448998 26346597 25946367 25990755 26080246
8965 26080246 26391692 26352228 26048287 25709876 25588800 25433139 25622883 25633126 25801967 25825629
8955 25825629 25989728 26206786 26465948 26606474 26768910 27156233 27385823 27605370 28199693
8946 28199693 28326783 28585515 28619876 29019674 29394089 29990915 30767333 31822057 32926991
8937 32926991 34688722 36581645 38729749 41207417 44617364 48631930 54027938 63591779
8929 63591779 85705718 132787490 199018505 249881830 253455128 224969547 172248277
8922 172248277 126619462 97416753 75860048 60880638 49789091 42266947 36974406
8915 36974406 33733315 31010682 29470018 27901657 26734817 25786012 25247300 24689653 24258978
8906 24258978 23130101 22596991 21868553 21222134 20726457 20437400 20410064 19790313 19569168
8897 19569168 19341476 18846892 18951485 18522491 18354357 18224592 18078522 17722483 17414618
8888 17414618 17047893 16861495 16537057 16258084 16073714 16066892 15648652 15573119 15235861 15163022
8878 15163022 15204150 14744697 14194508 14112420 13840905 13655866 13844943 13634972 13446259 13238399
8868 13238399 13219847 12925440 12735405 12639408 12370326 12356515 11987046 11918934 11975169 11742794
8858 11742794 11748836 11812193 11805137 11760724 11879636 11535796 11422663 11744859 11338595 11268234 11339940
8847 11339940 11469074 11191068 11024363 10864230 10884321 10798411 11131731 10925025 10518590 10520958
8837 10520958 10684193 10493337 10361640 10319025 10297287 10240329 10137134 10210663 10162949 9674908
8827 9674908 9753554 9682691 9764792 9893276 9718623 9518928 9883877 10043965 10050756 9949950
8817 9949950 9898885 9969046 9739704 9614923 9806322 9825223 9785528 9454621 9146666 9111375
8807 9111375 9110131 9220406 9269675 9094471 9265399 9405706 9090265 9205619 9335964 9376743
8797 9376743 9522808 9300651 9276693 9251928 9541013 9741572 9640364 9659742 9541614 9915844
8787 9915844 9940877 10040275 10021449 9953871 10350047 10463034 10559162 10803858 10702946 10945508
8777 10945508 11184402 11181476 11281903 11625161 11651889 11686843 11800986 12136229 12110450 12272008
8767 12272008 12646039 12998092 13088608 13569125 14257586 14926550 15615018 16696563 17693766
8758 17693766 18828786 19648753 20338692 20731038 21339895 21403937 20889037 20647581 20520303
8749 20520303 20441396 20477829 20379877 20204204 20133508 19895104 19711065 19439677 19434242 19193208
8739 19193208 18947713 18587701 18134532 18233144 18008402 17596970 17667842 17896070 18029677 18063883
8729 18063883 17900784 18429652 18861419 19402790 19958090 20665837 21496578 21975882 22617950
8720 22617950 23363355 23918188 24487925 25122850 25449697 25768113 25418487 24916827 24377629
8711 24377629 23971318 23256108 23134206 23060116 22665363 22762007 22756593 22377098 22238232 21992562
8701 21992562 21605780 21458875 21000717 20720444 20340304 19679556 19488535 19348715 18971393
8692 18971393 18542998 18316760 18552538 18255907 17994385 17957176 17578374 17485068 17821413 18011302
8682 18011302 17929580 17878875 17689749 17334302 16781774 16389097 16166701 16041179 15970022 15768127
8672 15768127 15472638 14859047 14576783 14550996 14421377 14057320 14077601 13989645 14087547 14042824
8662 14042824 13818899 13622198 13437664 13398684 13225881 13097058 12831738 12836595 12620552 12262285
8652 12262285 12046588 11707491 11429866 10980371 11016019 10763155 10527647 10386774 10006830 9921797
8642 9921797 10070616 10056929 9750779 9624343 9319750 9082339 8768993 8947346 8852328 8662694
8632 8662694 8550347 8417133 8134956 7799535 7569496 7626640 7801176 7851434 7697031 7702534
8622 7702534 7501763 7211510 7119618 7195317 7272880 7316056 7392770 7074678 6934812 7031407 7058561
8611 7058561 6691479 6550528 6609190 6551441 6743209 6482427 6362124 6368802 6221517 6244679
8601 6244679 6454680 6261621 6433193 6197856 6180390 6088741 6138794 6455913 6562858 6478041
8591 6478041 6203927 6156849 6573208 6800713 6479040 6427646 6506933 6803190 6828161 6553612
8581 6553612 6201954 6471127 6230929 6899458 7154979 6748147 6878202 6896344 7100615 6992032
8571 6992032 7242983 7263453 6956878 6449246 6492621 6674312 6644015 6513340 6311017 6322411
8561 6322411 6565647 6556451 6204599 6179632 6261116 6295770 6360643 6522030 6776609 6653943 6561258
8550 6561258 6413973 6496525 6627258 6645606 6720819 6670546 6925651 7057944 6940017 6892364
8540 6892364 7035506 6925307 6900372 6792303 6702365 6892063 6614392 6673240 6911837 7053447
8530 7053447 6959033 6852826 6836555 6795683 6683412 6799766 6783720 6738034 6809145 6909269 6732113
8519 6732113 6806606 6855338 6757494 6976179 6843478 6794284 6450428 6349011 6442856 6825342
8509 6825342 6721199 6809368 6536251 6410714 6264990 6275239 6431158 6289782 6035360 6213278
8499 6213278 6305508 6297103 6390153 6310300 6533212 6641392 6238168 6251452 6481905 6208112 5832833
8488 5832833 5950015 5996577 6289744 6378324 6455794 6546074 6681898 6562851 6181820 6037714
8478 6037714 6087466 6099636 5955427 6289848 6142383 5801661 5817157 5706353 5943864 5565244
8468 5565244 5335829 5298693 5183123 4886693 4876786 5137096 5071014 4951808 4598584 4853912
8458 4853912 5123224 5091389 4860171 5012675 5274449 5083951 5067769 5271301 5461899 5783896
8448 5783896 6217415 5926602 5514003 5715461 5461161 5518721 5245779 5277104 5251631 5114265
8438 5114265 4908195 4764257 4984928 4927503 4803384 4598519 4424548 4440615 4482773 4470570
8428 4470570 4542585 4510134 4318258 4518005 4364160 4369255 4857793 5020006 5217194 5111825
8418 5111825 4855088 4935979 5164846 5101274 5029754 5062402 5391142 5660337 5593259 5867122
8408 5867122 6492347 6887049 6740406 6317916 6227399 6097295 5787258 5975961 5630535 5246258
8398 5246258 5228224 5207531 5158115 4976706 4426182 4801139 4743238 4778926 4681246 4546091 4505564
8387 4505564 4349706 4585126 4685716 4743821 4870617 4865336 4765438 4710323 4629484 4490880 4795061
8376 4795061 5181750 5049161 4902857 5216030 5518784 5394214 5376969 6196360 6323994 6166029
8366 6166029 6146277 5948900 5631678 5246273 4782043 4321831 4333959 4162807 4349846 4413809
8356 4413809 4366552 4497633 4169055 4075515 4330503 4175207 4213796 4037665 4181928 4064937
8346 4064937 4056992 3915079 3673517 3613063 3862978 3916974 3769168 3769691 3880976 3683112 3431758
8335 3431758 3239752 3376287 3214268 3230411 3343447 3400452 3556933 3294366 3391334 3217049
8325 3217049 3297649 3585637 3544768 3439349 3494607 3653280 3322249 3261590 3241209 3180754 3359294
8314 3359294 3363213 3159074 3409829 3434218 3225189 3364810 3423843 3334345 3352690 3058408 3188462
8303 3188462 3351953 3316928 3162060 3025519 3069611 2818568 2881890 2850740 2662806 2609080
8293 2609080 2691120 2369586 2209471 2322689 2413601 2449493 2418687 2557146 2344171 2166429
8283 2166429 2251259 2198394 2343459 2434413 2550850 2491345 2419230 2335561 2184447 2272398 2307726
8272 2307726 2156092 2126863 1781408 1900360 1938861 1996711 1883003 1688376 1525648 1967053
8262 1967053 1976391 2029368 2342964 2156255 2283826 2231761 2260446 2211847 1906795 1857244 2143098
8251 2143098 2030447 2226101 2263299 2252198 2250359 2409313 2604758 2287398 1711021 1796398
8241 1796398 2094461 2247824 2167419 2133334 1908383 1850289 2086164 1991665 2039220 2007798 1948221
8230 1948221 2056105 2002778 1775757 1657414 1594207 1644935 1675213 1824357 1747803 1928832
8220 1928832 1945925 1687498 2101860 2206573 2419004 2581725 2569142 2447221 2227620 2163679
8210 2163679 2097036 1791985 1788961 1597046 1569024 1555382 1591599 1573531 1439484 1497234 1589975
8199 1589975 1508087 1721336 1710654 1641246 1496930 1521772 984900 726862 1573835 1452868
8189 1452868 1898043 1746247 2052330 1972162 1816125 1700259 1663544 1595759 1740315 2019807
8179 2019807 1742043 1449054 1660996 1595684 1570790 1479626 1149370 1433823 1488805 1685154
8169 1685154 1981964 1983725 1909957 1780643 1515641 1519401 1341341 1548909 1651679 1846893
8159 1846893 1937716 2012363 1934127 1695764 1609827 1589146 1587068 1401182 1392005 1582720 1705554
8148 1705554 1194021 1299235 1345519 1309992 1252421 1217976 1291866 1001431 917305 1124669 1509934
8137 1509934 1241830 985378 991334 1311987 1319564 1159745 901618 876492 1131840 1165866 1313820
8126 1313820 1295303 1191427 1177362 1139661 1075029 1061218 1188397 1454757 1392751 1184957 1223110
8115 1223110 1130008 1051712 881736 1196405 1358087 1204995 1362611 1376776 1115704 1127869
8105 1127869 1596963 1580904 1354452 1383872 1423392 1201601 1350812 1279931 1016192 1054809
8095 1054809 1280943 1238054 1500238 1405223 1279100 1176799 1159300 1310583 1138281 1129553
8085 1129553 1434606 1372213 1421234 1578064 1181700 1274703 1341678 1384113 1239486 1356409
8075 1356409 1278760 1061889 1278365 1081993 1166374 1293996 1431108 1668948 1420516 1283204
8065 1283204 1212658 1231906 1244235 1204194 1219065 1098700 1461135 1383006 1189042 1248599 1516193
8054 1516193 1433740 1235616 1411968 1353006 1392301 1238684 1595833 1292661 1425133 1654027
8044 1654027 1557241 1572017 1431896 1510055 1479225 1605053 1343893 1269788 1322335 1002636 1053574
8033 1053574 1221499 1209162 1308449 1231469 1341822 1355096 1348935 1151150 984833 999157 1184339
8022 1184339 1102072 806381 1232378 1289354 1229550 980383 848522 734899 1009742 863730
8012 863730 792031 967845 665788 898769 1225236 1148014 1007817 921052 958592 884408 1211244
8001 1211244 1199524 930806 636106 760175 1040356 1036263 1111917 856690 570087 675509
7991 675509 909308 829852 700839 670301 718951 383078 571946 599991 536098 549239 749432
7980 749432 767972 546285 484312 649878 672455 730484 1087867 735941 638183 1032151 956048
7969 956048 879483 775098 662524 679207 521250 444280 528118 507324 705337 537313 529042
7958 529042 883294 839584 507375 455520 679308 900996 783530 402700 722303 771258
7948 771258 590752 710509 756430 622098 541672 482336 546751 523101 706970 575275 516607
7937 516607 680389 740247 804531 628974 771972 798258 475230 468303 538655 244473 337126
7926 337126 693842 607346 632008 672124 893733 1037256 912704 793315 585094 694616
7916 694616 516019 637989 738728 481811 580252 663515 591273 566434 932963 697162
7906 697162 646793 769983 735553 1052805 852233 460120 454302 521597 396959 361355 416750
7895 416750 583696 358373 586706 363936 110451 70390 362043 414700 370494 490692
7885 490692 475016 457034 575317 736474 528153 607701 739071 404699 425718 511571 589603
7874 589603 664711 690828 826411 853669 791999 894270 713264 488394 539719 511905 305980
7863 305980 332250 489734 583961 484686 349804 473527 555068 393145 229265 416013
7853 416013 487619 650852 625458 902301 780788 481733 478460 271107 454285 848509
7843 848509 804089 529576 373113 461113 341195 166615 197065 87381 125879 486136
7833 486136 220656 262452 160324 269371 566823 212355 235077 259677 200315 112704 144505
7822 144505 241392 157287 467932 289185 233989 146312 325481 473784 723114 562338
7812 562338 376809 402185 314419 286044 321077 114064 -374936 283917 316914 244607 125131
7801 125131 358580 221192 120747 26167 301727 377738 536027 623683 377789 394516
7791 394516 484788 423285 209587 406450 414571 331319 433887 441333 211508 463475 576944
7780 576944 585178 310041 362691 399901 671177 584759 363752 337503 268820 193492 190140
7769 190140 343963 558663 316730 342606 221102 61768 119166 191095 -82571 -43188
7759 -43188 164412 367771 547828 277927 5824 179906 88208 165182 355845 568851
7749 568851 514065 442251 512646 430391 501486 251277 593443 557802 491052 643647 353255
7738 353255 432829 432351 104279 99595 74300 148286 197994 204515 290681 204018 192765 455347
7726 455347 337003 345574 213536 179676 147114 -69771 242224 548451 664043 576385 211422
7715 211422 157965 180765 199075 332921 109179 133884 221571 -49905 245174 276645 259269
7704 259269 140035 286960 219433 112523 -5480 -61988 -41905 77657 144415 213670 334524
7693 334524 474329 668381 557308 763485 536579 326179 433717 260413 586638 683129
7683 683129 695315 553958 480584 769234 614869 580742 755479 931690 955040 775076
7673 775076 830031 957054 762998 1016520 890521 624841 770667 925554 823673 786025
7663 786025 1012767 774324 607605 421368 541942 648827 818167 751801 468629 438570
7653 438570 548494 449986 441815 578599 384488 372671 828638 995477 882820 751592
7643 751592 822261 876364 1151737 1105149 1148517 1168128 927372 847962 604398 580128 694146
7632 694146 612162 572910 390949 319281 318929 121957 20952 314003 431462 517704 614960
7621 614960 499409 412229 472020 495277 159024 210211 296624 355862 49434 218935 420737
7610 420737 267388 296321 229310 107781 200873 354078 426536 395073 406365 359491 393658
7599 393658 441939 467075 563274 645934 584695 648083 493608 627637 784043 858204 643368
7588 643368 668749 461172 641999 568246 284425 333470 133822 6413 79520 534792
7578 534792 835303 885086 758846 515164 486215 693548 799667 433289 497720 504812 635724
7567 635724 532957 349659 537514 700706 595200 597316 623100 691046 643829 676309 705553
7556 705553 379497 780143 964079 690543 677821 711299 565801 677304 592866 189864
7546 189864 91711 275126 797257 814960 529528 359510 321974 374474 315946 189554 405702
7535 405702 413251 434191 361382 526535 802826 732303 564169 268173 306051 376685 542627
7524 542627 404359 292311 463554 417945 354218 396954 180648 117609 338199 286204 -24553
7513 -24553 276203 460247 126548 280314 487974 445351 498090 562676 477326 310528 510456
7502 510456 797216 953735 697379 696513 501016 678481 311064 141747 142450 275248 247988
7491 247988 235473 215088 424981 612039 425542 489933 694356 463641 280216 273854 508629
7480 508629 518650 653930 739169 413289 583909 493315 370171 417265 598682 548043 507722
7469 507722 637973 816737 593374 467800 636260 605656 765079 802435 615244 545922
7459 545922 707080 960516 1050326 873313 889673 933248 788983 973116 1227775 1256474
7449 1256474 1404200 1010240 1200382 1128498 944817 983711 837563 634189 632815 718347
7439 718347 537135 522796 680736 639178 462361 525489 558881 903264 936061 764195 765539
7428 765539 867489 800517 512135 539780 591429 728548 768585 735858 615016 670688 545106
7417 545106 627982 729744 727890 923616 1007085 932643 809604 740658 552870 830914 758956
7406 758956 939253 1158337 958073 763030 1106005 907671 1129320 1291266 1248289 1220958
7396 1220958 903115 1017332 1042354 820540 781060 593287 523602 708838 872717 728451
7386 728451 1079209 930967 649871 925674 1036313 671726 612560 490665 633555 474157
7376 474157 400995 546318 492619 798929 694432 560695 715864 477210 511034 305463
7366 305463 538872 601942 629092 617448 496989 505751 784647 715496 563364 559422 609365
7355 609365 733407 746070 552537 535128 662442 527698 744776 378229 284295 539958
7345 539958 658733 680054 602607 401367 566707 434493 483662 521613 355233 297921 706368
7334 706368 713451 333065 664328 841262 538085 550216 371757 519652 597786 678035 779769
7323 779769 1104508 1323725 1052407 850829 847227 782602 1069775 1016919 799529 624638
7313 624638 681470 752732 501385 601767 463106 541120 695497 300383 712642 831582
7303 831582 540718 440514 700881 871952 631155 841163 733135 683112 514490 310583
7293 310583 276292 564716 704931 448771 530024 512886 550730 908921 1113677 934823
7283 934823 658282 494501 646239 662822 378128 287672 409360 251654 448938 659644
7273 659644 799305 469160 408702 379523 471556 769261 862452 621776 408540 477111 584627
7262 584627 662839 665641 758493 595838 825657 892850 766366 478556 547918 433111 348759
7251 348759 592954 746666 715567 690190 917840 834330 795017 848949 929858 1038119 1027895
7240 1027895 835013 624062 741730 1071653 1009939 658264 572000 824296 835463 862022
7230 862022 679552 792569 929097 943980 1177649 1171664 1076507 1068214 1099040 1169733 980738
7219 980738 1067600 1087046 963544 1137647 1177676 1361169 1435745 1536556 1348901 1281682 1373439
7208 1373439 1634089 1326163 1307709 1522534 1714193 1699651 1602022 1478537 1468914 1381124 1595464
7197 1595464 1749770 1388673 1411423 1573799 1652529 1656101 1205393 1290240 1639194 1709156 1557026
7186 1557026 1542762 1449541 1487306 1401691 1442926 1461724 1668123 1492059 1405663 1664812 1502079
7175 1502079 1481589 1563334 1626445 1554632 1765115 1594307 1884774 1910725 1960421 2219705 2211142
7164 2211142 2204615 2184132 2062940 1901203 1937911 1690575 1921083 2211117 2164972 2162451 2122632
7153 2122632 2188474 1842112 1633922 1436724 1500773 1534892 1501995 1640663 1654752 1658351 1817152
7142 1817152 1659433 1565712 1516553 1313376 1190606 1385971 1615498 1814236 1789321 1754435
7132 1754435 1496048 1406522 1520121 1478874 1199784 1338364 1412073 1359803 1152077 1263255
7122 1263255 1151982 1057780 1259018 1088261 1182252 1259485 1302387 1170336 1014729 900327
7112 900327 1004748 960739 957294 920840 964647 1149311 1288599 1412760 1386958 1137815 1270253
7101 1270253 1070133 1237688 1722106 1687541 1228043 1434476 1409923 1049800 1051292 1196219
7091 1196219 1306105 1468102 1388069 1109769 1183730 1371786 1317565 1325158 1271656 1124693 1063572
7080 1063572 1232219 1097428 1105336 1354500 1170219 818670 899369 1085160 1124543 1035710
7070 1035710 717860 759530 1145687 1220155 899543 1014654 1034115 1181863 1374073 1003292
7060 1003292 1047903 959104 1225673 1350120 1331862 1439175 1201919 967709 1244324 1041578
7050 1041578 776677 1166742 1022925 1201369 1204440 1308271 932713 1026274 946245 700788
7040 700788 970773 956999 1097010 954710 864957 1144166 1037165 876950 654438 884164
7030 884164 992747 705674 720483 1047049 1116028 958741 1095123 980826 695387 823837
7020 823837 959015 1055795 684098 838556 742146 1033970 1189994 1227638 1116548 1127552
7010 1127552 1300928 1244785 1476259 1341629 1235074 1002250 936288 949523 1018967 990207
7000 990207 1104169 1121156 1149011 951492 664335 553754 899150 862477 1037507 1206344
6990 1206344 1053473 1017192 1238423 1226590 971147 990531 1065315 781379 877797 985409
6980 985409 649536 637527 788319 821471 859358 820393 721716 888967 964993 1288578 1238387
6969 1238387 1285250 1265706 1407791 1453516 1306560 1600966 1576835 1429198 1003883 771876
6959 771876 937595 1019105 1139260 1047035 1210147 1121440 1194402 945912 1203865 1220880 1065243
6948 1065243 1230779 1271525 1271493 1303216 1209119 1233533 1587487 1417250 1727544 1388298 1206718
6937 1206718 1237516 1327146 1281771 1298242 1181906 1025685 1169460 1327540 1181533 1291323
6927 1291323 1542181 1468565 1417735 1638727 1627436 1468805 1435667 1279314 1409771 1565400
6917 1565400 1497087 1818173 1724190 1515198 1267494 1410582 1512706 1510392 1605236 1824418
6907 1824418 1870531 1766264 1811317 1482018 1322277 1547828 1721037 1645916 1770547 1967907
6897 1967907 1970552 1864881 1605369 1395738 1590343 1924213 2013296 1577115 1397114 1488137
6887 1488137 1378521 1334395 1500603 1565070 1700919 1737525 1655739 1561622 1679976 1977538
6877 1977538 1781270 1700013 1539962 1776709 1719164 1757143 2115121 2023298 1949918 1718593
6867 1718593 1869287 1892298 2056064 2220503 2117735 2122498 2119331 2293545 2448776 2148310
6857 2148310 2078482 1959946 1929319 1883838 1768739 1874536 2105192 2348675 2177678 1886004
6847 1886004 2226017 2519515 2129302 2059669 1916699 2030899 2375899 2266987 2395701 2039911
6837 2039911 1930978 2208306 2206004 2205006 2198236 2007494 2005593 2369733 2531747 2132658 2266977
6826 2266977 2438691 2402702 2439520 2297787 2133672 1851985 1857746 2418404 2381130 2454443 2630713
6815 2630713 2682404 2817870 2561016 2582875 2624134 2728158 2527209 2461255 2603074 2581549
6805 2581549 2521131 2315735 2252882 2551506 2244038 2047000 2361651 2316731 2431661 2311820
6795 2311820 2275477 2565425 2471576 2577723 2446797 2335122 2482327 2519182 2491510 2451010
6785 2451010 2610554 2662256 2634987 2683339 2872839 2885430 2791301 2595822 2692509 2790385 2675674
6774 2675674 2567148 2516680 2669657 2867775 2942189 3055619 2974793 2992855 3117048 2599150
6764 2599150 2615112 2547563 2464167 2458837 2471951 2676928 2486469 2530332 2180392 2038802 2393969
6753 2393969 2256945 1973433 2203181 2495754 2094401 2250103 2380623 2360063 2292921 2445106
6743 2445106 2726101 2598630 2548337 2481511 2380670 2397862 2333652 1999616 2376119 2182887
6733 2182887 2252004 2243551 2325239 2291078 2107419 2255368 2177419 2229843 2128695 1832556 1965019
6722 1965019 2097821 2152812 2149782 2036757 2035406 2400789 2334163 2432790 2666629 2607295 2442677
6711 2442677 2491723 2574396 2520647 2665066 2488975 2343158 2176974 2500405 2563389 2541279
6701 2541279 2422931 2287308 2232217 1910613 2051069 2295191 2307134 2279244 2307504 2167887
6691 2167887 2169051 2364606 2458639 2415482 2043254 2223962 2057585 2336983 2480820 2505262
6681 2505262 2421937 2445396 2400654 2424982 2195390 2314158 2534118 2624258 2747593 2759000 2647065
6670 2647065 2770563 2600991 2553260 2702580 2964575 2840418 2843363 2712811 2316010 2473186
6660 2473186 2658110 2780688 2811374 2905201 3035387 3152973 3246280 3188189 3361672 3184458
6650 3184458 3107389 3126574 2809557 2914153 2873884 3132612 3089873 3066066 3113227 3216378 3272407
6639 3272407 3697407 3572264 3216248 3231925 3492307 3449335 3210553 3121350 3029885 2882631
6629 2882631 3020577 3290401 3504841 3686234 3697601 3646440 3247907 3056757 3268160 3347221
6619 3347221 3536870 3821227 3659442 3466928 3734382 3686558 3747932 3562896 3690708 3589049
6609 3589049 3298421 3087100 3154766 3306239 3284915 3138337 3155710 3379188 3371176 3330199 3283149
6598 3283149 3291070 3378978 3220174 3047292 3102544 3206619 3392250 3376998 3398066 3201047 3192360
6587 3192360 3493056 3494622 3389876 3634083 3817297 3718771 3823918 3817107 4009414 4154173
6577 4154173 4058901 4218655 4405739 4523847 4356750 4313123 4162687 3805583 3930841 4157313
6567 4157313 4013230 3809367 3599483 3256997 3326827 3356479 3280461 3527044 3725971 3739788
6557 3739788 3427355 3134863 3485959 3931926 3694089 3634487 3522442 3446476 3768837 3898867
6547 3898867 3821620 3873836 3859883 3581625 3674487 3711746 3830252 4011377 3776337 3683458 3803747
6536 3803747 3833278 3895927 3974067 3778610 3997109 4030753 3800561 3784224 4003250 4194788
6526 4194788 4293392 4132367 4207547 4284139 3879102 3935213 3811448 4001451 4025696 4077044 4203631
6515 4203631 4106090 4323590 4285900 4078636 4368387 4496691 4538364 4556609 4462704 4347168
6505 4347168 4290928 4278186 4695842 4795912 4764136 4815476 4667749 4821394 4753772 4864584
6495 4864584 4476491 4378495 4628848 4548318 4562154 4623089 4750156 4739044 4871726 4886692 4727525
6484 4727525 4979218 4885148 4984130 5069002 5053010 5157593 5215375 5308155 5227473 5010985 5298031
6473 5298031 5576349 5665486 5809142 5619149 5530378 5963394 6133008 5953797 5878496 5837701
6463 5837701 5772155 5936850 5884725 5728657 5447240 5786716 6129385 6414046 6376981 6364122
6453 6364122 6377965 6535679 6998741 6970765 6999568 7253835 7189852 7172212 7045522 7152846
6443 7152846 7209974 7130754 7145457 7120164 7339845 7465357 7591931 7761611 7971974 7939393
6433 7939393 8448913 8522569 8123615 8129204 8339903 8623481 8640293 8787938 8892104 8658387
6423 8658387 8640126 8675880 8645533 8471415 8733078 8785073 8721058 9076424 9171130 9021585 8803968
6412 8803968 8980335 9036647 9251925 9451862 9493740 9723457 9698628 9731312 9832737 9562859
6402 9562859 9520311 9582592 9620669 9726321 9580248 9661143 9537272 9785235 10032303 10188852
6392 10188852 9936433 9848812 10068938 10238557 10226257 10205970 10207817 10414503 9995450 9983233
6382 9983233 10101513 10172568 10403917 10713126 10685910 10734201 11015807 11021734 11054331 11407232 11663746
6371 11663746 11653270 11898935 12055016 12126548 12070088 12175790 12236706 12371837 12399041 12524522
6361 12524522 12580837 12693175 12897593 13085780 13277079 13461112 13573306 14247957 14703625 15150896
6351 15150896 15438366 15593279 15771846 16001273 16188287 15920321 16119439 16330304 16498225
6342 16498225 17004969 17216550 17623934 17774127 18301687 18953837 19195567 19569089 20107727
6333 20107727 20967263 21614057 22385831 22988643 24104550 25073406 25802007 26770876 28240383
6324 28240383 29713688 32016530 35563424 41784714 52846989 66932925 78452774 82540037
6316 82540037 78879197 70473755 61375139 54220235 49611148 46995359 46138213 48071589
6308 48071589 53410586 61123840 67215865 68860533 66903041 63296524 62650241 66725087
6300 66725087 74790577 84691517 91157837 91041283 85147076 76265597 67574429 61603213
6292 61603213 59606961 62599602 68368780 72027397 71039963 65932526 58995714 52993042
6284 52993042 49354070 48099662 49094927 54215265 65019256 79155935 90344088 92222778
6276 92222778 85684851 73335701 61180828 51046575 43570554 37903297 33718945 30543322
6268 30543322 27951879 26312515 25188005 24237174 23314173 22757879 22289998 22119969 21811434
6259 21811434 21578952 21108609 20897734 20502614 20187767 19652645 18784683 18466316 18421258 18382697
6249 18382697 18129062 18069023 17503119 17383373 17530539 16950644 16522293 16496760 16239059 15834750
6239 15834750 15796273 15551061 15599531 15573168 15178168 14938457 14741602 14625358 14472698 14478711
6229 14478711 14382027 14279980 14411194 14158333 13857357 13841736 13620483 13071947 12833430 12474198
6219 12474198 12266743 12068908 12143315 12057637 11874488 11537889 11291721 11090402 11170065 11017620
6209 11017620 11115335 11001138 10795972 10555690 10814012 10930591 10603095 10600957 10243115 9973738
6199 9973738 10106442 10064369 9881591 9869590 10018414 10133253 10304540 10051393 9991587 9733249
6189 9733249 9577660 9673288 9337434 9138614 9427797 9171940 9185482 9073231 9096910 9145889
6179 9145889 8982890 8983017 8576580 8777949 8797252 8343239 8213424 8416819 8133425 8031877
6169 8031877 7696056 7922441 8020100 8350671 8463212 8321647 8202651 7990474 8080570 8139312
6159 8139312 8196121 8330401 7907213 7755378 7699754 7777456 7744142 7721243 7713850 7746401 7648203
6148 7648203 7347502 7328937 7621802 7627769 7732042 7527061 7630055 7549551 7415809 7126751
6138 7126751 6905709 6692777 6824585 6760256 6569466 6868698 6833336 6609556 6420172 6630080
6128 6630080 6748903 6848766 6973162 7179148 6994451 6770218 6457083 6532389 6666218 6615944
6118 6615944 6736082 6651820 6901775 6926587 6752231 6728946 6935235 6703049 6637035 6751818
6108 6751818 6835317 6933329 7008336 7007828 6967150 7024849 6695072 6768572 6470978 6359163 6154512
6097 6154512 6096572 6249586 6394120 6268157 6095603 6088055 6270319 5723258 5801093 5970425
6087 5970425 5847028 5694449 5779706 5858446 5985294 5805612 5939274 5947198 6042441 5886065
6077 5886065 5919794 6040665 5921968 5828788 5669254 5777412 5704640 5449824 5078687 5307184
6067 5307184 5416443 5407907 5310319 5499317 5565666 5591301 5885741 5940818 5569102 5281520 5457234
6056 5457234 5456750 5303693 5018307 4993240 5273525 5085107 5324023 5371015 5073658 5424735
6046 5424735 5387015 5279265 5096002 5114140 4835087 4750771 4818744 4857861 4914562 4967609 5196819
6035 5196819 5138117 5097308 4994399 4846495 4692059 4943485 5185066 5139843 5161016 5158224 5206709
6024 5206709 5479498 5497174 5354471 5593916 5573089 5118181 4820043 4905085 5039411 4894738
6014 4894738 4713845 4654996 4732654 4930109 5098540 4862688 4771181 4819686 4774418 4611739
6004 4611739 4812743 5050890 5144112 4981424 4842361 4766452 4662060 4675916 4885396 4901217
5994 4901217 5156244 4992062 4948645 4961591 4878362 4755082 4833552 4951346 5036851 4856344
5984 4856344 4638362 4328307 4242400 4447121 4624127 4771888 4938672 5194405 5208863 4910211
5974 4910211 4619014 4917321 5247563 5161002 5034741 4782707 5053696 5025161 4923533 5266052
5964 5266052 5244300 4867628 5035696 5015268 5270112 5177610 4918364 4972354 5146930 5257070
5954 5257070 5133426 5209722 5067541 4825561 4892780 5028344 5034821 4866768 5036566 4953325
5944 4953325 4916828 4806886 4928919 4970302 5049417 5432685 5361598 5242392 5322029 5428028
5934 5428028 5292091 5229674 5379871 5330179 5155451 5012799 4933568 5029137 4739307 4805323
5924 4805323 4874854 5163380 5049250 5090196 4933974 5011145 5229521 5168516 4811725 4909761
5914 4909761 4869050 5097714 5294775 5308607 5314146 5316860 5460262 5267801 5171352 5472159 5190234
5903 5190234 5119310 5593839 5652460 5697778 5604604 5528853 5754694 5708750 5692048 5532095 5790218
5892 5790218 5626995 5513395 5588136 5739177 5976093 6215464 5960511 5857365 6050608 6140642
5882 6140642 6262630 6530414 6538615 6488799 6425062 6498689 6572694 6623516 6622090 6491011 6337209
5871 6337209 6617725 6880986 6817488 6939425 7116852 7108165 7056500 7094516 7551115 7807000
5861 7807000 7980467 8313730 8204841 8266371 8082154 8034221 8144614 8095852 8181584 8211130
5851 8211130 8274893 8281826 8302850 8608822 8900931 9306979 9593536 9881224 10482865 10469469
5841 10469469 10500829 10897531 11187537 11116883 11009313 11122812 10945979 10879380 10994877 11270230
5831 11270230 11281862 11532880 11668923 11988255 12020786 12124326 12387131 12634915 13136966 13571647
5821 13571647 13927059 14146484 14398345 14727156 14329080 14472158 14623078 14893450 15107280
5812 15107280 15386625 15701534 15787408 15711461 15761732 16088036 16157312 16477989 17072275 17495039
5802 17495039 17789975 18489049 19252434 19370336 19716831 20149625 21015957 21810610 23012497
5793 23012497 24388387 26163884 27978023 29604673 31290148 34543017 40385316 50883191
5785 50883191 65922742 81106334 89656070 88819047 80467351 69285574 59884614 52637196
5777 52637196 48044749 46234885 48340733 54100341 61829707 67293999 67755738 64437484
5769 64437484 59122113 55644966 55993639 60682292 69947383 80456634 87546720 88119058
5761 88119058 82266599 73479080 66090966 62506035 63674156 67247523 68440737 65644823
5753 65644823 59897231 53341207 48426300 45136488 43458964 43757405 46562217 53711444
5745 53711444 64612074 75476240 80781530 78059708 69400081 58317260 48767826 41685047
5737 41685047 36190432 32077631 29416945 27634759 26528736 25701038 24996721 24145619 23345770
5728 23345770 22596574 21997162 21251696 20678735 20595485 20454527 19909500 19496902 19412994 19721324
5718 19721324 19412078 19435972 19532700 19715548 19691139 19416161 18972209 18898916 18651042 18456201
5708 18456201 18399562 18317616 18160706 18391916 18809288 19266635 20421440 21665619 22098671
5699 22098671 21641364 20698601 20070474 19544277 19011790 18146283 17673355 17537219 17427522
5690 17427522 17028410 16626694 16530518 16367993 16488702 16392968 16343586 16264250 16182345 16041783
5680 16041783 15972694 15716842 15846721 16100142 16378275 16533425 16510391 16463635 16691341 17136225
5670 17136225 17927642 18777191 18815509 18127627 17281563 16048505 15335321 14954713 14385198
5661 14385198 13915940 13881043 13906689 14047130 13565698 13598416 13327875 13096621 13077653 12608141
5651 12608141 12446551 12377315 12319202 12253008 12134321 12174384 12064498 11999251 12183889 12258589
5641 12258589 12572116 12551956 12981266 13578674 13772707 13405257 12770593 12529440 12178966 11931468
5631 11931468 11771146 11740528 11565962 11013451 10797513 10628802 10492563 10434758 10526526 10463149
5621 10463149 10178654 9827549 10035077 10172747 10089991 10108002 9910776 9441635 9480206 9674169
5611 9674169 9887793 9873134 9820123 9845913 9785314 9477489 9237138 8876366 8590228 8870216
5601 8870216 9112750 8976146 8692217 8660504 8443107 8443161 8763221 8917058 8826931 8894027 8718957
5590 8718957 8381930 8395931 8348239 8146434 8201724 8048396 8067013 7881758 8025669 8010293
5580 8010293 8076528 8163530 7846396 8312340 8201105 8066013 7814213 7764001 7884357 7696077
5570 7696077 7531926 7582537 7621245 7539323 7416442 7370192 7457564 7432401 7788940 7833229 7644767
5559 7644767 7704740 7735855 7682005 8057785 7831195 7726521 7940324 8170959 8309435 8389216
5549 8389216 8205138 8291638 8228714 8062942 8100324 8155412 8397614 8430306 8767308 8805306 8885287
5538 8885287 9089921 8996785 8871544 8585337 8361946 8473936 8218608 8161640 8289219 8265348
5528 8265348 8597421 8581238 8505425 8324313 8353582 8268725 8359525 8708656 8940196 9241501
5518 9241501 9348341 9091026 9033919 8562427 8347392 8236001 8145186 8063684 8174376 8239281
5508 8239281 8343838 8163634 8252443 8522648 8420867 7981727 7581875 7442045 7270514 7414536
5498 7414536 7303674 7322859 7224618 7288894 7244654 7387729 7433372 7471843 7348397 6962424 6980195
5487 6980195 7162791 7056704 6953522 6615059 6808193 7222887 7343656 7345471 7484411 7217280
5477 7217280 6771584 7062748 7468542 7136690 7099525 7315767 7282904 7338295 7602636 7731234
5467 7731234 8040895 8628014 9095404 9305202 9073618 8709598 8464368 8128935 8265956 8404141
5457 8404141 8419982 8430699 8490667 8645699 8868123 8993527 9365417 9614508 9981393 10205135
5447 10205135 10116736 9811120 9549177 9408838 9123292 9185565 8998500 8606149 8511340 8400224
5437 8400224 8133780 7972903 7990523 7967208 7934561 7691829 7775323 7841115 7804067 8122700 8300449
5426 8300449 8122547 8065973 8162194 8525650 9094499 9124242 8762847 8502466 8187766 7908129
5416 7908129 7668274 7579833 7347985 7008526 6935688 6893800 7096527 7175079 7440500 7584774
5406 7584774 8204983 8671036 9527752 10659798 11128142 11364783 10866232 10292058 9701737
5397 9701737 9012725 8311153 7827738 7600763 7456744 7254873 6948997 6868715 6940946 7048240
5387 7048240 6903596 6948659 7191272 7591275 7569412 7785117 8091082 8473951 8953069 9147973
5377 9147973 9272969 9242401 9029622 8417418 7698060 7439199 7254297 7095440 7234127 7132781
5367 7132781 6955464 6785665 6848109 6577053 6423721 6544555 6300819 6437636 6478825 6310506
5357 6310506 6050740 5930594 6006541 6004333 6117561 6010184 5807914 5881860 6240232 6237383 6032295
5346 6032295 6260622 6243996 6194013 6386104 6345875 6336924 6390420 6426402 6410773 6695512 6641510
5335 6641510 6655501 6668570 6558923 6795830 6743083 6977876 7385087 7748605 8210505 8898239
5325 8898239 9131790 9141037 9300356 9726884 9498842 9124973 8808393 8440567 7788292 7656339
5315 7656339 7544959 7579034 7744040 7919289 7800159 7714893 7869674 7835135 7895435 7983717
5305 7983717 8285169 8801497 9683132 11054923 12629816 13458067 13828337 14316794 14432951
5296 14432951 14282166 13794287 12829110 11876502 11159488 11094820 11377103 11990030 12134062 12103301
5286 12103301 11864606 11324724 10838789 10960981 11223890 11937920 13217877 14000886 14167921
5277 14167921 14911783 15990875 17844273 20124676 22028986 23333535 23865701 23252095 22338646
5268 22338646 21868844 22077999 22839910 23868403 24244920 23761810 22622574 20614864 18565237
5259 18565237 16999062 15920836 14703463 13827914 12706797 11946074 11415870 11249520 11266486
5250 11266486 11700491 12825284 14053972 14953072 15125291 14313138 13339234 12046467 11289738
5241 11289738 11339967 11381963 11500198 11618070 11358470 10660110 10404497 10488651 10770007 10650432
5231 10650432 10203883 9833758 9363430 9110681 8791456 8957791 9327095 9488208 9778246
5222 9778246 9949299 10221343 10006445 9477091 9166485 8814388 8531296 8494138 8542921 8114018
5212 8114018 7955496 8154627 8159322 8076450 8061371 8050281 8171875 8547183 8617914 8767866 9139994
5201 9139994 8979464 8675112 8599053 8478595 8495289 8379754 8701252 8654080 8669759 8799807
5191 8799807 8862887 8924696 9073712 9123554 9346574 9108236 9150731 9063574 9286298 9577028
5181 9577028 9680595 9542429 9502733 9638041 9767066 9746093 9818958 9938679 10117496 10341054
5171 10341054 10498283 10895955 10647052 10443900 11077259 11439267 11601388 11534378 11568156 11851716
5161 11851716 11734017 11788647 12474102 12735339 12940548 12954436 13476244 13712147 14340059 14642742
5151 14642742 15218628 16209836 17277793 18105911 18736896 19506716 20357603 21405679 22929914
5142 22929914 24078841 24694802 24224199 23542098 22843129 22662844 22533018 22345139 22473463
5133 22473463 22879078 23672568 24376219 25485504 26609692 27106485 27730105 28730393 29512910
5124 29512910 31159616 32950402 35175879 38080376 41671483 46641773 52410615 58517513
5116 58517513 64611288 70517585 77144743 86864034 105663960 144971883 224603423 338544232
5108 338544232 437083749 459965354 420278783 336181073 253090279 197114087 156702566
5101 156702566 127807310 104752652 87751806 74955018 65855274 58292045 53033098
5094 53033098 48997464 46269236 43930210 42883331 42272282 42716210 43738486 44756039
5086 44756039 44070896 42214118 39468293 37538984 35893883 34845789 34113038 34179430 33838095
5077 33838095 33463927 33208248 33151850 33357208 34828059 37150429 39157660 39667200 39851174
5068 39851174 39373319 38554568 36933067 35097364 33157213 31821108 30510151 29794720 29551803
5059 29551803 30367808 31947281 33935847 35311004 35143040 34051342 32876915 32317844 33395831
5050 33395831 34911984 35977855 36240889 35682354 34442486 33528894 32510093 31617602 30267936
5041 30267936 28897691 27835402 27169457 26542744 26465647 27686541 29682377 31720405 33200256
5032 33200256 33601429 33033508 33000993 33994932 35411305 35980742 34955019 33858562 33151867
5023 33151867 32822212 32731244 33019299 33805375 34486952 35566559 36566722 37390719 37959946
5014 37959946 37730754 37544992 37353379 37152242 36676887 36295614 36481387 37277447 37931137
5005 37931137 38053355 38050121 37963258 38422399 39493041 40826416 42354356 43707518 44585659
4996 44585659 44766206 44694975 44212444 43291198 41887697 40584342 39110550 37624485 36369544
4987 36369544 35125931 34242537 33794183 34000069 34473452 34800519 35058784 35878052 36459198
4978 36459198 37122039 37508455 37852876 37947330 38009314 38081169 38062716 38068783 38449117 38553002
4968 38553002 38740175 39270847 39902887 40324799 40522300 41223681 41035807 40775102 41072948
4959 41072948 40972841 40962653 40887057 41238048 41535182 42556645 43200311 43881405 44470693 45564604
4949 45564604 47242734 49045804 51066255 52954381 54493328 55188690 54701561 53379737
4941 53379737 51397169 48969670 46386542 44140250 42141469 40662987 38903903 37519039
4933 37519039 36940821 36246213 35840602 36072400 36258184 36483846 36275884 35668827 35431465
4924 35431465 34679926 33618929 32439550 30835459 29854398 28445682 27092112 25951725
4916 25951725 24781300 24051402 22888646 22011803 21299688 20589764 20063680 19852399 19659343
4907 19659343 19225078 18894961 18795228 18585905 18158891 17811538 17669450 17549974 17338532 17306836
4897 17306836 16912455 16932645 16838703 16724308 16593037 16807779 16572578 16717601 17114299 16920612
4887 16920612 16927733 17160241 17255422 17021774 17228917 17154301 16823638 16346416 16158821 16030812
4877 16030812 16124813 16259016 16057210 15566471 15492420 15596239 15682216 15298228 15198527 15401655
4867 15401655 15643733 15432999 15347509 15389296 15480366 15433506 15336099 15249725 15243737 15320279 15100520
4856 15100520 15089453 15146158 15111767 15131787 15102415 15273517 15497733 15650657 15658385 15855600 15813224
4845 15813224 15883864 16004177 16220369 16619473 16760527 16963382 17286021 17516902 17879968 18134759
4835 18134759 18587215 19074719 19296891 19537788 19917626 20091950 20318781 20783240 20883323
4826 20883323 20452250 20840246 21470050 22136387 23258029 24234122 25156556 25771702 25824645
4817 25824645 25572737 25075082 24769409 24248791 24140374 24128396 24291082 24524219 25553999
4808 25553999 26998241 28757325 30697005 31973276 32004459 30671408 29359623 28196710
4800 28196710 27471260 27280762 27366695 27858351 29416193 31346495 33542490 35947282 37872714
4791 37872714 39255954 39623847 38670973 36966295 34823710 32624671 30350225 28372910
4783 28372910 26714058 25630321 24773259 23791929 23071534 22585228 22197055 22150415 22116987
4774 22116987 22506741 22903555 23434765 24182952 25270288 26691740 27994096 29043432 30297746
4765 30297746 31291804 32240232 32535631 32560608 31858924 30771379 29957074 28906499 27565575
4756 27565575 26509505 26098442 25683947 25457313 25605021 25585467 25804263 26230914 26711943
4747 26711943 27815470 28554844 28918815 29056711 28941909 28478719 28329576 28284261 28125032
4738 28125032 27817856 27726108 28005013 28004907 27818923 27913651 28078787 28043163 28123111 28508552 29335393
4727 29335393 30090676 30755706 31372750 32170270 33212296 34924914 37231455 40411217 43140497
4718 43140497 45382462 46391978 46640689 46697423 46807419 47124204 48560615 50954774 54403518
4709 54403518 57406950 58859575 58214988 56774797 55260891 54372091 54041817 54601190 56136769
4700 56136769 59024176 62818351 67897479 75350542 88129485 113912358 151299922 182242852
4692 182242852 186388465 170997355 140768439 113009347 95354299 81987580 71636092
4685 71636092 63091910 56585670 51696843 48315401 45921628 44362799 43174156 42573729
4677 42573729 42258990 42685818 43152692 44075813 45280490 46487253 47363581 48624229 49670134
4668 49670134 50868412 52001355 53774844 55604405 57384468 59274666 61798898 64091573
4660 64091573 66467279 68802628 70775786 72618189 74043088 75186799 76113066 76771724
4652 76771724 77496955 77944742 78447234 78645359 78671349 77672531 76382012 74608609 72574229
4643 72574229 70320778 68240146 66693249 65643266 64550532 63318854 62559636 61697242
4635 61697242 60336644 58682318 57173065 55538000 54086170 52693987 51440893 50369448
4627 50369448 49674068 49059908 49201602 49670238 50207012 50888047 51929258 52571908 53399613
4618 53399613 54580890 55927952 57412560 58816328 60269185 61891647 63177898 64372154
4610 64372154 65342372 65640152 65575513 65244740 64752703 64639251 64511188 64536041 65189976 65823718
4600 65823718 67196772 69247968 71555805 73710671 75941173 77325632 77896598 77241678
4592 77241678 75600980 73462712 70735620 67447843 64241944 61371611 58778972 56231246
4584 56231246 54318975 53070608 51960816 51611473 51425461 51550209 51654411 52079969 52728600
4575 52728600 53138186 54062408 54867048 55882504 57095995 58088926 58902252 60398674 62073443
4566 62073443 62927458 63207412 62692835 61401525 59715255 57832023 56096530 55054120 53912255
4557 53912255 53163763 52517765 52667494 52645161 52905363 53384425 54207415 55015825 55962232 57122362
4547 57122362 58778234 60566574 62883707 65854421 69140442 72767195 77183444 81999780
4539 81999780 87336918 92913643 99242859 107008557 115833173 126215449 139760833 158930592
4531 158930592 187969087 229376966 276893884 314031193 324244967 307076634 271311133
4524 271311133 231048751 195885935 168183665 146837028 130414118 118358860 110032297
4517 110032297 103867692 99474448 95780632 92465238 89455791 86970895 84987716 83495791
4509 83495791 82028460 81225307 82781647 88636514 99518120 111669372 117378362 114494764
4501 114494764 105252169 93664549 85023032 78484436 73658949 70481828 68147860 66699184
4493 66699184 66421962 66193590 65754520 65659099 65841637 66286450 66593514 67099440 67535334 67928314
4483 67928314 68831769 69489991 70121834 70877020 71769570 71881329 72396130 72935643 73511423
4474 73511423 74031855 74288003 74781366 75460739 76163439 77255255 79089088 81002679 82131783
4465 82131783 83418579 84570630 84974396 85675084 87100970 90530399 95714336 103006893
4457 103006893 111181187 115841283 115152045 109946964 101900632 93957300 87344065 82264996
4449 82264996 77907322 74458682 72189945 70659778 69283403 68038825 67271440 66360932
4441 66360932 65050240 64028424 63260004 62751685 62029688 61406734 61089969 61046202 60947361
4432 60947361 60726300 60521210 60514158 60076671 59712869 59319514 59079258 59031066 58665945 58113386
4422 58113386 57359689 56668979 55934469 55009733 54502526 54236678 53995213 54149686 54530820
4413 54530820 54851421 55194398 55498624 55357486 55000954 54228266 53588815 52782221 52014663
4404 52014663 51453208 51075556 51055303 51482826 51480354 50535211 49297083 47541580 46389283
4395 46389283 45081534 44041021 43458774 42971642 42300254 41989959 41913987 42142276 42274584
4386 42274584 42402553 42881307 43495470 44483874 45479293 46577711 47468605 48325214 49024812
4377 49024812 49747122 49987416 50320191 50049820 49270898 47969007 46122997 43973415 42181916
4368 42181916 40606809 39308543 38268262 37479736 36481887 36051361 35826330 35569839 35041914
4359 35041914 34793760 34782478 34478767 33846215 33560385 33575060 33342274 33149219 33107885 33144728
4349 33144728 33076770 33133659 33171021 33674748 34203072 34692618 35281911 35539802 35020287 34124510
4339 34124510 33175231 32322842 31233888 30494868 29747092 29386489 29048003 28853998 28778238
4330 28778238 28836434 28638315 28713199 28675210 28545583 28726471 28694619 28813069 28944765 28995171
4320 28995171 29018739 28911966 28918832 29080436 29304366 29757834 30148212 31015322 31970839 33201802
4310 33201802 34507047 36077674 37920803 40186245 43085044 46580311 49849511 52758091
4302 52758091 54407957 54935883 54492305 52764420 50583808 48401780 45886872 43150171
4294 43150171 40547024 38378744 36240251 34364601 32673648 31272204 29918375 29073028
4286 29073028 27918790 26694280 25766572 24805304 24213569 23118520 22670130 22334326 21924356
4277 21924356 21433301 20544647 20190079 19773800 19353376 19171610 18965801 18639481 18346863
4268 18346863 18137758 17876507 17587313 17200897 17282528 17227505 16737455 16390779 16075879 16160630
4258 16160630 16008716 15699491 15408488 15443064 15529354 15182033 14892331 15082451 14838053 14530162
4248 14530162 14746424 14705419 14956869 14645606 14390763 14366049 14185686 13852183 13844218 13583448
4238 13583448 13604299 13658302 13628294 13585777 13740558 13743114 13440606 13284131 13703256 13511160
4228 13511160 13130125 13531164 13839297 13670173 13778108 13804966 13691253 13564292 13331637 13086928
4218 13086928 12713990 12472900 12240230 12305099 12421534 12466755 12658780 12996603 13478523 13371451
4208 13371451 13004471 12589897 12579523 12485251 12581609 12582915 12204488 12270968 12100773 12182866 12336285
4197 12336285 12004550 11800826 11832017 11670512 11517432 11522377 11555501 11369566 11118516 11138392
4187 11138392 11102543 11159969 11355299 11433801 11459077 11074433 10957073 11284133 11517080 11477518
4177 11477518 11404765 11452865 11061559 11156472 11137930 10991483 10823930 10526800 10560607 10779124
4167 10779124 10837941 10821305 10730815 10516380 10840576 10753681 10750732 10515042 10500990 10482860 10609697
4156 10609697 10481897 10422736 10673814 10388661 10156248 10427989 10359957 10508223 10444670 10537542
4146 10537542 10598905 10421083 10448665 10393093 10518473 10715568 10698008 10361713 10015695 9875452
4136 9875452 10061585 10062356 10233144 9916966 9744938 9749600 9959042 10014474 9721336 9616427 9667455
4125 9667455 9809234 9598372 9707013 9593227 9589455 9517497 9610137 9832520 9603196 9692997
4115 9692997 9816630 9613806 9671272 9907673 9875241 9714148 9811956 9912361 9855400 9901764
4105 9901764 9929330 9898392 10024511 9686754 9548047 9502619 9343634 9520819 9613405 9749142
4095 9749142 9665886 9768098 9814342 9593278 9705353 9583142 9625318 9442088 9060399 8933372
4085 8933372 9024535 9047411 8775212 8961287 9274516 8907055 8837802 8963249 9004749 9187339
4075 9187339 8565776 8564180 8520505 8452057 8398587 8163808 8184182 8120997 8068532 7788869 7748787
4064 7748787 7902909 7715405 7721603 7750385 7653216 7408418 7237249 7342101 7175643 7009985
4054 7009985 6968197 7179564 7132132 7063791 7146778 6713508 6635363 6852148 6546054 6561990 6780016
4043 6780016 6752033 6722511 6724707 6645002 6774462 6561636 6358768 6411983 6313198 6388123 6351561
4032 6351561 6438888 6292836 6131437 6055427 6246250 6312512 6119362 6028873 6098022 6076399 6030771
4021 6030771 6121332 6177915 6456302 6405817 6240779 6180887 6301785 6189535 6203026 6012038
4011 6012038 5742303 5864607 5789208 5569850 5888352 5974523 5665570 5663582 5630274 5606369 5408499
4000 5408499 5598707 5473928 5143975 5116751 5271106 5449174 5422253 5307155 5093365 4881508
3990 4881508 5106833 5424403 5270032 4801965 5119241 5418396 5344451 5189668 4907213 4800342
3980 4800342 5089124 4919367 5051352 4966289 4802575 4780547 4864908 4832580 4815773 4905026 4989510
3969 4989510 5108219 5043677 5039709 4873886 4759366 4601050 4618716 4803500 4770939 4846722 4548421
3958 4548421 4675535 4929770 4759920 4500389 4377116 4368303 4715235 4814561 4517929 4584753
3948 4584753 4333910 4406453 4489494 4495629 4261000 4127172 4226826 4315144 4131281 4076525 3927541
3937 3927541 4162461 4256518 4161325 4275075 4225349 3987257 3946547 3798420 3870830 4052420
3927 4052420 3892268 3558093 3736015 3971043 3804058 3293791 3486243 3785462 3597051 3690123
3917 3690123 3820058 3936539 3669726 3613208 3505232 3514265 3665658 3530474 3752532 3809804
3907 3809804 3613537 3479784 3522578 3635476 3720206 3728695 3848256 3479250 3361899 3421965
3897 3421965 3333845 3596072 3515598 3527559 3730407 3441980 3418155 3608283 3406538 3431222
3887 3431222 3745249 3957632 3645427 3413297 3202457 3467481 3814229 3788898 3327455 3147455
3877 3147455 3465571 3707370 3774091 3552575 3566206 3616242 3435936 3596415 3910062 3943358
3867 3943358 4069924 3905999 3899297 3644698 3663940 3946459 4162966 4216913 4276860 4362711 4415696
3856 4415696 4165214 4128878 4437057 4548316 4677757 4744479 4742441 4597682 4600761 4454029 4663018
3845 4663018 4882841 5005838 5209598 5399445 5394998 4984927 5125566 5088323 5016028 5372018
3835 5372018 5701664 5850277 5661375 5980002 6184412 6382596 6652316 6611403 6687978 6856524
3825 6856524 7074455 7391569 7319473 7643561 7601014 7830389 7996472 8049915 8419664 8446079
3815 8446079 8449599 8646889 8720072 8787220 9042144 9148852 9071063 9318605 9567705 9868948
3805 9868948 10300490 10497270 10858094 11100405 11402013 11745598 12463664 13267779 13628638 13916708
3795 13916708 14494923 15231227 15830641 16200856 17192637 18022274 18614537 19511389 20166319
3786 20166319 20793125 21530518 22060489 22813754 23663187 24161143 24599681 25005385 25662933
3777 25662933 26516246 26923865 27560629 28298237 28659120 29319153 29971875 30126354 30591201
3768 30591201 30810998 30992012 31317904 31395463 31342556 31424039 31563920 31169193 30559605 30461492
3758 30461492 30392582 30233690 29937576 29524760 29137918 28384036 27811695 27444666 27024412 26404883
3748 26404883 25836639 25075645 24594998 23746347 23345149 22891350 22382937 22007444 21431017
3739 21431017 21111005 20892394 20708385 20614937 20439730 20675013 20947759 21159578 21224144 21476220
3729 21476220 21862587 21930236 22184687 22466405 22870632 23269139 23790671 24260962 24842747 25153816
3719 25153816 25154248 25445729 25536098 25571573 25575910 26101373 26138121 26104892 26268423 26163646 26238215
3708 26238215 26034698 25978253 25790802 25701731 25133959 24834253 24552508 24111935 23475940 23017154
3698 23017154 23009533 22627449 22351849 21586415 20859949 20241808 19931094 19491286 18823147 18360367
3688 18360367 17631371 16863178 16024706 15382152 14696414 13855123 13386292 13273926 12851370
3679 12851370 12322366 11676419 11369610 10717571 10133652 9695699 9524416 9188999 8870610
3670 8870610 8743862 8462700 7959945 7623015 7542778 7596692 7265077 7060811 6868040 6581926
3660 6581926 6361368 6305074 6355524 6165157 6063970 6035232 6075078 5994783 5615121 5670310 5594275
3649 5594275 5614319 5552816 5365455 5405957 5430560 5340044 5235092 5598192 5166513 4896366
3639 4896366 4798285 4783905 4602574 4368495 4226561 4098190 4053411 4324666 4322299 4282434 4386300
3628 4386300 4329075 4470050 4687412 4276050 3896848 4037519 4275700 4044258 3864087 3816273
3618 3816273 3985330 4113394 4117286 4273122 4330198 4424588 4401532 4508415 4600111 4197387 4227114
3607 4227114 4358813 4326058 4243174 4162108 4187734 4141552 4015042 4022440 4389575 4490877 4856155
3596 4856155 4861482 4972673 5165721 4993045 4819247 4856730 4525858 4594518 4690823 4872499
3586 4872499 4754485 4738624 5030283 5219487 5146245 5200263 5446481 5471762 5420684 5277370
3576 5277370 5357634 5383758 5486163 5714377 5783331 5914273 6060682 6193957 6389443 6385332
3566 6385332 6894339 7592239 7944671 8202356 8373024 8542378 8067535 7773275 8081676 8245333
3556 8245333 8251701 8114179 8401607 8580156 8973696 8737448 8738311 9024176 9148051 9473975
3546 9473975 9776734 9924099 10063145 9983985 10163468 10343299 10333697 10574473 10667688 10805581
3536 10805581 11256462 11371958 11444419 11731397 12175160 12556863 12592890 12935328 13047524 13323008
3526 13323008 13636599 14039369 14476275 14630627 15091216 15351891 15704932 16504071 17123600
3517 17123600 17595301 18315726 18648132 19472834 20134396 20864517 21680095 21946712 22444961
3508 22444961 23188289 23585857 24079341 24643785 25018120 25558007 25876352 26017094 26142380
3499 26142380 26456828 27179229 27606609 28084255 28613018 28818548 29279215 29834072 30653280
3490 30653280 31504080 32444806 33236396 34347849 35104983 35774521 36320660 37043398 37814040
3481 37814040 37928474 38596743 39022223 39568513 40205975 41158623 42583620 44312650 46464796
3472 46464796 49365592 51737560 53661601 55488050 57177528 59173779 62055482 65602612
3464 65602612 70109825 75491879 81195277 88484973 96438935 104905958 113623355 122889713
3456 122889713 131909673 140555625 148148877 154768245 161074259 166249580 169696217 171213783
3448 171213783 169886598 165071942 156537561 145271786 132136177 118656294 106457138
3441 106457138 96232247 87740280 79370175 70552520 62348378 54999712 49043057 44082913
3433 44082913 39890414 36395258 33774532 31453540 29199668 27609836 26572969 24976904
3425 24976904 23695578 22526327 21362337 20547659 19912673 19246488 18701174 18022992 17325893
3416 17325893 17007651 16427221 16029163 15376792 14989504 14914032 15018825 15972384 16778129 16795804
3406 16795804 15905272 14662471 13627168 12784350 12307636 11745671 11045311 10647216 10420627
3397 10420627 10004088 9739068 9577820 9552658 9305852 8852664 8726636 8664069 8442374 8321003
3387 8321003 7985215 7803760 7739340 7552615 7293649 7130324 7125059 7325863 6958062 6623377
3377 6623377 6341229 6458289 6417332 6223242 5939620 5721369 5691655 5411122 5430632 5515437
3367 5515437 5310461 5227267 5370941 5274678 5257688 5127452 4872445 4835434 4756614 4590681
3357 4590681 4640438 4783981 4416712 4357832 4616870 4784160 4632935 4539598 4380189 4458900
3347 4458900 4457339 4252149 3911811 3899083 4092653 4063991 3743487 3794069 3667201 3729290 3899387
3336 3899387 3955136 4056295 3791693 3640930 3687150 3640380 3556063 3320542 3175296 3137529
3326 3137529 3140665 3328908 3088517 3221898 3260040 3247284 3174771 3096627 3211101 2918476 2729121
3315 2729121 2912225 3154450 3203974 2959105 2959315 3058081 3008172 2837606 2455476 2337057 2610651
3304 2610651 2545258 2640013 2555613 2262120 2349854 2758721 2600246 2515536 2308331 2225560 2176139
3293 2176139 2339239 2601893 2352799 2095931 1997494 2338522 2486200 2365720 2392831 2256990
3283 2256990 2256912 2137764 2486287 2712589 2407616 2384247 2112071 1933132 2093287 2049071 2230656
3272 2230656 2204482 2350711 2400845 1881027 1741165 2029742 1974245 1952903 1924523 1893658 1888824
3261 1888824 1946198 1836451 1888265 1897227 1743889 1641052 1502906 1722878 1886664 1890991 1829096
3250 1829096 1684062 1551490 1379709 1141838 1220691 1264033 1499888 1490672 1476423 1545874 1466882
3239 1466882 1362893 1702869 1584586 1687369 1640650 1785569 2012259 1780482 1686165 1695086
3229 1695086 1890505 1927751 1981451 1995830 2104193 1927487 1887151 1987643 1884356 1536835
3219 1536835 1374001 1337330 1428040 1423925 1681737 1522256 1311998 1660145 1940854 1780250
3209 1780250 1703808 1790980 1837938 1872739 1846158 1980645 2129361 2304555 1999612 2025239 1857447
3198 1857447 1978764 2221133 2357559 2439318 2453639 2250050 2115359 2027345 2209850 2234059
3188 2234059 2444077 2314688 2069133 2028346 2144002 2148058 2236267 2259949 1998484 2290404
3178 2290404 2410233 2530462 2526898 2545105 2443842 2380106 2560393 2843073 2622782 2764998
3168 2764998 2944008 2943361 2888427 2915075 3134411 2855125 3115097 3369320 3300396 3208741 3186988
3157 3186988 3351521 3782958 4128052 4392852 4486240 4910882 5320403 5741274 6095139 6539015
3147 6539015 7040763 7567358 7948820 8255368 8878467 8850380 9091109 9085165 8866405 9070109
3137 9070109 9225623 9010302 8999576 8961898 8797283 8755607 8637269 8722715 8769362 8817071 9018726
3126 9018726 9117425 9287877 9464203 9885172 10290587 11031895 11858112 13045611 14853921
3117 14853921 16851334 19239118 21065480 21216748 20163913 17931895 15815974 14129935
3109 14129935 12429519 11165559 10533710 9632333 8901561 8629530 8383444 8011524 7626742
3100 7626742 7425421 7129312 7027055 7226981 7115907 7086910 6986736 7146502 7234731 7637563
3090 7637563 7697967 7973188 8646035 8857974 9224702 9423454 9391648 9246763 8927184 8385911
3080 8385911 8008228 7339223 6704821 6103390 5686309 5637704 5186703 4951663 4481706 4285624
3070 4285624 4377345 4469107 4040201 3682891 3448656 3500581 3379776 3228619 3136942 2912628
3060 2912628 2964466 2769513 2747565 2701373 2535981 2340074 2487970 2494517 2550051 2405294 2401216
3049 2401216 2212064 2183024 1942393 2032519 1903970 1843470 1797137 1875313 1855896 1851818 1867332
3038 1867332 1893465 1729790 1497890 1366745 1490557 1566894 1376446 1676046 1593170 1207627
3028 1207627 1018835 1255819 1461644 1198140 1210649 1276795 1366121 1398083 1257222 999840
3018 999840 1191629 960249 1108495 1088641 1170648 1027548 1031891 1183816 1377745 949922
3008 949922 868052 957224 968070 1008817 1050247 1086932 1110380 928279 997153 1219972 990901
2997 990901 796948 739321 854604 848245 976507 794522 683263 677377 931031 793630 835946
2986 835946 880240 518702 577733 827911 747861 869807 840200 762205 567131 899820 1068050
2975 1068050 1099879 831905 747798 993001 969561 535775 470166 450360 428223 495186 473441
2964 473441 680392 929485 569062 497283 653278 852172 609939 399913 471064 762318
2954 762318 569656 211999 472212 695369 593121 606541 516940 564344 605250 474002
2944 474002 269096 368786 609490 416438 651492 573792 675301 504650 348667 391116
2934 391116 251975 262432 294546 467169 456581 690566 545092 603308 684868 682485 577083
2923 577083 563329 215110 -107677 152064 382143 257333 253643 161228 134038 72102 39125
2912 39125 77902 327698 572945 353874 293222 522950 717604 480055 450001 485721 261389
2901 261389 205730 341171 151125 76352 -62682 98868 159225 157108 287085 95988 123212
2890 123212 114473 184175 252565 215636 87528 49040 249474 435991 586796 420033 84244
2879 84244 31375 426265 491214 455963 344941 221155 265921 323556 589361 747955 589457
2868 589457 388272 539397 646185 733778 631284 567883 305665 333298 385261 306611 628735
2857 628735 483643 692225 596221 400249 379424 227119 287581 574981 571660 674409 504663
2846 504663 436121 401273 472289 212858 306519 261307 204480 170448 259912 266677 -36513
2835 -36513 24881 169818 139696 260934 357059 286515 466783 460724 200074 240744 437593
2824 437593 614091 534123 385310 377289 120097 -47687 245078 494339 750344 453553
2814 453553 195101 175242 369335 526597 368943 241672 247503 411031 167164 283288
2804 283288 94912 -66404 -47217 77192 -180984 39004 276109 150887 524287 359396
2794 359396 45153 38857 25888 -162676 369219 538267 178882 466599 600138 511857
2784 511857 448384 358446 249381 371255 387416 307731 146975 5782 -4660 228074 411055
2773 411055 375464 447032 177418 61771 129252 58100 30553 95577 71564 -107830 -106706
2762 -106706 10196 34384 92224 183365 372627 188567 -5904 178825 295144 60105
2752 60105 -212255 -28340 120955 162515 198661 94997 113899 122673 22172 36609 172186
2741 172186 253256 157916 204247 153940 -56346 -136788 18135 94296 72508 27995 254065
2730 254065 89153 187041 210943 171844 232837 214016 329998 273424 235190 213326 208599
2719 208599 227089 128383 234673 26913 -24902 -130816 -55209 -63364 -38202 -37176 -33035 175446
2707 175446 -41857 -371553 -107668 -45071 219978 202448 -86438 -183270 -249970 -300987 -409444
2696 -409444 -114772 142710 126138 -29826 -270159 -166686 -204136 -87710 308718 38647
2686 38647 81385 207346 162591 135468 -6369 212616 267157 -25882 -131055 61458 209374
2675 209374 382289 396529 325673 312152 177314 185594 264112 8056 -117825 -108695 109647
2664 109647 218708 151633 276275 176755 55093 227900 131361 -149646 13084 20547 276919
2653 276919 300631 -44267 -30865 -15593 201985 351257 189210 46917 -120046 72654
2643 72654 139822 237159 -147994 156253 -84448 -81593 -290398 -247545 -189346 -297592 77946
2632 77946 127488 171777 99558 232895 124194 161241 99655 -95978 50200 -67785 186568
2621 186568 270303 157856 225782 -184390 -205026 -1201 -13863 89364 97565 -123505 -65382
2610 -65382 -103138 -40641 10260 -76681 -38243 71391 22897 5435 -5177 -65483 373555
2599 373555 94899 -150442 -183383 145162 190088 140222 -58207 36771 147563 372913
2589 372913 575887 488289 722323 1066722 1314629 1357668 1127808 690710 637662 268763
2579 268763 335674 327299 195552 37543 267563 192628 -58706 -315508 -300307 -64143 65120
2568 65120 -229093 -94693 103933 -41071 -109439 -105011 -158754 -178745 232521 185330 128446
2557 128446 273771 241768 -124816 -190422 -133425 -2054 57416 326297 114589 178477 184352
2546 184352 96886 -14756 -153205 -25662 -94705 -221338 -260744 -167652 -53582 -42100 -337402
2535 -337402 -312761 -48368 156977 319599 408281 -1439 -118444 -165368 -73071 -52906 148617
2524 148617 143488 37678 -70603 -24338 227363 313762 332553 -52786 -156257 -359506 -316802
2513 -316802 -120215 -87262 -151948 121144 49423 -365534 -207080 -158242 -27519 75078
2503 75078 -98204 -213161 -83141 -21726 25465 -180974 -439040 -285474 -74705 -197931
2493 -197931 -236227 -106042 170527 172763 69501 75868 -59376 76843 235015 938 -100624
2482 -100624 -231022 97874 141495 -101435 -148846 -41550 107144 220108 286566 306906
2472 306906 137758 97932 -329914 -207837 -137398 -53747 -6503 -158532 78557 75222 -246247
2461 -246247 61780 190980 91356 22184 34342 161302 -221698 -128827 -78969 -52909 109024
2450 109024 -63643 83692 242547 380365 124538 -53933 -158566 -147059 -113646 137238
2440 137238 154176 122898 475866 521526 408511 178252 -70910 40785 191811 302904
2430 302904 357960 101247 322167 124606 -42357 207090 41581 110090 196909 353780
2420 353780 292227 175718 105349 78228 360636 462959 555733 319250 255580 8663 -59480
2409 -59480 200054 286216 420263 429049 401453 305179 110971 272545 174991 141420 331755
2398 331755 613865 373992 586395 760957 682562 736020 740484 496492 465817 342684 532962
2387 532962 757067 1074881 855111 659702 806017 958118 836741 672678 526774 894254
2377 894254 919255 858018 889045 844829 786419 766855 1120920 1377090 1286582 1362495 1414685
2366 1414685 1401543 1415816 1997756 1920538 1875098 1754995 1756383 1922415 1872992 1656041 1928774
2355 1928774 2224970 2241456 2381182 2560906 2674570 3001926 3270996 3583950 3696865 3827125
2345 3827125 4044213 4337918 4636464 5398172 5726209 6511842 6824922 7098084 7864518 10025342
2335 10025342 12351361 14878387 15604565 15910692 15743630 16290066 17458068 19618776 22488609
2326 22488609 26541363 31142634 38758972 50494307 77754977 134026117 210432118 263791566
2318 263791566 264874032 231159469 173061237 127766968 96831165 74177629 57283723
2311 57283723 44925510 35950092 29751622 25612891 22880566 21788080 21641318 21694670
2303 21694670 20425866 18584354 16364742 14389774 12847427 11645212 10680258 9897262
2295 9897262 9374743 9071993 8301537 8113372 7549583 7318174 6949859 6869197 6821839 6599216
2285 6599216 5976594 5828047 5719144 5659657 5425762 5323925 5228652 5070650 5118507 4662196
2275 4662196 4498518 4457818 4048188 4030052 3880263 3868747 3706201 3732559 3733500 3559858 3201356
2264 3201356 2959172 3097880 3412913 3190706 3283150 2982834 2786406 2733692 2664486 2209442
2254 2209442 2317570 2384840 2620429 2576202 2585333 2451195 2425648 1974321 1782399 2017155
2244 2017155 2105661 2062751 1889974 1758781 1848345 2053440 1967169 1950335 1736049 1702763 1835322
2233 1835322 1681650 1779190 1703280 1660592 1690306 1538205 1487484 1426529 1093790 1133773 1009872
2222 1009872 900591 938551 918899 987745 857115 999367 1150505 1301025 1202728 856247
2212 856247 866669 847956 853597 1204880 1228941 1036763 1174939 834044 678478 796733 634747
2201 634747 553841 865220 749301 710787 679676 780895 986356 689235 555830 886985
2191 886985 968986 706623 649585 775598 468046 433845 585481 712532 738707 694402 751921
2180 751921 711909 735109 466534 617377 749328 757159 719476 572023 698493 890541 1018109
2169 1018109 798111 609799 694042 707100 557040 531904 511275 514519 454361 521294 764116
2158 764116 629591 526948 549855 653188 698677 404276 379302 242547 227384 487340
2148 487340 685854 801734 659192 568454 691859 607249 367703 213865 342592 619645
2138 619645 726182 712119 552605 613849 586480 365304 273796 444680 18700 53094 197478
2127 197478 277130 376200 435357 461132 458021 454551 300472 252093 129086 89101 209698
2116 209698 167640 95929 199866 396496 403481 329657 60635 -79774 69162 415126 475374
2105 475374 330017 307718 115460 -37621 141578 413225 700443 548217 413972 290481
2095 290481 446812 218445 264353 626891 490001 143692 278952 230381 319455 286265
2085 286265 351130 565762 580259 277670 266567 458172 293169 319412 405197 81284 -395291
2074 -395291 12390 540215 377035 183549 254202 192878 182523 205533 280606 354608 207640
2063 207640 248162 258742 288955 179086 13325 323685 354664 336199 386018 436553 476210
2052 476210 713938 981990 1368237 1607927 1267660 1279069 898376 556537 150753 -114594
2042 -114594 -9569 207337 389218 166207 362288 512796 385014 328340 75427 -127140
2032 -127140 147313 103733 88152 8590 156524 45169 8483 -31096 59581 278509 233123
2021 233123 294977 512104 313409 292365 404253 357474 468274 257796 179309 407962
2011 407962 440105 306378 -148750 -1590 51464 306704 437660 127422 135854 -46278
2001 -46278 -2768 556079 408612 152093 107562 -12187 -9678 93526 2824 -74586 79664
1990 79664 304285 38031 -75572 73208 45645 84970 15310 122174 79551 -194610 -335645
1979 -335645 -231775 63974 421824 323457 231117 240709 242143 88119 -52129 -45561 52466
1968 52466 -57919 -203019 298509 444242 443879 454246 356262 345041 32463 48760 -46170
1957 -46170 -217648 -98241 105895 -55471 37210 71272 89536 76926 57374 376791 114099
1946 114099 -33937 -128330 -164818 100770 172337 -31596 -176732 -49694 161733 -61364
1936 -61364 53303 147906 21326 -132409 -161638 98591 80392 113570 13969 102216 215812
1925 215812 35436 26840 87812 73326 -115165 -17068 210504 69649 266066 68701 60895
1914 60895 145332 133153 55624 96547 101056 300995 463983 482302 274708 -39050 44769
1903 44769 219330 220184 142295 166485 -24726 205032 -28108 -173492 -220591 -282762 -1708
1892 -1708 -120400 -294109 -168396 -29372 -144892 -93595 50465 -227618 -203022 1322
1882 1322 158526 187558 78278 -42543 42165 110325 108713 -67622 -128560 -51075 184979
1871 184979 -129861 11429 59626 120994 273616 63188 89260 84694 200725 191910 336314
1860 336314 113176 49566 -58673 -27871 -109261 -119240 -25029 60325 -27738 -118077 3885
1849 3885 -93569 -240300 -165107 -92837 -168821 -161066 -207646 -87058 -162441 -99779 -7272 -207032
1837 -207032 -11478 -170165 -38689 170648 169406 141010 254122 59890 153122 45494
1827 45494 -290634 -326643 -23418 -217977 34656 132558 -164368 -153129 126178 307037
1817 307037 184241 28420 154312 86072 -27543 166761 243622 167503 44266 137149
1807 137149 112880 38957 -134078 -281819 -280140 32776 257072 192784 16400 -238170 -172516
1796 -172516 155230 261717 144163 27473 -94950 -405970 -313435 -110766 -182442 -177407
1786 -177407 244558 -33603 -202557 -112330 -52031 -126564 -106769 -184055 -107991 131081 26912
1775 26912 -229004 109212 226206 77038 141715 -204359 -175445 -206149 37210 307406
1765 307406 64041 227556 67340 62484 7156 -406515 -323673 31304 223295 131108 -66037
1754 -66037 25783 608 117943 178333 154484 75526 -150526 -88912 59249 249335 101629
1743 101629 196580 254316 -180540 -356121 -69911 -218641 -445212 -217132 -45967 166598
1733 166598 346530 190460 111118 36398 -123517 19291 -3596 -26806 -258462 -210320 53752
1722 53752 -66453 108971 198213 -50459 -119643 33014 251060 193866 -119475 -232006
1712 -232006 -126523 -325543 -7944 148348 100049 -65096 -1968 -281626 -162409 -33468
1702 -33468 11588 -25678 -226772 -10614 308883 389875 370596 106650 36 -252394 -101743
1691 -101743 39396 -103316 99381 -16378 -125101 -103705 17796 145838 245864 -18733
1681 -18733 -8355 44260 286791 102715 93856 218712 307852 253324 348225 325946 269437
1670 269437 348554 230915 5053 12661 -108224 -254504 92755 283220 -131150 -21673
1660 -21673 198182 65159 83368 -5305 31048 -67463 35879 301012 428579 586169 345053
1649 345053 83045 -118658 -39795 -78775 -445457 -218858 -124652 -103757 -91832 -188371 7071
1638 7071 29678 -104332 -207488 -37222 -138155 -107233 -152541 -52402 -73981 -23442 -89943
1627 -89943 -211508 102043 318042 165306 -242016 -299561 87311 8435 -274701 4369
1617 4369 10451 37559 173392 22853 -244353 -351679 68521 -22535 79083 -59706 -151396
1606 -151396 -159677 -183944 -206566 -14020 -40405 -129403 -24871 145340 -26396 -140715 323156
1595 323156 340740 264627 124064 -302184 -296453 -360549 -141698 -323307 -339901 -302802 -120843
1584 -120843 50793 -248216 -283267 -259350 -214517 -319862 -65214 -99931 -105430 15881 272561
1573 272561 81655 -12324 242158 294888 198036 252569 169691 105330 -56000 -79982 -328367
1562 -328367 -164857 -11768 -6400 -201613 -98161 -124278 -51444 -162604 -136551 -139684 101065
1551 101065 56343 47136 231681 114599 -164902 -295813 -237117 -139306 -13743 16506 157991
1540 157991 255812 -67513 -110232 -46569 -42666 -96890 6036 142177 -154652 124211 219444
1529 219444 200014 62253 27512 -282379 -348487 -180662 -26298 79432 73089 23452 100643
1518 100643 110823 244890 80910 -98826 -97467 26360 119921 -107410 103663 252387
1508 252387 362365 43481 -87272 55758 147033 -146343 -131201 11156 66293 -151191
1498 -151191 93567 136652 -195830 13510 -61506 -201173 64791 238874 134088 -78348
1488 -78348 -349664 -583182 -505970 -445690 -261708 -529049 -312359 20991 -192915 -293798
1478 -293798 -279025 -175166 -40952 75976 -81218 -121642 -31800 26864 -127502 11462
1468 11462 -28822 58572 100840 -112087 -232529 -172156 -76312 -5392 -338129 -60787 36238
1457 36238 100677 65990 94180 -19670 -76138 94157 356091 221691 59877 -102011 -15739
1446 -15739 256295 282499 200560 -15969 -181566 -195579 -60367 -247604 -259154 -67519 51972
1435 51972 233133 54471 38308 247243 284405 264737 -64805 -90788 -167649 -196014 -72048
1424 -72048 -7962 36748 50891 23914 122499 2945 -79729 -228001 -177928 -140028 11241
1413 11241 154398 82815 21848 -257928 -113190 -38972 86404 -104355 -289000 -77152
1403 -77152 64548 121679 83034 66154 196392 14515 29073 -290535 -459942 -537702 -518083
1392 -518083 -394873 -181982 -213526 -365464 -200067 -102335 -190809 -10750 -42405 -138284 -32701
1381 -32701 191915 305364 235598 56760 67457 80106 -26155 65195 -25742 -112261 4134
1370 4134 44059 109938 180863 129719 -232472 -248646 -103227 -138364 85294 117843 63523
1359 63523 -38762 141849 134056 -111525 -173199 226169 324885 94718 -86824 -3661 -322965
1348 -322965 -94766 141280 -53545 -282230 -108421 -295993 -200227 108684 4725 -225071
1338 -225071 80741 101615 170136 235986 273818 229740 85886 -88345 -22831 -134809 -49410
1327 -49410 -220566 -36305 42004 -72543 89220 -249683 -203611 -171088 -147104 -16060 -2441
1316 -2441 -169346 -204630 -272322 -160741 -45922 -112767 -158473 -464932 -618500 -524207 -108875
1305 -108875 262352 95478 284564 -6908 -252265 -110211 36876 -18507 -4630 21222
1295 21222 246733 -15648 6517 101203 148499 -368758 -346875 -181967 -149143 -42476 -437881
1284 -437881 -349949 -377576 -112570 -3740 64715 -70027 -217555 -118064 105551 358095
1274 358095 171010 137304 174619 881 -19164 -91735 -311469 -335723 -289384 -261829 -309411
1263 -309411 -13531 32250 -73181 93991 -72949 -339947 -222851 -112275 -312194 -182169
1253 -182169 -84681 148825 -159817 -349412 -376997 -281991 -314879 -293461 -272654 -121539 -79396
1242 -79396 -116498 -268440 -352140 -70861 -142102 -250346 -241340 -271631 -79426 48718 -177216
1231 -177216 -178485 -205737 -473028 -399840 -243452 -367409 -117057 -615677 -356583 -169316
1221 -169316 -204305 -122677 -210745 -24679 -239332 -433878 -311901 -153336 134472 -137410
1211 -137410 111830 143751 327307 16673 -145243 -398204 -476886 -338309 -295222 -195695
1201 -195695 -218936 -100430 -34699 -134149 -414057 -316735 -208005 12005 -127717 -383041
1191 -383041 -134125 -28185 -128416 -7762 111585 -107558 -178639 29420 216807 232777
1181 232777 43857 -22126 -109432 217314 186339 293086 276651 -75347 -16348 54566 -42454
1170 -42454 301513 -127614 -232483 39735 165847 -127632 -134898 147373 82623 -200643
1160 -200643 -84569 110931 380442 169369 100880 51388 267448 178977 57419 58307 82081
1149 82081 364702 402284 200672 -299723 -336124 108315 -28283 -331649 -197769 2712
1139 2712 -33881 -144970 -175802 -86219 -100453 194999 581862 488537 73678 -88313 45835
1128 45835 -155155 -111362 -204367 56813 -134029 -228798 -73722 145820 125815 228972 311534
1117 311534 -102302 8842 17913 -160778 -77833 -24068 20002 25692 18357 94636 46366 -209960
1105 -209960 -156618 -198540 -389379 -406327 -87453 -146909 -293781 -87610 268783 78543
1095 78543 110819 -85576 153575 346387 149638 -63899 211164 347393 239794 86073
1085 86073 -130251 -58584 -131072 -206985 -102226 94948 116922 93499 18475 41592 13362
1074 13362 21470 -98946 2803 437948 583436 302011 10731 -20233 31448 -55812 74719
1063 74719 2800 -57666 -1427 199871 327433 49849 -164964 175457 126103 26471 -70832
1052 -70832 -20551 -315409 -378210 -214411 -348731 -94587 -57984 -9402 85318 -108514 -146898
1041 -146898 -3579 -141147 -267897 -175283 91856 191396 360063 190277 35770 80012
1031 80012 -199855 -79311 -46974 -13958 -195038 -185372 -87036 57190 5862 155489 161532
1020 161532 -74533 -92445 -226323 -111178 -180522 -77395 24340 15488 71349 159281 105031
1009 105031 66738 218469 286596 117301 142351 84148 28564 -147451 -280047 -4701 -28010
998 -28010 -49430 -168900 93313 284217 321402 533456 157194 -111039 -320609 -88267
988 -88267 -31339 -265352 -130201 -160745 -305828 -270594 -199088 -117562 -3038 213275 299920
977 299920 73754 15908 41380 163607 -3291 156549 237555 59589 44181 9789 158996
966 158996 81776 -115707 -27306 -74889 -62633 -37367 -119289 -74779 -97117 -90985 -120157 -36737
954 -36737 -117772 -212173 53341 -200889 -172934 -212602 82663 41503 -318192 -113640 43092
943 43092 158021 119039 -66470 -218230 -31774 -127732 -107411 -83554 39644 -95015 -146262
932 -146262 -84873 -168511 -411178 -443444 -371053 -338089 227250 90891 -354274 -325258 -8536
921 -8536 56217 101116 -58155 -127522 -179068 -219139 -312677 -180849 193230 -71118 -15254
910 -15254 133246 -40889 -58540 -113108 -205005 80536 -69467 133758 154311 207571 50448
899 50448 70428 106626 82738 145549 -1178 -41163 -88340 -217917 -507979 -310803 -73378
888 -73378 -241056 14685 -180189 -166440 -231244 -14033 172494 230971 49205 25230 -68966
877 -68966 -6798 -48430 -285150 -205018 -6471 49437 97029 255028 164815 84475 38890
866 38890 -46878 -216539 -95217 5245 87322 114798 325777 177865 32724 -40261 -233937
855 -233937 -304766 -367102 -338910 -245379 -400371 -43984 146491 132187 178664 190541 101783
844 101783 59096 128125 -67903 -258705 -217460 -316158 -73310 -106803 -214 28917 114577
833 114577 67789 76142 -421038 -329517 11631 208642 74909 -210224 -219400 -135756 -335315
822 -335315 -187506 -244957 -50389 109700 165849 268731 -137342 -253168 -192890 46433
812 46433 200422 225060 108968 167848 342665 301700 214768 -20082 -128473 -56627 24714
801 24714 148861 111531 61512 78259 -167725 -453109 -271703 -19518 -74904 -1150 -295
790 -295 -121469 -7493 103991 154100 78225 197821 89959 179930 248887 78736 240667
779 240667 347386 20401 -93428 -113839 26213 127778 260696 9633 -145732 -80291
769 -80291 -193976 -238258 -98970 -134423 -181223 -110614 -84323 -390559 -147358 47858 -46443
758 -46443 -54424 11630 -57341 -96392 -245415 -291884 -26031 -135987 -239675 -16847 -84620
747 -84620 -35547 16580 112366 -37837 -126245 49560 -76596 -257716 -144663 -85936 9529
736 9529 4652 185268 321015 309047 233425 116129 -82131 204555 64951 -27310 163869
725 163869 41443 90117 -22410 -80288 -194636 -48024 -1790 -47342 -156823 -312016 -337819
714 -337819 -218569 -54082 -36083 -288075 84688 -115523 -408740 -172170 -131485 -137053 -140372
703 -140372 -340765 -145582 10376 -80667 -136741 -450287 -388652 11945 -135338 -279021
693 -279021 -119073 63232 228590 259886 97904 32535 -28277 -149890 -74189 -222259 -202939
682 -202939 46333 -248379 -145981 57115 149328 281617 186035 83063 32291 128409 233358
671 233358 192385 149361 295816 170396 139890 127260 -151150 -23458 225118 32339 -114564
660 -114564 -92249 -102252 36351 145172 198968 234699 287177 79186 -109665 83452 23742
649 23742 -104982 39887 44024 247857 305852 177539 124403 56134 2060 -18433 -84647
638 -84647 -70117 -165406 -330368 8232 4883 -200981 -158909 -116045 -109797 80794 -59345
627 -59345 -116254 38413 -26976 -165954 -334684 -221599 -159485 -50358 89894 211816 100424
616 100424 87999 -46747 47948 273013 290898 130233 48956 -74772 -150856 -107345 -33302
605 -33302 99559 158881 198330 140644 59351 64869 59514 140065 223659 248571 105695 -12192
593 -12192 98187 116901 234762 211903 366664 -96722 57414 26822 5147 312231 352046
582 352046 88785 -5686 188445 -6242 -179382 -131955 123972 187391 -52497 -48690 -110902
571 -110902 -124606 -104448 -131908 -159338 -264622 -117174 -225572 -280336 -192058 -171049 -37619
560 -37619 263521 340406 503063 120602 -188710 176767 85204 -185948 -46244 -60923 -158875
549 -158875 -76302 73348 67249 -12640 29894 30067 87444 159067 54985 130283 67802 -39899
537 -39899 -178377 17414 57660 16419 292670 337386 243371 127484 -83360 -168456 57958
526 57958 35305 82713 120883 3343 50179 -134270 12662 406088 345805 227111 48285
515 48285 -291559 -136365 -3869 12474 268514 339012 350819 183897 -11184 -61171 24845
504 24845 41546 -12425 -2877 -177075 -117436 -48630 -70737 53534 951 -127865 24662
493 24662 159588 251113 168379 92878 317895 68703 236755 246064 322501 196275 100704
482 100704 123456 -95937 -107444 11737 176996 173080 142295 119899 23430 130654 230308
471 230308 26777 -52204 -178266 -312362 -137433 -171891 -51674 -27004 274117 435727
461 435727 309895 100177 -69182 -245666 -470695 -163902 -171256 -197164 -51186 -105825 -197614
450 -197614 -207186 -185641 -205015 95563 271373 -178565 -332093 -205248 -359768 -143578 99269
439 99269 -169761 -72178 69471 116316 -115763 -227152 -121570 25066 297735 148627
429 148627 -171844 -89441 -129100 -186180 -113424 -206839 -273758 26917 46706 102613 -64219
418 -64219 -18905 -176122 -231962 -122986 -116833 110529 5745 -60455 55823 62840 -225999
407 -225999 -444009 -606268 -631251 -129512 -5470 -52620 -60197 58666 83997 -246463 -91522
396 -91522 125604 185111 3088 155097 103269 -113186 -145147 -160461 -255411 56106 146466
385 146466 -33088 25542 -13933 -165686 -121334 -233521 -132810 84923 -178660 -318868
375 -318868 -297628 151920 24916 59899 109018 136317 -30045 -136353 -63460 -68544 78714
364 78714 -116942 -152660 -109166 -346099 -323323 -125693 74276 111849 -187251 -171746 -232327
353 -232327 27760 31445 -388451 -275602 -112951 -108298 189020 267372 -148332 -177399 -27245
342 -27245 -139240 -81541 -54085 -280145 -276136 -127872 -191508 61884 -57698 -22897 38858
331 38858 -243417 -270525 -48021 -60341 -87814 -30444 210727 250893 143638 -108835 -157797
320 -157797 -118279 -141290 -211117 -191287 94809 175087 209247 262070 346880 71267 -89769
309 -89769 -26663 76095 -100585 -48115 66486 116880 -62322 -22418 117839 -30771 -230116
298 -230116 -99041 121789 -121582 -329344 -367673 -322323 -255335 29072 -131071 -198646 -142990
287 -142990 -199747 -201202 -222707 -215504 39739 70268 -144579 -121722 -228999 -400445 -238137
276 -238137 -126384 -162985 -51066 -92536 -187817 -21168 -86658 -60672 -9088 -121540 -187784
265 -187784 -146997 -272567 -274949 -41520 -256413 -24784 115855 235278 13722 13695 146669
254 146669 -52773 -369843 -101366 60058 -353787 -417556 -378548 -217927 -141283 -169966 -172864
243 -172864 -67508 21082 186491 259732 -217188 -232920 82343 197629 156987 255852 106485
232 106485 56127 -268779 -218429 -309698 -347125 -360928 65128 45264 -170821 122502 -219175
221 -219175 40897 -45046 22375 -2995 -197216 -330623 -254912 -165216 -172576 -138249 18525
210 18525 -206726 -52015 -152489 -173887 -120256 -8512 -127145 -244925 -74918 -153090 -116199
199 -116199 -48411 -122810 -193515 -69568 171552 205552 -56968 -177056 -14276 208027 144074
188 144074 -69197 -118912 -312694 -360918 -342959 -25833 139059 166616 272445 369552 286236
177 286236 37401 -114058 -61158 66336 -101930 12892 114670 -21073 -180698 75421
167 75421 12020 -209523 -138590 -313455 -364980 -128326 -34812 124585 -8807 58668 15904
156 15904 -37483 -170559 -108391 -175428 -274427 -11834 -55339 -39345 279687 -24594 -119949
145 -119949 -192442 -235940 -39524 14483 134434 -90472 -247439 -133238 -164934 -221858 35094
134 35094 101446 -45062 -164752 -61032 -48390 27034 -241463 -166590 7386 13405 208287
123 208287 319413 56393 -66894 89556 579 108715 353385 -33388 -134501 -65707
113 -65707 -53805 -80542 -203894 -191011 -168268 -142568 -196939 -294583 -427983 -258308 -262484 -163814
101 -163814 -62819 -25736 -160649 -130585 -53821 29038 -93679 -249664 -144844 -154208 -197951
90 -197951 -227361 -240534 -197271 -182098 -323155 32595 230130 -57373 -274017 -151404 -106548
79 -106548 -261994 -50170 -179328 -142541 52163 48049 6875 38744 -43944 44282 4166
68 4166 -108624 -62095 -200416 -247196 -275141 -115531 -11728 34308 -139612 -213025 -106256
57 -106256 -101055 -244626 -203365 -105622 -133677 -11672 97339 -30802 -108315 -82546 -48940
46 -48940 45627 129947 155969 20451 -46226 -5824 -67976 -90119 44874 -12747 -52602 -88375
34 -88375 -85301 -49003 -156061 -253 -144761 -243971 -105854 -68130 -123163 -86803 70376
23 70376 4830 -37313 19401 96558 11935 -256291 -301634 -212888 -276195 -270708 -110476 -16927
11 -16927 151588 51608 54149 -80630 -71535 -43873 -352305 -191474 -122775 22047 23901
0 23901
$$ Imaginary data points
##PAGE= N=2
##DATA TABLE= (X++(I..I)), XYDATA
16383 -1732740 -1624983 -1468368 -1436394 -1325470 -1326511 -1235127 -1064964 -1057855 -1138876 -1035415 -1004792
16372 -1004792 -1030923 -963171 -807297 -705814 -851248 -894556 -1032016 -1169317 -1042844 -970719
16362 -970719 -735983 -864255 -633356 -690795 -712183 -585037 -701760 -798935 -809385 -622526
16352 -622526 -627364 -520061 -454406 -484883 -531862 -415611 -232129 -195020 -213187 -220658 -201439
$$ [...]
##END NTUPLES=NMR SPECTRUM
##END=
