##TITLE=1H_DE-80H_X3
 200.13MHz, d2o
 8 sc
 
 19ns.26.2.2025
##JCAMPDX= 6.0         $$ Bruker NMR JCAMP-DX V2.0
##DATA TYPE= NMR SPECTRUM
##DATA CLASS= NTUPLES
##ORIGIN= UXNMR, Bruker Analytische Messtechnik GmbH
##OWNER= pz
$$ XWIN-NMR		Version 3.5
$$ Thu Dec 11 10:32:47 2025 Russian Standard Time (UT+4h)  Yarkov@DPX200
##.OBSERVE FREQUENCY= 200.1313
##.OBSERVE NUCLEUS= ^1H
##.ACQUISITION MODE= SIMULTANEOUS
##.ACQUISITION SCHEME= undefined
##.AVERAGES= 8
##.DIGITISER RES= 18
##SPECTROMETER/DATA SYSTEM= spect
##.PULSE SEQUENCE= zg30
##.SOLVENT NAME= CDCl3
##.SHIFT REFERENCE= (INTERNAL, CDCl3, 0, 15.5067)
##AUDIT TRAIL= $$ (NUMBER, WHEN, WHO, WHERE, WHAT)
$$ ##TITLE= Audit trail, XWIN-NMR		Version 3.5
$$ ##JCAMPDX= 5.01
$$ ##ORIGIN= Bruker BioSpin GmbH
$$ ##OWNER= Yarkov
$$ C:/Bruker/XWIN-NMR/data/yarkov2/nmr/H-C/1/pdata/1/auditp.txt
$$ ##AUDIT TRAIL=  $$ (NUMBER, WHEN, WHO, WHERE, WHAT)
(   1,<2025-12-11 10:31:56.75 +0400>,<Yarkov>,<DPX200>,
      <created by zg, POWCHK disabled, PULCHK disabled
       configuration hash MD5:
       00 E9 B6 7A A2 85 ED C7 34 08 36 98 17 FE 4E 26
       data hash MD5: 16K
       32 A6 DA 63 76 7B 8B 75 07 3E 09 F8 1D E1 3F 25>)
(   2,<2025-12-11 10:32:08.76 +0400>,<Yarkov>,<DPX200>,
      <Start of raw data processing
       efp BC_mod = 2 LB = 0.25 FT_mod = 6 PKNL = 1 PHC0 = -5306.083 PHC1 = 17.82193 SI = 16K 
       data hash MD5: 16K
       CA 7E ED 87 8D 02 8D D7 94 33 D3 0E 7A FF BF 23>)
$$ ##END=
$$ 
$$ hash MD5
$$ 8A 69 DB 20 83 69 30 B7 E2 EA D4 07 6C D8 33 CC
##$RELAX= 
##$RELAX= 
##$RELAX= 
##$RELAX= 
##$RELAX= 
##$RELAX= 
$$ Bruker specific parameters
$$ --------------------------
##$DU= <C:/Bruker/XWIN-NMR>
##$EXPNO= 1
##$NAME= <H-C>
##$PROCNO= 1
##$TYPE= <nmr>
##$USER= <yarkov2>
##$AMP= (0..31)
100 100 100 100 100 100 100 100 100 100 100 100 100 100 100 100 100 100 
100 100 100 100 100 100 100 100 100 100 100 100 100 100 
##$AQSEQ= 0
##$AQ_mod= 1
##$AUNM= <au_zg>
##$AUTOPOS= <>
##$BF1= 200.13
##$BF2= 200.13
##$BF3= 200.13
##$BF4= 200.13
##$BF5= 200.13
##$BF6= 200.13
##$BF7= 200.13
##$BF8= 200.13
##$BYTORDA= 1
##$CFDGTYP= 0
##$CFRGTYP= 5
##$CHEMSTR= <none>
##$CNST= (0..31)
1 1 145 1 1 1 1 1 1 1 1 1 1 1 1 1 1 1 1 1 1 1 1 1 1 1 1 1 1 1 1 1 
##$CPDPRG= <>
##$CPDPRG1= <>
##$CPDPRG2= <>
##$CPDPRG3= <>
##$CPDPRG4= <mlev>
##$CPDPRG5= <mlev>
##$CPDPRG6= <mlev>
##$CPDPRG7= <mlev>
##$CPDPRG8= <mlev>
##$CPDPRGB= <>
##$CPDPRGT= <>
##$D= (0..31)
0 0.7 0 0 0 0 0 0 0 0 0 0.03 0 0 0 0 0 0 0 0 0 0 0 0 0 0 0 0 0 0 0 0 
##$DATE= 1765434716
##$DBL= (0..7)
120 120 120 120 120 120 120 120 
##$DBP= (0..7)
150 150 150 150 150 150 150 150 
##$DBP07= 0
##$DBPNAM0= <>
##$DBPNAM1= <>
##$DBPNAM2= <>
##$DBPNAM3= <>
##$DBPNAM4= <>
##$DBPNAM5= <>
##$DBPNAM6= <>
##$DBPNAM7= <>
##$DBPOAL= (0..7)
0.5 0.5 0.5 0.5 0.5 0.5 0.5 0.5 
##$DBPOFFS= (0..7)
0 0 0 0 0 0 0 0 
##$DE= 6
##$DECBNUC= <off>
##$DECIM= 32
##$DECNUC= <off>
##$DECSTAT= 4
##$DIGMOD= 1
##$DIGTYP= 9
##$DL= (0..7)
0 120 120 120 120 120 120 120 
##$DP= (0..7)
$$ [...]
##$SUBNAM2= <"">
##$SUBNAM3= <"">
##$SUBNAM4= <"">
##$SUBNAM5= <"">
##$SUBNAM6= <"">
##$SUBNAM7= <"">
##$SUBNAM8= <"">
##$SUBNAM9= <"">
##$SW= 18.0517328524113
##$SWIBOX= (0..15)
0 0 2 0 0 0 0 0 0 0 0 0 0 0 0 0 
##$SW_h= 3612.71676300578
##$TD= 16384
##$TD0= 1
##$TE= 0
##$TE2= 300
##$TE3= 300
##$TEG= 300
##$TL= (0..7)
0 120 120 120 120 120 120 120 
##$TP= (0..7)
150 150 150 150 150 150 150 150 
##$TP07= 0
##$TPNAME0= <>
##$TPNAME1= <>
##$TPNAME2= <>
##$TPNAME3= <>
##$TPNAME4= <>
##$TPNAME5= <>
##$TPNAME6= <>
##$TPNAME7= <>
##$TPOAL= (0..7)
0.5 0.5 0.5 0.5 0.5 0.5 0.5 0.5 
##$TPOFFS= (0..7)
0 0 0 0 0 0 0 0 
##$TUNHIN= 0
##$TUNHOUT= 0
##$TUNXOUT= 0
##$USERA1= <user>
##$USERA2= <user>
##$USERA3= <user>
##$USERA4= <user>
##$USERA5= <user>
##$V9= 5
##$VALIST= <valist>
##$VCLIST= <CCCCCCCCCCCCCCC>
##$VD= 0
##$VDLIST= <DDDDDDDDDDDDDDD>
##$VPLIST= <PPPPPPPPPPPPPPP>
##$VTLIST= <TTTTTTTTTTTTTTT>
##$WBST= 1024
##$WBSW= 4
##$XGAIN= (0..3)
0 0 0 0 
##$XL= 0
##$YL= 0
##$YMAX_a= 253398
##$YMIN_a= -182098
##$ZGOPTNS= <>
##$ZL1= 120
##$ZL2= 120
##$ZL3= 120
##$ZL4= 120
##$ABSF1= 0
##$ABSF2= 0
##$ABSG= 0
##$ABSL= 0
##$ALPHA= 0
##$AQORDER= 0
##$ASSFAC= 0
##$ASSFACI= 0
##$ASSFACX= 0
##$ASSWID= 0
##$AUNMP= <proc_1d>
##$AZFE= 0.1
##$AZFW= 0.1
##$BCFW= 0
##$BC_mod= 2
##$BYTORDP= 0
##$COROFFS= 0
##$CY= -3
##$DATMOD= 1
##$DC= 0
##$DFILT= <>
##$DTYPP= 0
##$F1P= 0
##$F2P= 0
##$FCOR= 1
##$FTSIZE= 16384
##$FT_mod= 6
##$GAMMA= 0
##$GB= 0
##$INTBC= 1
##$INTSCL= 3.241238e-09
##$ISEN= 128
##$LB= 0.25
##$LEV0= 0
##$LPBIN= 0
##$MAXI= 10000
##$MC2= 0
##$MEAN= 0
##$ME_mod= 0
##$MI= 1.114404
##$NCOEF= 0
##$NC_proc= -5
##$NLEV= 6
##$NOISF1= 3.799351
##$NOISF2= 2.8
##$NSP= 0
##$NTH_PI= 0
##$NZP= 0
##$OFFSET= 15.5067
##$PC= 1
##$PHC0= -5306.083
##$PHC1= 17.82193
##$PH_mod= 1
##$PKNL= yes
##$PPARMOD= 0
##$PSCAL= 0
##$PSIGN= 0
##$REVERSE= no
##$SF= 200.130003002703
##$SI= 16384
##$SIGF1= 3
##$SIGF2= 2
##$SINO= 0.751879
##$SIOLD= 32768
##$SREGLST= <19F.Aceton>
##$SSB= 0
##$STSI= 16384
##$STSR= 0
##$SW_p= 3612.71676300578
##$SYMM= 0
##$S_DEV= 0
##$TDeff= 16384
##$TDoff= 0
##$TI= <>
##$TILT= no
##$TM1= 0
##$TM2= 0
##$TOPLEV= 0
##$USERP1= <user>
##$USERP2= <user>
##$USERP3= <user>
##$USERP4= <user>
##$USERP5= <user>
##$WDW= 1
##$XDIM= 16384
##$YMAX_p= 494001886
##$YMIN_p= -289037
$$ End of Bruker specific parameters
$$ ---------------------------------
##NTUPLES= NMR SPECTRUM
##VAR_NAME=  FREQUENCY,     SPECTRUM/REAL,   SPECTRUM/IMAG
##SYMBOL=    X,             R,               I
##VAR_TYPE=  INDEPENDENT,   DEPENDENT,       DEPENDENT
##VAR_FORM=  AFFN,          ASDF,            ASDF
##VAR_DIM=   16384,         16384,           16384
##UNITS=     HZ,            ARBITRARY UNITS, ARBITRARY UNITS
##FACTOR=    0.220516191357247, 1,           1
##FIRST=     3103.35582991963, 0,            0
##LAST=      -509.360933086146, 0,           0
##MIN=       -509.360933086146, -289037,     0
##MAX=       3103.35582991963, 494001886,    0
$$ Real data points
##PAGE= N=1
##DATA TABLE= (X++(R..R)), XYDATA
$$ [...]
8382A194145k0735L6928Q8189J85219K25671J68760J95082J18965J70845L01498
8372B664567K08355K33393L09482K80304J67648O0379n8264k45566k18979k93126
8362C108193l90092k85093k41964k66612j80983j82766k06876j73428j41963j24731
8352I13685n3029J7967q3158r1515J0259k411k6875o0208l7948q0567k3997J9299
8340E01502j04262m6581o0877r9431M2251R5879m661L4086J09465N598n9295l0866
8328C82808j21928n5231J03556N1090L7907L3969J6218K1785K767M1304m7787
8317D66458k5995M5623l7104j0325n5346j04978m9961M9599P3711r918M418k6543
8305C19639m3680R231q6401j14581m2293P0091P0349J4989N2870J6915n032R802
$$ y = [1194145, 1173410, 1210338, 1298527, 1483746, 1709417, 1878177, 2073259, 2192224, 2363069, 2664567, 2872922, 3106315, 3415797, 3696101, 3863749, 3924128, 3865864, 3620298, 3401319, 3108193, 2718101, 2433008, 2191044, 1924432, 1743449, 1560683, 1353807, 1180379, 1038416, 913685, 860656, 878623, 795465, 703950, 714209, 711798, 684923, 624715, 586767, 506200, 482203, 501502, 397240, 350659, 289782, 190351, 232602, 328481, 323820, 357906, 467371, 472969, 413674, 382808, 260880, 205649, 309205, 360295, 398202, 432171, 448389, 470174, 472941, 514245, 466458, 440463, 486086, 448982, 438657, 383311, 278333, 228372, 277971, 351682, 341764, 346182, 319639, 275959, 285190, 198789, 84208, 41915, 112006, 182355, 197344, 250214, 267129, 262097, 271899]
8293B71899k860n2020l5925J717J218K6142J4869k0325j0561J172K4138M4936
8281B64400l2035p0882J2646O34p384l5614j0806j4205M985N6014n961J6570j0095
8268A68267K6562K6712k260l464l3421J8087M4536L297j3936l8894J2301K2337
8256B30124L8831n172j8945r020l7329j3423L786p170j8998j2807L6439p769k7934
8243A50613J5726j2262j2948L6308K0377l2889K303K5855l9316j8512M9696m1507
8231A43444k8593P0223J5636m351J0461N599K795N8516k4310q1664k2841J4947
8219A59862K7309n303L1624o662K9641O7522o7754M71l0064k0260K3644J3375
8207B23405L0282o1602L5662N6070k5376M9973K2043p6648N6564J2887O218j9607
$$ y = [271899, 269039, 217019, 181094, 182811, 184029, 210171, 225040, 204715, 194154, 195326, 219464, 264400, 232365, 161483, 174129, 174763, 167379, 131765, 120959, 106754, 111739, 167753, 161792, 178362, 168267, 194829, 221541, 219281, 215817, 182396, 200483, 245019, 248316, 234380, 195486, 207787, 230124, 268955, 263783, 244838, 235818, 198489, 185066, 188852, 181682, 162684, 149877, 186316, 178547, 150613, 166339, 154077, 141129, 177437, 197814, 164925, 167228, 193083, 153767, 135255, 184951, 143444, 114851, 185074, 200710, 196359, 206820, 212419, 215214, 273730, 249420, 167756, 144915, 159862, 187171, 181868, 213492, 206830, 236471, 303993, 236239, 236710, 206646, 186386, 210030, 223405, 253687, 192085, 227747, 283817, 258441, 308414, 330457, 253809, 310373, 323260, 329478, 309871]
8195C09871J3773L1285o817q2924Q996L6866M8270N3259M6895J4471k0625K2598
8183D75918l0957N6852k1003m4230j5121n9690K5745m0903k2439l4610j9103o903
8171B63556l4948j5637k2482j2989M3636L1414n2304J0657q8164K3725J0175L9813
8159A96452K8689n4434M4354N1080k865l6841n2180L2957j5073j9981N1713m3192
8147A80679J9095N217J996K6795q113q74j7016l8033m48k2624k6497j348j4887
8134A03942L0841n4400p12q533k6377L8241l4483K8348o538j6222N4461j4345
8122I4223J0820L785k7801Q5045r156N417l1123k4634L1896l8783j7606l9610
8110D2473k4202Q0188J2022O036L4089M3841k536k4021l355m2414o1372O564k0040
$$ y = [309871, 323644, 354929, 348112, 265188, 274184, 311050, 359320, 412579, 459474, 473945, 453320, 475918, 444961, 501813, 480810, 436580, 421459, 361769, 387514, 346611, 324172, 289562, 270459, 263556, 228608, 212971, 190489, 177500, 221136, 252550, 200246, 210903, 122739, 146464, 156639, 196452, 225141, 170707, 215061, 266141, 263276, 226435, 174255, 207212, 192139, 172158, 223871, 180679, 199774, 204991, 206987, 233782, 225669, 224795, 207779, 169746, 169298, 146674, 120177, 118829, 103942, 134783, 80383, 79671, 71138, 44761, 83002, 48519, 76867, 70329, 54107, 108568, 94223, 105043, 108828, 81027, 166072, 156916, 162333, 131210, 106576, 138472, 99689, 82083, 42473, 18271, 98459, 110481, 116517, 150606, 194447, 191911, 167890, 164535, 122121, 60749, 67313, 47273]
8097D7273J13J5829o722R9716K5426L6995o96l357n4051n4655j6983l0995j7273
8084D0620L7950J0921J8120l2180k1282p147r775N8402J2380m399K3485l1730
8072I5365o1181R209n1788m3081L1444R9984Q0997M3995r722m1810r327l2925
8060A11160k0595m0916P608K4954Q0055M0279j4499K6030p741j392J9194n8528
8048A65609N633k2105K7682M870J9945M9900j3772O4282P228N620m5543q5456
8036A83893j4738p4792p1271L7504j2518N8968N2681L5561j6385p2092k6912J7364
8024I7263j8406L1896m2317J8159k7892p6178L1402m4407K8887J8324P4711M8530
8012A39972J3620L0964q0122k9980j1739j1885M3411J6372N2770k0741l3695j1811
$$ y = [47273, 47386, 63215, 56493, 156209, 181635, 218630, 217934, 214577, 160526, 105871, 88888, 57893, 40620, 78570, 89491, 107611, 75431, 54149, 47002, 37227, 95629, 108009, 103610, 127095, 95365, 34184, 43393, -8395, -51476, -20032, 79952, 160949, 204944, 195222, 153412, 144085, 111160, 90565, 49649, 57257, 82211, 162266, 202545, 188046, 214076, 206335, 204943, 224137, 165609, 171242, 149137, 176819, 181689, 201634, 251534, 237762, 302044, 309272, 314892, 269349, 183893, 169155, 94363, 23092, 60596, 48078, 107046, 159727, 195288, 178903, 106811, 79899, 97263, 78857, 110753, 68436, 86595, 58703, -17475, 13927, -30480, -1593, 16731, 91442, 139972, 153592, 184556, 104434, 74454, 62715, 50830, 94241, 110613, 163383, 142642, 108947, 97136]
8000I7136k0997L1341P2106M264k2976O5754L7677P341n0868j11064j6406J0212
7988A03520M9731J9475l3501j3382l2530j7409j5975L8367m0517k7418K947l097
7976C0211L1542p230k3173r587L8483m431M132n2381j3978L1209p216J557L191
7963B2329J6147K2698P0140L3668n5459n0298k208J3799K4596m0702Q817J2473
7951G6000K4816q876r78N5373O1648L8876l300m3471n8010q7920p7720j027L1181
7938F592P3201M6627R756J03052m6861k7449q532r0917M1578K6165m254j1978
7926A16980l5267M7573m4549k5941j0485j4461N2120J4140K2372L153k7962l4235
7914F3438j7521r571M471n5944l962Q778O2123K4085l3740L3995M0374J9094J1030
$$ y = [97136, 76139, 107480, 179586, 183850, 160874, 226628, 264305, 271646, 220778, 109714, 93308, 103520, 153251, 172726, 139225, 125843, 93313, 75904, 59929, 98296, 57779, 30361, 33308, 30211, 61753, 54523, 31350, 21763, 60246, 55815, 59947, 7566, -6412, 24797, 17581, 19138, 22329, 38476, 61174, 131314, 164982, 109523, 59225, 57017, 70816, 95412, 54710, 63527, 76000, 100816, 91940, 90962, 146335, 207983, 246859, 243559, 200088, 142078, 54158, -23562, -24589, 6592, 79793, 126420, 136176, 239228, 192367, 164918, 156386, 65469, 107047, 133212, 128958, 116980, 81713, 129286, 84737, 58796, 48311, 33850, 85970, 100110, 122482, 125635, 97673, 63438, 45917, 36346, 40817, -15127, -19089, -10311, 51812, 75897, 42157, 76152, 116526, 135620, 146650]
7901A46650l3027L9717m4270j9437k5650m1958m012J3913O5386O8750p801k1258
7889A37003m8357J0415J7922j0068j1231n0264k1970J9903j5483k6620J521M2566
7877D5337P4912J3772M1592l3581l4815n7296p3927k4248j9647O1788P3475M3355
7865A10717P6528n4525m4563n0685p509K5708p3994l149P1344N035R172O679l6678
7852C4080m0K9089K8183K1194K6083J1707l5735J5530l8150j4600k3483l3324
7840B0534P0201M5193J3467m8842j40L2845P383p463l8877l7607k8785K1251m6765
7827B395l7843O707K2164K150M7333L8480o1609L132q246k0669p85N938j3792
7814a4645O0183R5877K7153k4588N631j7427l3420j00895J7619N2691M2735O8713
$$ y = [146650, 113623, 153340, 109070, 89633, 63983, 22025, 18013, 31926, 97312, 166062, 158261, 137003, 88646, 99061, 116983, 106915, 95684, 45420, 23450, 43353, 27870, 1250, 2771, 45337, 120249, 134021, 175613, 142032, 107217, 49921, -24006, -48254, -67901, -6113, 67362, 110717, 187245, 132720, 88157, 37472, 29963, 55671, -18323, -21472, 49872, 54907, 64079, 70758, 34080, 34040, 63129, 91312, 112506, 138589, 150296, 114561, 130091, 91941, 77341, 53858, 20534, 90735, 135928, 149395, 100553, 100413, 133258, 140641, 133178, 94301, 56694, 27909, 49160, 2395, -35448, -28741, -6577, -4427, 42906, 81386, 19777, 22909, 14663, -6006, -6791, -853, -14645, 45538, 141415, 168568, 143980, 149611, 132184, 98764, -2131, 15488, 68179, 110914, 179627]
7802A79627L4426k56p5934m3360k9332K4053o108l9178m0379n8699R949K0062
7790b5129K7548J3835N7081M6074k3980k4345j00334k313M6551o4656O2539J1282
7778B4153p559L5329L9341N9647n3071O771Q076k2277M355R618n9204j4171n062
7765B5946K1126Q590K1329K8387L2470R7231m3519p8668J2151j18433N0959J4922
7753G2491o6112M7179l5224M8671m3254k4112r371j3857O4002L5837K5653k3133
7741G8770n1076j6909m870N067m341q406L5258J9605J6052O8639o0582K9336K8001
7728A34544j138O957n8754p688m7781k4312J5745m0588K4910O3923O6874N1239
7716A83931k4806j8006r5189J1589k436o0326M7L6643K0122Q9147N1359Q85k1982
$$ y = [179627, 214053, 213797, 137863, 94503, 65171, 89224, 83116, 43938, 3559, -55140, -45191, -25129, 2419, 16254, 73335, 119409, 95429, 71084, -29250, -31563, 14988, -49668, 12871, 24153, 16594, 51923, 91264, 150911, 97840, 104611, 112687, 90410, 94765, 104383, 45179, 31008, 25946, 47072, 55662, 76991, 105378, 137848, 235079, 191560, 112892, 125043, 6610, 57569, 72491, 6379, 53558, 18334, 67005, 23751, -361, -9732, -23589, 40413, 76250, 101903, 78770, 27694, 10785, 5915, 10982, 6641, -1765, 33493, 53098, 69150, 137789, 77207, 106543, 134544, 133406, 140363, 81609, 73921, 26140, 1828, 17573, -23015, 1895, 65818, 132692, 183931, 159125, 141119, 45930, 57519, 55083, -5243, -5196, 31447, 51569, 140716, 192075, 192960, 170978]
7703A70978o2836J6946n6814K3709l4743r8149Q0888l731O690O849J9178P6987
7691A45952j6658M0175n4609o5751M5926o4725J3745j237k1319J9642N6439N8787
7679A56367j4890j4300N3535L121K5432M6370j30000R484K2258l3728l0281o0878
7667C2490K1879J7122J14330R1193o5798J7803q0931q9227k2855j5253m3313o988
7655b9548J12143M4706J4824M9146p8841l7118J09993l0324m6564l5042K0942
7644I4317k3930k1762O8414q1961M500J25358n2452j1500K7305l1379P770L6408
7632A41088P059j16866J7701L95l8423Q0103q144q1326M5729P6447k9443L1269
7620A25589K762k9741n5618M2958P226r4864Q5663o604M3182J07504l9647q2329
$$ y = [170978, 108142, 125088, 68274, 91983, 57240, -40909, 39979, 36248, 42938, 49787, 68965, 145952, 129294, 169469, 114860, 49109, 95035, 30310, 44055, 42818, 21499, 41141, 97580, 156367, 141477, 127177, 180712, 183833, 209265, 255635, 125635, 135119, 157377, 123649, 93368, 32490, 54369, 71491, 185821, 277014, 211216, 229019, 148088, 58861, 36006, 20753, -22560, -29548, 82595, 127301, 142125, 191271, 112430, 75312, 185305, 154981, 108417, 73375, 94317, 70387, 48625, 117039, 35078, 39578, 164936, 112484, 100984, 128289, 96910, 104680, 141088, 148147, 31281, 48982, 49377, 10954, 91057, 82913, 1587, 47316, 123763, 94320, 125589, 128351, 98610, 42992, 85950, 93176, -1688, 83975, 77371, 120553, 228057, 188410, 106081]
7608A06081l3743L6709n2960k5970J8120q5122K5015O2404k0479n0057L4138J7616
7596C1752M927L2640m1725p2376P519L0339n2769J1748J3941P752J08355O2262
7584A44365J2656J813j8939m580p0320J1024L1774l6089K1778M4142k6847L1679
7572A42456m110j5209O7065L6759k2521q8094l5276o6543m6880O2135l9054L0492
7560B1220Q9362O8916O505m2079J688j11778m4416J0945n0046K7753M0650j4340
7548D380K6587J9255n072K1614N9217R0527m1644m1145K5050j31845l845K2148
7536D5227l5548P0838O1995R7698j3992J7041l3579j63060M2264m8105l5117R9709
7524A05371l0934l2883K6645K7301m1961p1893Q6674K7121P169N8340q7231n0809
$$ y = [106081, 72338, 109047, 56087, 30117, 48237, -36885, -11870, 50534, 30055, -20002, 14136, 31752, 36679, 69319, 27594, -44782, -37263, -6924, -59693, -47945, -34004, -26252, 82103, 144365, 157021, 158834, 139895, 135315, 64995, 76019, 107793, 71704, 93482, 137624, 110777, 142456, 138346, 123137, 190202, 226961, 204440, 116346, 81070, 14527, -32353, 29782, -9272, 21220, 110582, 179498, 186003, 143924, 145612, 33834, -10582, 363, -49683, -21930, 18720, 4380, 30967, 50222, 45150, 66764, 125981, 216508, 174864, 133719, 158769, 26924, 23079, 45227, 9679, 80517, 142512, 240210, 226218, 243259, 209680, 46620, 88884, 40779, 5662, 105371, 74437, 41554, 68199, 95500, 53539, -18354, 68320, 95441, 102610, 160950, 73719, 22910]
7512B2910L1315k0639j3857P905J01171L015L6052R1429j41852l051l6767q7421
7500i790M3612j2497M4516L1588M3718L867j20672M29n822m3476Q9869J623k0084
7487D6881P3069l8290k3801m3757L0263r768m0896Q9293o2330l2924O2256k6363
7475B3633L9816P1024K3446J4431J7842L5159p3838m4517k9499q5231K4248J3693
7463C0207L8305O8140J3430M1926L059j5293l3730r5266K7706l6333j4539M5781
7451G3393n0823K9590j8439K9433L0785k6562L1105J693M5418O474o2059k3971
7439F6037n1596r6304L2710O0872M8486J16500P0180N955l8711l7413l0340l6985
7427A09391M4356l2918k8992K1541M1859N8867l0882k7406l8942M287K9326l9825
$$ y = [22910, 54225, 33586, 19729, 27634, 128805, 131820, 167872, 259301, 117449, 114398, 77631, -9790, 33822, 21325, 65841, 97429, 141147, 145014, 24342, 24771, 18949, -24527, 65342, 66965, 46881, 119950, 81660, 57859, 14102, 44365, 34597, -6299, 82994, 20664, -12260, 49996, 23633, 63449, 134473, 157919, 172350, 190192, 225351, 151513, 106996, 77497, -7734, 16514, 30207, 68512, 136652, 150082, 192008, 195067, 179774, 146044, 50778, 78484, 42151, 27612, 73393, 22570, 52160, 33721, 63154, 93939, 67377, 98482, 100175, 145593, 152067, 90008, 66037, 14441, -81863, -49153, 11719, 60205, 176705, 246885, 252840, 214129, 176716, 146376, 109391, 153747, 120829, 91837, 113378, 155237, 214104, 183222, 155816, 116874, 121161, 150487, 110662]
7415A10662J5496J78k3727J6814j5678q2423j9621k2172q636L9916J7917J2606
7403D1332Q400M9368J1568l951r747l2840J8659M1139j294o718j7380M9933m259
7390A44210J7184L1466l1566K107N715l0176P11L1164n4510p55L7892K6163L436
7377A83041m9909j4907o6782R538o302o7016N4368K6387L7453p0351k9290J0776
7365A7006m9545M4781M4597K2054N002j6301m671J4600j0147l7331j9111N8291
7353F9225P0174K1758L5333J9644k2175J2968p3336K4396j7220J4929N0268k8571
7341A77393L5295k0990k8764K3400o8163k1300j2999J6343L8012J8738j9429n1802
7329H5734p2034M1585l8183n3289J7336k2804P1807K4419N7681M372K0747L3948
$$ y = [110662, 126158, 126336, 102609, 119423, 103745, 21322, 1701, -20471, -29107, 10809, 28726, 41332, 49732, 99100, 110668, 106717, 96970, 64130, 82789, 123928, 122634, 115916, 98536, 148469, 144210, 161394, 192860, 161294, 163401, 169116, 138940, 139651, 170815, 116305, 115550, 153442, 179605, 183041, 133132, 118225, 51443, 60981, 54679, -12337, 42031, 68418, 105871, 35520, 6230, 17006, -32539, 12242, 56839, 78893, 83895, 67594, 62923, 77523, 67376, 30045, 10934, 69225, 139399, 161157, 196490, 216134, 193959, 206927, 133591, 157987, 140767, 155696, 205964, 177393, 212688, 191698, 162934, 186334, 118171, 96871, 83872, 100215, 138227, 156965, 137536, 85734, 13700, 55285, 17102, -36187, -18851, -41655, 30152, 54571, 112252, 116624, 137371, 171319]
7317A71319p8305P99m708j2292N8440o679L8614L5004l1403Q33k4757L4059K6788
7304B07712m3491M0923p5881J4210M9711q7620j6374p870l4478O4139J7931j5271
7292A13641p0849L7015N4720n3128N6887k0474k5426L0258k9958N601o9372m6006
7280a7091L5474K7726R2072l3447J139Q6208l0059k6620o7056m4532k7065L8477
7268C5226N6380o168K7956L8748m6861K1468k9898l3376P6311K4693q714m4288
7256A11477J541l5091m2637O0067j5238k4022P8213k4083m889L6680k3810p6126
7244D2082k5379O2820q692M7092M8020n8249L257J8116q3000j3739K0196N438
7232E7962M3462Q2489k9635r9032L6487K9686n3312N9637L1918l1667N3167l579
$$ y = [171319, 93014, 93813, 89105, 76813, 135253, 128574, 167188, 202192, 170789, 171622, 146865, 180924, 207712, 164221, 205144, 129263, 143473, 193184, 105564, 89190, 81320, 46842, 110981, 128912, 113641, 42792, 79807, 134527, 81399, 138286, 117812, 92386, 122644, 92686, 98287, 28915, -17091, 18383, 46109, 138181, 104734, 105873, 192081, 162022, 135402, 68346, 23814, -3251, 35226, 91606, 85438, 113394, 152142, 105281, 126749, 96851, 63475, 139786, 164479, 155765, 111477, 113018, 77927, 35290, 95357, 80119, 56097, 134310, 110227, 105338, 142018, 118208, 42082, 16703, 79523, 70831, 117923, 165943, 107694, 110951, 129067, 46067, 32328, 52524, 57962, 101424, 183913, 154278, 55246, 91733, 121419, 68107, 127744, 159662, 127995, 181162, 177583]
7220A77583p0905l4913J7862l1202K5759J02853m4626o2274N7152n3320o8462
7209A5507K9255K0707r2481P2452P3995j599K1302K4722k5800k667K1766m1602
7197A15557j0794P8404P933m8895Q646m6830j3152Q6475N7339k246K625k040r2454
7184A40568o3638L9918j16945j2259R6349M2692r383L8064k5240q2560l3079K4856
7172C9343l6355J1847J1180k5554P1085J1623l0646m1847M4637N2443L628R2688
7160B04072L2993n1031K7705l2100r2081J2998K5497q173L1050O5801k826k4490
7148A89415L6580m9390M700N489n9460k7607M5044M75j8098J2919o283n2390L5872
7135A17266N1238n4797M4029M9483j0733P26K8398n4202p6100J1014J3735p8109
$$ y = [177583, 106678, 71765, 89627, 58425, 84184, 187037, 142411, 80137, 137289, 83969, 15507, 44762, 65469, -27012, 45440, 119435, 117836, 139138, 163860, 138060, 135393, 157159, 115557, 104763, 183167, 191100, 142205, 150851, 104021, 90869, 177344, 234683, 232437, 235062, 233022, 140568, 76930, 116848, -97, -12356, 83993, 126685, 117302, 155366, 130126, 47566, 14487, 39343, 2988, 14835, 26015, 461, 71546, 83169, 52523, 10676, 55313, 107756, 111384, 204072, 237065, 186034, 213739, 181639, 89558, 102556, 128053, 119880, 150930, 216731, 213905, 189415, 225995, 176605, 181305, 186794, 127334, 99727, 144771, 145246, 127148, 140067, 133784, 81394, 117266, 168504, 113707, 157736, 207219, 196486, 197212, 225610, 171408, 95308, 106322, 120057, 41948]
7123D1948j1015L1500j1956Q3081N7840q940n3034N5545M236j12157M2849o5328
7111E4569K5313J04641j8646J9485l6331K2581n1950k1060Q6476r2489M816L4444
7099A31849q3913K3359K5812k2317k5415P2838L0399n1521L5821m836r2541Q2800
7087A22335J533l6509N2327J2480j970j3763K0506k2247j6967Q0606q237j9281
7075A70813R308p0681j1556l4469m7292R646M6721P4848L3508m599K2108o9758
7063A28597o1134K229o8791l13R48O1632N7176O3491L4768j7393M4033M466p6823
7050A72886j1618n6157l5759j5653l5408R146P9264Q6239M1388K7773j6577m8062
7038A97462m2180m3508q6600k2959l6710J1492O9508O0103O4868L3655j4583N088
$$ y = [41948, 30933, 62433, 50477, 133558, 191398, 182458, 129424, 184969, 189205, 77048, 119897, 54569, 79882, 184523, 165877, 185362, 149031, 171612, 119662, 98602, 185078, 92589, 97405, 131849, 47936, 71295, 97107, 74790, 49375, 122213, 152612, 101091, 136912, 132076, 39535, 122335, 123868, 87359, 139686, 152166, 150196, 136433, 156939, 134692, 117725, 198331, 190094, 170813, 180121, 109440, 97884, 63415, 16123, 25769, 72490, 147338, 180846, 176247, 198355, 128597, 67463, 69692, 901, 588, 1536, 63168, 120344, 183835, 218603, 201210, 245243, 249709, 172886, 161268, 105111, 69352, 53699, 18291, 27437, 106701, 192940, 234328, 262101, 245524, 197462, 155282, 111774, 25174, 2215, -34495, -23003, 46505, 106608, 171476, 205131, 190548, 195636]
7026A95636o0629L4806l0778k8436p8J2165L3040j5698j5810J0157J7265R0142
7014B41782l6995m3428J2489j3660K6514j8916m6103j226j9196M2300N0785O4942
7002B59288j8222o6886J0541m4895p1804l1706l7541P8006K5298K7942j99l9477
6990I0345P3529k6846k6214J9523Q47K2245L216J6612n8776J8693N48m2639R6919
6977A88002J444m0877M6397L8374k1l4945R772K2795p6834J4680j8312k7978k841
6964A19656P364J8424K1431J6094O4033l1713N0695k2126q4450k0197p2735P449
6952G3925K1576M0153J0158M7269N2379j8870K8728J5899q1612J974J1762m9867
6940A53474J8588J0272K749l6473M3809K5376q934M2800J5202k0162K0457o0536
$$ y = [195636, 135007, 169813, 139035, 110599, 110521, 122686, 155726, 140028, 124218, 134375, 151640, 241782, 204787, 161359, 173848, 160188, 186702, 167786, 121683, 120457, 101261, 143561, 194346, 259288, 241066, 174180, 184721, 139826, 68022, 36316, -1225, 76781, 102079, 130021, 129822, 90345, 163874, 137028, 110814, 130337, 131184, 153429, 156645, 173257, 114481, 133174, 133722, 91083, 188002, 189446, 148569, 194966, 233340, 233319, 198374, 208146, 230941, 154107, 168787, 150475, 122497, 119656, 127020, 145444, 166875, 182969, 247002, 215289, 265984, 243858, 159408, 139211, 66476, 73925, 95501, 135654, 145812, 193081, 245460, 226590, 255318, 271217, 189605, 191579, 203341, 153474, 172062, 182334, 185083, 148610, 192419, 217795, 208861, 251661, 266863, 246701, 267158, 206622]
6928B06622n8925k4367L5851L3391k2435R8407O331J3439O7144l2153J1770m01
6916C34674n379o3717l2525l3618r9780J7949P1738K9435J19127L1957k5137l3873
6904C10851m5285n8739q9974l1871J5364J5888O8362M0511K1304M3403K2211J0411
6892C22436m8109N319j6002M148R4043j7648l7210m688m6428O175N5162P3014
6880C90212K53K75N497j7174J4664k7156j7258J0009l6998m3594j6349L3026J4869
6867C10276M7641M3369j4470p883j6849K1644k6669n045L5019K16K6176j624J1914
6854D23715j3437l7852K1971J7509M8254K7767j6798P8646J1608l9980k5786m4871
6842D50746K1800J3655k8992J8878q916M0884l392M1124m4418j07542M2945l1380
$$ y = [206622, 147697, 123330, 159181, 192572, 170137, 268544, 274875, 288314, 355458, 323305, 335075, 334674, 329295, 265578, 233053, 199435, 99655, 117604, 189342, 218777, 337904, 369861, 344724, 310851, 265566, 206827, 116853, 84982, 100346, 116234, 184596, 225107, 246411, 289814, 312025, 322436, 274327, 279646, 263644, 267792, 361835, 344187, 306977, 302289, 255861, 262036, 317198, 390212, 390465, 390740, 396237, 379063, 393727, 366571, 349313, 359322, 322324, 278730, 262381, 295407, 310276, 357917, 401286, 386816, 378933, 362084, 383728, 357059, 352014, 387033, 387249, 413425, 411801, 423715, 410278, 372426, 394397, 411906, 460160, 487927, 471129, 549775, 561383, 521403, 495617, 450746, 472546, 486201, 457209, 476087, 467171, 508055, 504663, 545787, 501369, 393827, 436772, 405392]
6830D05392L6061K6261o6363N5084L849P569K6533j347L6154n6481K8587M2018
6818E43317p4625K7734k0013J5004O6019k2840k2760q342N0327N2218q718L6114
6806F33435q8623m1877J5733j2967O0727K5782O9780k7543n5702L8174j31510
6795D85409n8090M1756o2649M5979k5871J7876J1520j2340L9236q4028O3177L4392
6783D96367o1578J9546m3285r7281r574N2604M7939L7045N1969K1268J0654n046
6771E20628o8925p7553o156n8902M5207O9563N9004j2990n137M1848p4455m312
6759D27820k189j07408m281M9822j2772j0673q721K1125j3967O1352K4344r222
6747D15230j5579o7828p5787m234j1507o7269L5554L9236j9296K0225Q050q724
$$ y = [405392, 441453, 467714, 401351, 456435, 460284, 467853, 494386, 493039, 529193, 472712, 501299, 543317, 468692, 496426, 476413, 491417, 557436, 534596, 511836, 503494, 553821, 606039, 597321, 633435, 544812, 502935, 518668, 505701, 566428, 592210, 661990, 634447, 578745, 616919, 485409, 427319, 469075, 406426, 452405, 426534, 444410, 455930, 443590, 482826, 398798, 461975, 496367, 434789, 454335, 411050, 313769, 304195, 356799, 404738, 441783, 493752, 515020, 525674, 520628, 451703, 374150, 367994, 309092, 354299, 423862, 482866, 469876, 464739, 506587, 432132, 427820, 425631, 318223, 313942, 363764, 350992, 340319, 331598, 352723, 338756, 400108, 424452, 415230, 399651, 331823, 256036, 251802, 240295, 173026, 208580, 247816, 228520, 248745, 256795, 248071]
6735B48071l4472L0106l1732q3047M3733L8283k9133j4151N1501M851P705P8858
6723C10573n116J2155P6333j9842m3430P801r7214K2093Q280j966Q2953P0911
6711D23531L9390k4479k9168k5409j30424m6890K190n595K8509k338K6012k6061
6699B29268k9242p020j7477K3384n0847M162K1566o8739N431l1094R094K4681
6687A13167J6807N0003N5186M7974K6592r0793J054k7465o950P8023l2123N3446
6675B84921j6475L8395N4985k8700K9841n6133M085L2464j1452R8319j3478K598
6663D19370l1313n0222P39p4313l598L5452j7120K5026L4R033P0245k4688L0264
6650C88909J5646n0536j0163j5661M5285N5250Q3723P0093l0718K2932j9972J2327
$$ y = [248071, 213599, 243705, 211973, 128926, 172659, 210942, 181809, 167658, 219159, 224010, 231715, 310573, 305457, 317612, 393945, 374103, 330673, 338474, 241260, 263353, 271633, 269667, 352620, 423531, 462921, 438442, 409274, 383865, 253441, 206551, 208741, 203146, 231655, 229317, 255329, 229268, 200026, 193006, 175529, 198913, 148066, 152228, 173794, 105055, 110486, 79392, 88486, 113167, 129974, 179977, 235163, 283137, 309729, 218936, 219990, 192525, 185575, 263598, 231475, 284921, 268446, 306841, 361826, 333126, 362967, 306834, 310919, 343383, 331931, 430250, 416772, 419370, 388057, 337835, 338574, 264261, 260663, 296115, 278995, 304021, 304055, 313088, 383333, 358645, 388909, 404555, 354019, 343856, 328195, 373480, 428730, 512453, 582546, 551828, 574760, 554788, 567115]
6638E67115p230n5979n3830o3296M1800K7710K7732N9161K6889o72M0075L0427
6626F39902N1216J08892O2354l5449o9375n1356m7156j11630K3244M1306p052
6615F04896J09170r429l8469j5233o6032j10181p5145J7061M839J14975J23406
6604F59858O2285P926q3779r6418j00260q6263n2669k4172k4685J7556o2683K7619
6592B44315J4925K2098O9370P125j4758l3444k0612j1547n9257P9932M2217o64
6580C39700Q4094J0015J7410q248n5182q986j9003N3500O499j670M2625k0017
6568D40737K1974J5201m1418j356j7627k9147J7736l1347J012p4364j5818J4577
6556C00160n888M0886l3241N972J9530J035L2539n6888k2643J0844P253J3279
$$ y = [567115, 559885, 503906, 450076, 386780, 428580, 456290, 484022, 543183, 570072, 569400, 609475, 639902, 691118, 800010, 862364, 826915, 757540, 706184, 659028, 547398, 570642, 611948, 604896, 714066, 704637, 666168, 650935, 584903, 474722, 399577, 416638, 421477, 536452, 659858, 722143, 730069, 646290, 549872, 449612, 363349, 310680, 286508, 261823, 279379, 216696, 244315, 259240, 281338, 350708, 357833, 343075, 309631, 289019, 277472, 218215, 298147, 340364, 339700, 423794, 433809, 451219, 442971, 387789, 378803, 359800, 413300, 419799, 418129, 460754, 440737, 462711, 477912, 436494, 435138, 417511, 388364, 406100, 374753, 375765, 301401, 285583, 300160, 294272, 335158, 301917, 307889, 327419, 328454, 360993, 304105, 281462, 292306, 299559, 312838]
6544C12838r793L413K7407L4052J4279p051k9970k5854n4086K0525R433j3494
6532B81699K5516M859J5994j8996L660M4284n2057j5943M248j0382p169J635M4815
6519C22163P1755K4911N719l5694M606m821j2823k1061k4198N68N890K5130K8739
6506C90884k7546L838j4804j0862J9274N365J6152k3829m0587j2620q048o17L9354
6493C35954P0523J02479L966J7541l0027l6916K5529k1207m1353q431K946N1064
6481D72068L8765O4975M7L7319J2817J0157n2935k7007j2519n1409o9060O8162
6469D91380K6111L736J25616L2534k5434k2356o3623q1721L668l163J7692K5193
6457E29633m6828J2658M6676N345K644J2228N6439j7589P364N4594q708n550N550
$$ y = [312838, 303045, 306458, 333865, 367917, 382196, 375145, 345175, 319321, 265235, 285760, 295193, 281699, 307215, 312074, 328068, 309072, 312732, 357016, 304959, 289016, 293264, 282882, 275713, 277348, 322163, 393918, 418829, 424548, 388854, 393460, 388639, 375816, 354755, 330557, 331125, 337015, 362145, 390884, 363338, 367176, 352372, 341510, 360784, 366149, 382301, 358472, 317885, 305265, 297217, 296600, 335954, 406477, 508956, 512922, 530463, 500436, 463520, 489049, 467842, 426489, 418058, 421004, 472068, 510833, 575808, 575855, 613174, 625991, 636148, 583213, 556206, 543687, 492278, 423218, 491380, 517491, 521227, 646843, 679377, 653943, 631587, 567964, 486243, 489911, 486748, 504440, 529633, 482805, 495463, 542139, 547484, 550128, 562356, 618795, 601206, 608570, 663164, 654456, 648906, 654456]
6444F54456K0494l7282M3282Q5409k9408N63L1029l7999K6309N4943L3756N7112
6432I02664M3225k0889o2530o484o3356m1406M0676J4265J7562Q0813L8041Q08
6420I43389J9043N2697p9744k1267L0120k308N1335N4105P6178M8829Q8949M2739
6408A304065P396J638L8787l9706P408o503m2657P2396O0690L0265R4037J35032
6396A662848N2682O2544J05793K8303n06Q253l5126M569L1106J7751j6094M018
6384A926141J7723k0422O0051P1804Q599N4116K4856p4355o6548K2976J8178l5135
6372B007984O5828J03847O2794J27145K9209N346P689n6434m0941L3323M3745
6361B389535P4889N9778J10615k967L8229P9048L6418M8493J10064J12726Q5838
$$ y = [654456, 674950, 637668, 680950, 766359, 736951, 737514, 768543, 730544, 756853, 811796, 845552, 902664, 945889, 925000, 862470, 855986, 792630, 751224, 791900, 806165, 823727, 904540, 942581, 943389, 962432, 1015129, 935385, 914118, 944238, 941930, 993265, 1047370, 1123548, 1172377, 1261326, 1304065, 1311461, 1313099, 1351886, 1312180, 1319588, 1313085, 1270428, 1342824, 1403514, 1433779, 1527816, 1662848, 1715530, 1778074, 1883867, 1912170, 1911664, 1919917, 1884791, 1889360, 1920466, 1938217, 1922123, 1926141, 1943864, 1923442, 1983493, 2055297, 2063896, 2118012, 2142868, 2068513, 2001965, 2024941, 2043119, 2007984, 2073812, 2177659, 2240453, 2367598, 2396807, 2402153, 2409842, 2353408, 2312467, 2345790, 2389535, 2464424, 2524202, 2634817, 2631850, 2670079, 2749127, 2785545, 2834038, 2944102, 3056828, 3142666]
6350C142666R1383J10532o727K7137J19735O0956J75064J68351J07444J49393
6340D145934J85086J78893J23533K17554K27976K07561L09090K02563J74318J56737
6330F129245J75695K56657L01303M62530N38004P65093J161674J486338J734899
6321A3011438J374807P50517K5441j88163J30861M86326Q93564J399878J992322
6312A9876991L023562M750957P606867J1507915J4823755J3488588O873136k230480
6304G9721291r822217j1002090q096838n357864l476679j685791Q14668M428472
6296D5522952P832768P771171M289642p33574m194983k216314K651007P706661
6288F8629330J0382334Q340612J869857n694803j0191993r611761o030701j891209
$$ y = [3142666, 3234049, 3344581, 3337854, 3364991, 3484726, 3545682, 3720746, 3889097, 3996541, 4145934, 4331020, 4509913, 4633446, 4851000, 5078976, 5286537, 5595627, 5798190, 5972508, 6129245, 6304940, 6561597, 6862900, 7325430, 7863434, 8628527, 9790201, 11276539, 13011438, 14386245, 15136762, 15162203, 14974040, 15104901, 15591227, 16484791, 17884669, 19876991, 22900553, 27651510, 35258377, 46766292, 61590047, 75078635, 81951771, 79721291, 69899074, 58896984, 50800146, 45442282, 41965603, 40279812, 41094480, 45522952, 53355720, 61126891, 65416533, 64682959, 60487976, 58271662, 60922669, 68629330, 79011664, 87352276, 89222133, 83527330, 73335337, 63723576, 57692875, 55801666]
6280E5801666K225566N014100L945898k10193n570125r177786p538746m260286
6272D0230094j339515J573699N567832J0706198J4814902J3103632N168245n868496
6264H3956591j4488490j5318246j2018871q768643o404624m803735l671765k919080
6256A5563137k140208j581546j104245p39034o69540m64385m28480m31340l88049
6247G616310l71387l08309l46206k22040j81450k58631j43214r0838l1616J18155
6237E780774J11345P849k17814k67534m13373k99451k23887k96718k36871j66906
6227C777414j68056r1586m2286n4217j03093q6912j05371j79224j00831j15403
6217B730435p5748o0806l9717n0154l1110J9688M2394n6513M0079l5667K8124
$$ y = [55801666, 58027232, 63041332, 66987230, 66777037, 61206912, 52029126, 44490380, 40230094, 38890579, 40464278, 46032110, 56738308, 71553210, 84656842, 89825087, 83956591, 69468101, 54149855, 42130984, 33362341, 26957717, 22153982, 18482217, 15563137, 13422929, 11841383, 10737138, 9998104, 9328564, 8864179, 8435699, 8004359, 7616310, 7244923, 6936614, 6590408, 6368368, 6186918, 5928287, 5785073, 5694235, 5662619, 5780774, 5892119, 5899968, 5682154, 5414620, 5001247, 4701796, 4477909, 4181191, 3944320, 3777414, 3609358, 3517772, 3475486, 3421269, 3318176, 3231264, 3125893, 2946669, 2845838, 2730435, 2654687, 2593881, 2554164, 2504010, 2472900, 2492588, 2534982, 2478469, 2518548, 2482881, 2511005]
6206B511005J88776J30737Q8318j6619j53054l00955j96481o4202j32786o4746
6196A989993L29j12074n5206j01017n1087n8418m5663j1294l4723L9637j6489
6185A543988k6496N5454Q7750R1188M6814L802l7654j48073q6864n9329m0540
6174A430040J21704M1813Q4508Q0273p4530j28352j66669p8908o3926n3673k377
6163A189903j29658n83K4314o8949M7203j7082k539j5211k2697Q0386K9515J4606
6151A129208j8098o1977L6355p9080j1699m013l6381N5088J9189M8941M8010j9606
6139A105937L6194p7804p4152k8896O880Q8597M4000J2519K4842k4910k1228k9999
6127A061980r849m7975p3699J3703o311J5705P320j6671L956j2227l2023j0668
$$ y = [2511005, 2699781, 2830518, 2918836, 2902217, 2749163, 2448208, 2251727, 2187525, 2054739, 1989993, 1990322, 1878248, 1823042, 1722025, 1670938, 1612520, 1566857, 1555563, 1520840, 1560477, 1543988, 1517492, 1572946, 1660696, 1751884, 1798698, 1802500, 1764846, 1616773, 1529909, 1470580, 1430040, 1551744, 1593557, 1678065, 1758338, 1683808, 1555456, 1388787, 1309879, 1245953, 1192280, 1189903, 1060245, 1059662, 1083976, 1015027, 1062230, 1045148, 1042609, 1027398, 1004701, 1085087, 1114602, 1129208, 1111110, 1049133, 1085488, 1006408, 994709, 990696, 954315, 1009403, 1028592, 1077533, 1125543, 1105937, 1142131, 1064327, 990175, 961279, 968159, 1056756, 1100756, 1113275, 1138117, 1113207, 1091979, 1061980, 1052131, 1004156, 930457, 944160, 937849, 953554, 960874, 944203, 948159, 935932, 903909, 893241]
6115H93241k9159k1870J4489J1356J7744r450K7301M3876m142N1411L6826l9661
6103I91962M2275N9593R3382N240Q2242O8874K8565O2344n816m921K1304n7372
6091A387672r4432L443J8720q559n222O7845L2515R322K0349k3453k064p236r6902
6078A301998m8806l2018N1061J4991N8520J25850k5624J4352M188r3577J1625
6067A382560o5916J1493R515k4671K8548q5895J9590n1102l7273O9296m3446N0945
6055A263644Q7490k1446n736r1401P478M275j2285O8533j3110M4833J91k0032
6043A312434M0975j06071Q55l1776q650M1801p6892R883k3248k2743J7308k9853
6031A124023J7150K0545J1207L916o5385k9294o6971j0016P9233R5416N9145J1525
$$ y = [893241, 864082, 842212, 856701, 868057, 885801, 876351, 903652, 947528, 943386, 994797, 1031623, 991962, 1034237, 1093830, 1187212, 1192452, 1274694, 1343568, 1372133, 1434477, 1428661, 1423740, 1445044, 1387672, 1293240, 1296683, 1315403, 1306844, 1301622, 1369467, 1401982, 1411304, 1431653, 1408200, 1406136, 1398900, 1301998, 1253192, 1221174, 1272235, 1287226, 1345746, 1471596, 1445972, 1460324, 1464512, 1370935, 1382560, 1316644, 1328137, 1337652, 1312981, 1341529, 1255634, 1275224, 1224122, 1186849, 1256145, 1212699, 1263644, 1351134, 1329688, 1323952, 1232551, 1240029, 1244304, 1232019, 1300552, 1287442, 1332275, 1332466, 1312434, 1353409, 1247338, 1248193, 1216417, 1207767, 1249568, 1172676, 1182559, 1159311, 1136568, 1153876, 1124023, 1141173, 1161718, 1172925, 1176841, 1111456, 1082162, 1015191, 1005175, 1084408, 1179824, 1238969, 1250494]
6019A250494l1436J661m5898K7558O1158L6550R9575J2736L1876K114n901R9172
6007A539659N6696Q7676L0583O8727N6209K5467j5179l5852k6237k9542O8634
5996A826841L95J8832M3368n414M4341L8947P9412K3114q894J0467n8625q8651
5984A924133n0517r855J9805M3979Q1751K1065K5119K0706j5972l621k3955m0523
5972A992115j0917K3587M6581K8268j3535R332N2362R6082P9886j736p897p6129
5960B217999o8200p9326j28838o4797q4907l2438L866Q499K8851N8046M3709J0564
5948A913028j5648l8537q4970n5187j7144k7087k2385j4714j6374M9334L7789
5937A708105j9073m4372k0374l0493n7014k032J240K9398N1536K5863M9268K5852
$$ y = [1250494, 1219058, 1220719, 1174821, 1202379, 1263537, 1300087, 1399662, 1412398, 1444274, 1446388, 1440487, 1539659, 1596355, 1684031, 1714614, 1783341, 1839550, 1865017, 1849838, 1813986, 1787749, 1758207, 1826841, 1827236, 1846068, 1889436, 1884022, 1928363, 1967310, 2046722, 2069836, 2060942, 2071409, 2012784, 1924133, 1873616, 1863761, 1883566, 1927545, 2009296, 2030361, 2055480, 2076186, 2060214, 2056593, 2032638, 1992115, 1981198, 2004785, 2051366, 2079634, 2066099, 2075431, 2127793, 2223875, 2303761, 2302025, 2294128, 2217999, 2149799, 2070473, 1941635, 1876838, 1791931, 1759493, 1763359, 1771858, 1800709, 1858755, 1902464, 1913028, 1897380, 1858843, 1773873, 1718686, 1701542, 1674455, 1652070, 1637356, 1620982, 1670316, 1708105, 1689032, 1644660, 1624286, 1593793, 1536779, 1534747, 1535987, 1565385, 1616921, 1642784, 1692052, 1717904]
5925A717904K3268m2437o7152l1801j47776j27215j2168q776k4633M2603p5925
5914A245892o7959R388K928n2336j3590K4143l2797O4440N654o8973J2453J1799
5902A141042J9158K5832K7505L8585J6237M1676n978n0346J6077J2853j8299P8670
5890A343012O5382n0390j3486L6945n6693k5046L2978J24J1209J17089J2351L0319
5878A503794Q5022N120j854Q3013M6496m1471L6085P6806J284R7193N4380l6931
5866A908937K7271K6314K4546O5144N7067Q8307R2496J73166P1652m1224n6312
5855B437364l9282J7797Q2810M8907K3778M2542N6588J161n0533K9641j4704M4226
5843B680295Q1499L3434J01716M0302L8908N0846O2344O1443L5178O0165N0226
$$ y = [1717904, 1741172, 1698735, 1631583, 1599782, 1452006, 1324791, 1312623, 1303847, 1279214, 1321817, 1245892, 1177933, 1187321, 1190249, 1137913, 1124323, 1148466, 1115669, 1180109, 1185763, 1116790, 1129243, 1141042, 1160200, 1186032, 1213537, 1252122, 1268359, 1310035, 1304057, 1253711, 1269788, 1282641, 1264342, 1343012, 1408394, 1358004, 1344518, 1381463, 1324770, 1299724, 1332702, 1332826, 1344035, 1461124, 1473475, 1503794, 1588816, 1593936, 1592082, 1675095, 1721591, 1680120, 1716205, 1793011, 1794295, 1891488, 1945868, 1908937, 1936208, 1962522, 1987068, 2052212, 2109279, 2197586, 2290082, 2463248, 2534900, 2493676, 2437364, 2398082, 2415879, 2498689, 2547596, 2571374, 2613916, 2670504, 2671665, 2621132, 2650773, 2636069, 2680295, 2761794, 2795228, 2896944, 2937246, 2976154, 3027000, 3089344, 3150787, 3185965, 3246130, 3296356]
5832C296356P4844J05443K4999O7947O5545N57K1929m81O2044J03116R9841J24331
5820D046471J30241R7288O6421K7485L0888J3055M7516J11783J06334J47361J80238
5809E005081R1449J14922K02001J93201J37574J25432J28190J18410J62904K22069
5799F501233J56004K23831L00253K26831L18411M48826L62338L31915L28912K99999
5789I498553L31474N44672O24187P33255J037381J142485J322636J673914K024381
5780A8932938K551987L501238N323438Q414415J3195414J7957036J7525978R923938
5772I7326382j383597j1802517j4739079j1607273p957162m755715j427189K514812
5764D6168662O580143Q454905N859030M86227n168029o471684l072830J807471
$$ y = [3296356, 3371200, 3476643, 3501642, 3569589, 3635134, 3635691, 3657620, 3657139, 3719183, 3822299, 3922140, 4046471, 4176712, 4274000, 4340421, 4367906, 4398794, 4411849, 4459365, 4571148, 4677482, 4824843, 5005081, 5096530, 5211452, 5413453, 5606654, 5744228, 5869660, 5997850, 6116260, 6279164, 6501233, 6657237, 6881068, 7181321, 7408152, 7726563, 8175389, 8537727, 8869642, 9198554, 9498553, 9830027, 10374699, 10998886, 11732141, 12769522, 13912007, 15234643, 16908557, 18932938, 21484925, 24986163, 30309601, 38724016, 51919430, 69876466, 87402444, 97326382, 95942785, 84140268, 69401189, 57793916, 49836754, 45081039, 43653850, 46168662, 52748805, 61203710, 67062740, 67548967, 62380938, 55909254, 52836424, 54643895]
5756E4643895P286621J2108549J3442233R347513R07236p408486j0862374q849600
5748G0615587l756674J380094L380919J113545l338988q351702r304109o654975
5740D5083697l991074j552371R16600M273438Q845748J3021484J2585515O031287
5732H5214324l720642j2222202j3973313j0918759p445410m815040l488231l124153
5724B5506574l135365k903268k047860j103376p36524p79796j082906j282719
5716A2434760j166650q94619o85738n35151n04715m04025l68330l39820k77968
5707G257744j91442k23146j88026k26767k93437k58445j95134j93501j24904r4715
5697E268227r0228j42455n6370q6298q6540k3181j16956j11311j16180j68060
$$ y = [54643895, 61930516, 74039065, 87481298, 96828811, 97736047, 90327561, 79465187, 70615587, 66858913, 68239007, 71619926, 72733471, 69394483, 61042781, 51738672, 45083697, 41092623, 39540252, 40456852, 44730290, 53576038, 66597522, 79183037, 85214324, 81493682, 69271480, 55298167, 44379408, 36933998, 32118958, 28630727, 25506574, 22371209, 19467941, 17420081, 16316705, 15580181, 14800385, 13717479, 12434760, 11268110, 10373491, 9687753, 9152602, 8647887, 8243862, 7875532, 7535712, 7257744, 7066302, 6843156, 6655130, 6428363, 6134926, 5876481, 5681347, 5487846, 5362942, 5268227, 5177999, 5035544, 4979174, 4892876, 4806336, 4783155, 4666199, 4554888, 4438708, 4270648]
5687D270648r8389j00788j582j35379j03557m2707r0619o5186o4783n6337q6384
5676C424937k9565K4762M8239J09129m346j18041m7263o0950j7210K6209o8942
5665C286959K5320K4484R1199J15507Q7848J61644O1170O6147K17850K81664N95213
5654E015005P70077O17694K50910q1246j6521M16661Q27400N78853j33998p80745
5644G464090j157175j014678o68029m51661l34078k28861j32783m103P6186K67404
5634C816312L33087L80021M60324M64415L64588J78678J6676K21985O51315P41628
5624G629029M59070j6810l83798m39062l88279o06248q92697q83527o84642m48665
5614C344371l51316k83172j39240j69705o0735l5705m9292P7584K00002L95398
$$ y = [4270648, 4172259, 4071471, 4069889, 3934510, 3830953, 3788246, 3697627, 3632441, 3567658, 3511321, 3424937, 3395372, 3420134, 3468373, 3577502, 3573156, 3455115, 3407852, 3346902, 3329692, 3355901, 3286959, 3312279, 3336763, 3427962, 3543469, 3631317, 3792961, 3854131, 3920278, 4138128, 4419792, 5015005, 5785082, 6402776, 6653686, 6572440, 6555919, 6972580, 7799980, 8378833, 8244835, 7464090, 6306915, 5292237, 4624208, 4172547, 3838469, 3609608, 3476825, 3472722, 3548908, 3816312, 4149399, 4529420, 4989744, 5454159, 5818747, 5997425, 6014101, 6236086, 6887401, 7629029, 8088099, 8071289, 7687491, 7248429, 6860150, 6253902, 5361205, 4477678, 3793036, 3344371, 2993055, 2709883, 2570643, 2400938, 2340203, 2304498, 2255206, 2332790, 2532792, 2928190]
5604B928190M95157L36170J64166j03599j60822k1270K9609n5740k36032l57513
5594C018316m08545l45944k41919j77264j01138r5454r3790q4117n5081l8259
5584A376805q5044m3978j8912r5238l7710R735m2092M1046n487l2154o7844l9580
5572I59547q8167j14537k7803n859M1150O4552K5495k4365N3274j6312Q032L4570
5560I09577j6763m1366j1752o7775r1825o3205Q345L123P4884Q2670M4948N0940
5548H81801M1189q6982j01539j04738l5471j6259O1040M3915k2394L8911J4227
5537G13700m5959N4393K6412j2834J4703o747o5141r7148r1207o3649K8954J06189
5525E61666N1350J10029N8376j2382p3727p3027o4527r2732M3286K5383l756P1995
$$ y = [2928190, 3423347, 3759517, 3923683, 3820084, 3659262, 3637992, 3667601, 3611861, 3375829, 3018316, 2609771, 2263827, 2021908, 1844644, 1743506, 1648052, 1554262, 1470145, 1415064, 1376805, 1291761, 1247783, 1228871, 1133633, 1095923, 1105658, 1063566, 1104612, 1099125, 1066971, 999127, 959547, 871380, 756843, 729040, 723181, 764331, 828883, 854378, 830013, 883287, 866975, 875007, 909577, 892814, 851448, 839696, 771921, 680096, 616891, 625236, 628359, 703243, 785913, 830861, 881801, 922990, 836008, 734469, 629731, 594260, 578001, 639041, 682956, 660562, 699473, 713700, 667741, 722134, 748546, 735712, 750415, 743668, 678527, 581379, 490172, 426523, 455477, 561666, 613016, 723045, 781421, 769039, 695312, 622285, 557758, 465026, 508312, 533695, 529939, 601934]
5513F01934k1816m7994O0144k087L439j0904l40m8490K6621Q8854m7568k3483
5501E78310M2696K1599M5031L4165J5200l3761j2339Q163j1144N6761M4197O5550
5489H54428J05846o315r4872o2391n8339m0723m0042J767o0042m840M859r0131
5477E09205m2397O890k9843k10N1464M4994Q206J2303L749m8997P984K6477k618
5464E47207O6849L8592p608j910l7M652j7570P8890J7934K6606O1687K1514P174
5451H43980J1835J1110J8799L6295L0946n534l082l9570R419R132J4635j5732
5439I22233m0736l8253k5474J7650l807R738p002Q3809J10519N5899J33681J2157
5427A230414J8767m3285n2407j6358j9853j7830P5269M7581O7200K1060M9603
$$ y = [601934, 580118, 532124, 592268, 590181, 593620, 582716, 582376, 533886, 560507, 649361, 601793, 578310, 621006, 642605, 687636, 721801, 737001, 703240, 690901, 699064, 687920, 744681, 788878, 854428, 960274, 953959, 859087, 796696, 738357, 697634, 657592, 659359, 599317, 594477, 599336, 509205, 466808, 473698, 443855, 443645, 495109, 540103, 548309, 560612, 564361, 515364, 523348, 549825, 547207, 614056, 652648, 645040, 643130, 643093, 647745, 630175, 709065, 726999, 753605, 815292, 836806, 843980, 855815, 866925, 885724, 922019, 952965, 947431, 944349, 904779, 914198, 923330, 937965, 922233, 881497, 843244, 817770, 835420, 831613, 841351, 834349, 918158, 1028677, 1084576, 1218257, 1230414, 1249181, 1205896, 1153489, 1137131, 1117278, 1099448, 1174717, 1222298, 1289498, 1310558, 1360161]
5416A360161J99190M25900O02109M95227J40144k55600n34040m08658k98684j67360
5406A558389j35427j51740j66050j64475j21010j14787p2937K7292n7654M9132
5396F50733O041M542N5021K4511k7960l8818Q26j6024k6911p85m6352o9489l223
5383E12112k8979L6360N3097O5988L1355j5657k0312m9196o6415j8567O495L5059
5371E41340K722J7403L2724M4944L1172r707j5303j8907J783M2148Q667P737j7893
5358F68830l4717o1308l7356J7599J5643N4368O9201J1751K2079O946m2500p2867
5346F17669l5945o2029k1361j3312l5479L2409J00188M7141L2564M643J7763M5677
5334G29928J9661j5799k0318o790M5730j3576J4732J9443j6038L7283O1513m880
$$ y = [1360161, 1559351, 1985251, 2587360, 3082587, 3222731, 2967131, 2433091, 2024433, 1725749, 1558389, 1422962, 1271222, 1105172, 940697, 819687, 704900, 631963, 659255, 601601, 650733, 656774, 661316, 716337, 740848, 712888, 674070, 674896, 658872, 631961, 631176, 584824, 515335, 512112, 483133, 519493, 572590, 638578, 669933, 654276, 633964, 584768, 518353, 499786, 506281, 541340, 544062, 561465, 594189, 639133, 670305, 660598, 645295, 626388, 628171, 670319, 678986, 686723, 668830, 634113, 572805, 535449, 553048, 568691, 623059, 692260, 704011, 726090, 733036, 690536, 617669, 581724, 519695, 498334, 485022, 449543, 481952, 582140, 629281, 661845, 666488, 684251, 729928, 749589, 733790, 713472, 706682, 752412, 738836, 753568, 773011, 756973, 794256, 855769, 850889]
5322H50889m2670K0302o5205j03139J3859l0440K7875M9111P3950n911l231n1800
5310G33590l1429M6389R2069k8471L4641M0292O327J04664J72124J13889J25445
5299A409530K8798L9672p1573k9418q8901p1536K0957l7796l5895K4876L525l2618
5287A159621p7930j5720J0003O9325J35882M3486K2283j4884j33128q95M188l6182
5275A166049j5372M5984O5823M9958J22897J26656O9199J01809k4214l4261m8154
5264A626374o4278k5588n2459j1585n1489r1571J0149q7258m1739K2503n2634
5253A180425r451K7388J8692O7162K8611O0687n1527k5733N0050o8248J01771
5242A379827N3488L3874P5423O1659N6001n180o2445m7059o8427P830p352P0234
$$ y = [850889, 808219, 828521, 763316, 660177, 674036, 643596, 671471, 720582, 794532, 788621, 785390, 733590, 702161, 748550, 840619, 812148, 846789, 887081, 893408, 998072, 1170196, 1284085, 1409530, 1438328, 1478000, 1406427, 1377009, 1288108, 1216572, 1237529, 1199733, 1163838, 1188714, 1192239, 1159621, 1081691, 1065971, 1075974, 1145299, 1281181, 1324667, 1346950, 1332066, 1198938, 1198043, 1202231, 1166049, 1150677, 1196661, 1262484, 1312442, 1435339, 1561995, 1631194, 1733003, 1708789, 1674528, 1626374, 1562096, 1536508, 1484049, 1472464, 1420975, 1329404, 1339553, 1252295, 1210556, 1233059, 1180425, 1170974, 1198362, 1217054, 1284216, 1312827, 1373514, 1321987, 1296254, 1346304, 1278056, 1379827, 1433315, 1467189, 1542612, 1604271, 1660272, 1655092, 1592647, 1545588, 1477161, 1484991, 1477639, 1547873]
5230A547873J5430J6246k6404j8366q573N4203M1343P6402M4771M9759Q3799K5082
5218A901565n996J904j9552N8763l119N3378q952L2133j1188M2589L8299L7596
5206B117420J4363O5239K724N2742J2827L4363J4911Q1142L4169P1721K5678K3855
5194B551154l9348k7727J0971L7976K8445N5845O2834J30111l8263J02950j2018
5183B862930l535L8804M3691k5634Q0679Q7392M8864k645M7543k4683L2029M1824
5171C227259O3700K821J41862N2912R0338J07317J04018Q2487J57073J62546Q8896
5160D281229Q1364J34625J0857J48490J16260J46197J63882J80333J77432J61476
5150E602145K41063K19691J77605K05091J70627J84025K16173J35974R3749J19219
$$ y = [1547873, 1563303, 1579549, 1553145, 1534779, 1526206, 1580409, 1621752, 1698154, 1742925, 1792684, 1876483, 1901565, 1895569, 1897473, 1877921, 1936684, 1933565, 1986943, 1977991, 2010124, 1998936, 2041525, 2079824, 2117420, 2131783, 2197022, 2199746, 2252488, 2265315, 2299678, 2314589, 2395731, 2429900, 2501621, 2527299, 2551154, 2511806, 2484079, 2495050, 2533026, 2561471, 2617316, 2680150, 2810261, 2771998, 2874948, 2862930, 2859395, 2898199, 2941890, 2916256, 2996935, 3084327, 3133191, 3130546, 3178089, 3153406, 3185435, 3227259, 3290959, 3293780, 3435642, 3488554, 3578892, 3686209, 3790227, 3872714, 4029787, 4192333, 4281229, 4362593, 4497218, 4508075, 4656565, 4772825, 4919022, 5082904, 5263237, 5440669, 5602145, 5843208, 6062899, 6240504, 6445595, 6616222, 6800247, 7016420, 7152394, 7246143, 7365362]
5140G365362J89641K86016L84984N82823N21071M39169M69656L84235N42431O31967
5130A1797355N77859L98967L57746M15759O14442Q03511J073586J050516J404192
5121A8493933J588890K146377K681264M208656O636765R929401R784528N931459
5113F1401273L60797m988401m509082j197696R33943K980411M600875P521424
5105F7103544J1089326J7904227L0956766N8577282R8641528J18536718P7910465
5098D80719856J3282030p1957632j11224822q3497011n7556020l9083358k8871725
5091A01811318k0873709j6365693j2262338q986302n566714l887205k247053k078590
5083B9543714j660156k046289j682034j650953j152807j192837j006245j118798
$$ y = [7365362, 7555003, 7841019, 8226003, 8808826, 9329897, 9769066, 10238722, 10622957, 11165388, 11797355, 12375214, 12774181, 13131927, 13547686, 14162128, 14965639, 16039225, 17089741, 18493933, 20082823, 22229200, 24910464, 29119120, 35755885, 45685286, 55469814, 61401273, 61762070, 56773669, 52264587, 51066891, 52000834, 54981245, 59582120, 67103544, 78192870, 96097097, 127053863, 185631145, 284272673, 402809391, 480719856, 494001886, 422044254, 310819432, 227322421, 169766401, 130683043, 101811318, 80937609, 64571916, 52309578, 43323276, 37756562, 33869357, 31622304, 29543714, 27883558, 25837269, 24155235, 22504282, 21351475, 20158638, 19152393, 18033595]
5075A8033595r55827r92358p11924p63194n41416o86827n92626q25032n37723
5066A1426668m44880k68914l02594k45363l48349j84258k02567j29378k33367
5057I066998j98364l44176k18603j67597M9277J33823M90060O81168R10672J027061
5047A1430319M32913k88522j076045j439137j081816q11127n37790m79019l36240
5038E813536k75565k44828j73488o3356r9443p8858j07820m7922p3030l143J59468
5027D805551J69353M15948M71066J25912k07703n41803n19891l46954j81146j66806
5017D023527k08223j79720k67408j36677r9831o6675l6088K0058k5079r880o8534
5006B945470p3832r6621l3838K9167L2947J0610K2693p9617p7762j19988r9305
$$ y = [18033595, 17077768, 16085410, 15373486, 14610292, 14068876, 13382049, 12789423, 11964391, 11426668, 10981788, 10712874, 10410280, 10164917, 9816568, 9632310, 9429743, 9300365, 9066998, 8868634, 8524458, 8305855, 8138258, 8187535, 8321358, 8811418, 9492586, 10403258, 11430319, 11863232, 11574710, 10498665, 9059528, 7977712, 7166585, 6628795, 6149776, 5813536, 5537971, 5293143, 5119655, 5056299, 4956856, 4877998, 4770178, 4722256, 4649226, 4646083, 4805551, 4974904, 5390852, 5861918, 5987830, 5780127, 5238324, 4718433, 4371479, 4190333, 4023527, 3815304, 3635584, 3368176, 3231499, 3131668, 3064993, 3028905, 3048963, 3023884, 3014004, 2945470, 2871638, 2775017, 2741179, 2770346, 2803293, 2813903, 2836596, 2756979, 2679217, 2559229, 2459924]
4995B459924j22214j7681k7559j028R1135M9640q1653k3752j06383n4465l6241
4984B129723J0481o9502j4727q0782n2402N667n357O515J11220k887m0642m1872
4972A955435q1436j01815l3495J8585R2439J05715J30263L4687l5338j25142j60188
4961A799710j18658m1521o7438k969k1603k8436m8103J262j8171M2911N5753R3082
4949A645819L8652O2667m1118m2762m1605o3409n9989m64K1684j8911N9089J13102
4937A672755j8784P2284R4347P1122J9557K8648j42849j85410r7298j09798j30515
4926A274059L3060m3619J094O5863K3586l5716n054p318j40104n2021J3484o8323
4914A058991R0333J58888j718N219j9693n6102l8498Q3270N7041j7841J15060
$$ y = [2459924, 2337710, 2320029, 2292470, 2291442, 2382577, 2432217, 2350564, 2326812, 2220429, 2165964, 2129723, 2140204, 2070702, 2055975, 1975193, 1922791, 1928458, 1923101, 1929616, 2040836, 2037949, 1997307, 1955435, 1873999, 1772184, 1738689, 1757274, 1849713, 1955428, 2085691, 2120378, 2085040, 1959898, 1799710, 1681052, 1639531, 1572093, 1569124, 1547521, 1519085, 1470982, 1472244, 1454073, 1496984, 1552737, 1645819, 1684471, 1747138, 1706020, 1663258, 1621653, 1558244, 1498255, 1497791, 1519475, 1500564, 1559653, 1672755, 1653971, 1726255, 1820602, 1891724, 1911281, 1939929, 1797080, 1611670, 1514372, 1404574, 1274059, 1307119, 1263500, 1264594, 1330457, 1354043, 1318327, 1313273, 1305955, 1165851, 1113830, 1127314, 1058991, 1149324, 1308212, 1306494, 1311713, 1292020, 1235918, 1197420, 1280690, 1337731, 1319890, 1434950]
4903A434950Q3439N3030J04842q028j07328p2292n7312q1363r9026J4622n4905
4892A210629o0303R8873l3359O1173J58833J06926l890M6004J37510K28346L69292
4881B320034M80424L70251L38149J70817j00144j66592l67858m84129l44127k81952
4871A934873j62439k52283q0425j27324j83697j950p590M3329K9874K0409L3823
4860A246600j09616n4487j29034j08270M1433M45J10959J17445j9597L3186p3734
4849A055330j8552p1787q6568L5352m1978N6375L7679p9970N0043k6370J9532
4838I29086P820j4158L7976q1531l164l9340j14438L6632l0879R8863J08490J27155
4826A062512Q5945m4743l1845m2357o4330j2983j02301M1345L6875L3343N7910
$$ y = [1434950, 1518389, 1571419, 1676261, 1668233, 1560905, 1488613, 1431301, 1349938, 1250912, 1265534, 1210629, 1150326, 1249199, 1215840, 1277013, 1435846, 1542772, 1538882, 1584886, 1722396, 1950742, 2320034, 2800458, 3170709, 3508858, 3679675, 3579531, 3412939, 3045081, 2560952, 2216825, 1934873, 1772434, 1520151, 1439726, 1312402, 1128705, 1126755, 1119165, 1162494, 1192368, 1212777, 1246600, 1136984, 1082497, 953463, 845193, 886626, 887071, 998030, 1115475, 1095878, 1129064, 1055330, 1036778, 964991, 878423, 913775, 871797, 928172, 965851, 885881, 935924, 909554, 929086, 936906, 922748, 960724, 879193, 876029, 836689, 722251, 758883, 728004, 826867, 935357, 1062512, 1148457, 1103714, 1071869, 1029512, 965182, 952199, 849898, 891243, 928118, 961461, 1019371]
4815A019371n039k5422p710k0794L7870k5065K3675K6518j9913K6248m3084k2497
4803I64158M098q333M8977m4823q51O312k4599P5942L4231M897L6981M4778J8587
4790A160355k1821l2777K4000N5181J61027L11634M59560P01261N23360K22925
4780C564705j73583m83649m30442l13001k23130k14488j97376j47075j54048j24020
4770A103893l8987j16865m8063m789o509J7048L3262K2846j22047q3612M4347
4759H00524q2443M3060J9294n7451P2715k016j7501l0217m6179K5430m8418Q6019
4747G62817l5163Q321R0616k2227K3447Q0021J423M5298k5900O942p6961l4806
4735H23828N4183j3489O3436O8428p3598N4021n2388o5693k6129m8577k8424o2179
$$ y = [1019371, 1014332, 988910, 981200, 960406, 998276, 973211, 996886, 1023404, 1003491, 1029739, 986655, 964158, 968256, 959923, 1008900, 964077, 963226, 969538, 944939, 1020881, 1055112, 1060009, 1096990, 1141768, 1160355, 1138534, 1105757, 1129757, 1184938, 1345965, 1657599, 2117159, 2818420, 3341780, 3564705, 3391122, 2907473, 2477031, 2164030, 1940900, 1726412, 1529036, 1381961, 1227913, 1103893, 1064906, 948041, 899978, 895189, 888680, 905728, 938990, 961836, 839789, 756177, 800524, 718081, 761141, 780435, 722984, 795699, 793683, 776182, 745965, 699786, 725216, 676798, 762817, 727654, 735975, 826591, 804364, 827811, 907832, 909255, 954553, 928653, 935595, 858634, 823828, 878011, 864522, 927958, 996386, 922788, 976809, 924421, 858728, 832599, 784022, 755598, 693419]
4723F93419K1734k2414o5964R2207n1938O826O1881J3935N0690J8759k3721m4934
4711G50480l0549J8352k3798P4953P0571R272O5616M7728l6131J6096j4777k9699
4699I18114n6577O3598M9028q1784L1444q335K2205N3444K0681J0583J1321L4717
4687A068439n1840k3836N887m7514L966J0316k0783J4P1785J6451j2224K7985
4675A048646K0015R124J0846m1513o6131n3022k4493l6621P461K7868K564K5054
4663I29798K1665m9740o8231k0430k7778n181M1818M5340L2778O6823j908n0896
4651I14058K6345r2869j5824L0213R6880M8477L723J6923n0127o5285k151r4396
4639H15967K3512k0384m4677M0585k7924J5414Q0785l0486j857n3648R948n1499
$$ y = [693419, 715153, 692739, 626775, 718982, 667044, 673870, 735751, 749686, 800376, 819135, 795414, 750480, 719931, 738283, 714485, 789438, 860009, 869281, 934897, 982625, 946494, 962590, 947813, 918114, 861537, 925135, 974163, 892379, 923823, 915488, 937693, 991137, 1011818, 1022401, 1033722, 1068439, 1016599, 992763, 998650, 951136, 955102, 965418, 944635, 944649, 1016434, 1032885, 1020661, 1048646, 1068661, 1077785, 1088631, 1047118, 980987, 927965, 903472, 866851, 874312, 902180, 904744, 929798, 951463, 901723, 833492, 813062, 785284, 780103, 821921, 867261, 900039, 966862, 964954, 914058, 940403, 847534, 831710, 861923, 958803, 1007280, 1011003, 1027926, 977799, 912514, 910363, 815967, 839479, 819095, 774418, 815003, 787079, 802493, 883278, 852792, 850935, 797287, 807235, 755736]
4627G55736p9472K2542j0488O1517P601R3Q0957M031L4610l8114l5360J8572q3015
4614G39210M8559K8013k0047K4622n452L7935N9531M4300M0052k3824O7276m678
4602A035497k2723n005j12672k5927k2499j1882P8722M2859O5023Q9582J5304
4591A126279j2147j12845k2243k6186l8545M8838k674N2512P5312J6605J06893
4580A211799M5799O2452Q9976N9112N2151q4022p6600l4665p0918l3868r4341
4569A126875k0968L5012m4888M9396O2502K334P1645J1589M7985k2454l5526k9079
4557A254423n7801R525O811K4534N3825K2304k26l3193j503p61j05594J4662o6749
4544A120257o2363k3173o1101J9309J10409O1157l564m5679j8311k7236l4267
$$ y = [755736, 676264, 698806, 688318, 749835, 757436, 757529, 838486, 842517, 877127, 839013, 803653, 822225, 739210, 787769, 815782, 795735, 820357, 814905, 852840, 912371, 956671, 996723, 972899, 1040175, 1035497, 1012774, 1007769, 895097, 869170, 846671, 834789, 913511, 956370, 1021393, 1110975, 1126279, 1114132, 1001287, 979044, 952858, 914313, 963151, 960477, 1012989, 1088301, 1104906, 1211799, 1257598, 1320050, 1410026, 1469138, 1521289, 1437267, 1360667, 1326002, 1255084, 1221216, 1126875, 1105907, 1140919, 1096031, 1145427, 1207929, 1210263, 1281908, 1293497, 1341482, 1319028, 1283502, 1254423, 1196622, 1206147, 1212958, 1237492, 1291317, 1313621, 1313395, 1280202, 1278699, 1277938, 1172344, 1187006, 1120257, 1057894, 1034721, 973620, 992929, 1103338, 1164495, 1160931, 1115252, 1096941, 1069705, 1035438]
4533A035438j1501n7722l4177J9215L1863J5267R008L4682J62K838l083l206j9886
4520A018898k709p9936j7920N2700Q365l001M5490J6588L1937L6354k0154o4007
4508A022605J0099L710l5202M6303k7737o816J03059m573n8008N2009L5394K9054
4496A169897J2880q587j7762j06968l8613m7642L522K7696r954Q7827R2957M566
4484A169819n8309m9715k5740r1828L071M7590N76P2572Q9442K3265N6548N1641
4472A288932L8061l6223o4457q6129p2436p34l2345R32R4551O6600O1640O7276
4460A325668J1703m5612m9781J3569k3368K5861O6208j0074m9810M7p778k6823
4448A229810M508j7932L238K2348K9629n7558r453K334j10648K1553P6742K1819
$$ y = [1035438, 1023937, 966215, 932038, 951253, 983116, 998383, 1007391, 1042073, 1042235, 1045073, 1041990, 1038784, 1018898, 1016189, 936253, 918333, 971033, 979398, 976397, 1021887, 1038475, 1070412, 1106766, 1086612, 1022605, 1032704, 1036414, 1001212, 1047515, 1019778, 1012962, 1116021, 1111448, 1053440, 1105449, 1140843, 1169897, 1182777, 1174190, 1156428, 1049460, 1010847, 963205, 966727, 994423, 984469, 1072296, 1165253, 1169819, 1111510, 1061795, 1036055, 944227, 947298, 994888, 995464, 1068036, 1157478, 1180743, 1237291, 1288932, 1326993, 1290770, 1226313, 1140184, 1067748, 1067014, 1034669, 1035601, 1130152, 1196752, 1258392, 1325668, 1337371, 1291759, 1241978, 1255547, 1232179, 1258040, 1324248, 1314174, 1264364, 1264411, 1256633, 1229810, 1234318, 1216386, 1219624, 1241972, 1271601, 1214043, 1204590, 1206924, 1096276, 1117829, 1194571, 1216390]
4436A216390N6967K0703M9184L4628M526k9987j04523M3803O4008K2624K7953
4425A406276L0396K2811N3251L8691j0812n0712K1976n756k947j5606q1503l9264
4413A366801K3832J9919M7394L4925p703l9079l9296M5343k1666j0503K5070L505
4401A448542N6177J0180n2610P250l2784J0093K7445N199M3573m3587P0688R231
4389A559397o7761L0026j8694Q065J5334r910L5431l1922M2408O3319P588K9509
4377A662790j3347N25J9132q651K6464J3102Q4030O8096N5314J23765M9810O0480
4365B141510J1205j10486r2995j27661p8935n6892n907O1902m2676m8139L9779
4354A690705q0109j2095l4997r4255m3979l6477L1119J1581K3747J5060l7831
$$ y = [1216390, 1273357, 1294060, 1343244, 1377872, 1382398, 1352411, 1247888, 1291691, 1355699, 1378323, 1406276, 1436672, 1459483, 1512734, 1551425, 1540613, 1489901, 1511877, 1506121, 1503174, 1487568, 1406065, 1366801, 1390633, 1410552, 1457946, 1492871, 1485168, 1446089, 1406793, 1452136, 1430470, 1419967, 1445037, 1448542, 1504719, 1514899, 1462289, 1469539, 1436755, 1446848, 1474293, 1479492, 1523065, 1479478, 1550166, 1559397, 1491636, 1521662, 1502968, 1511033, 1526367, 1516457, 1551888, 1519966, 1562374, 1625693, 1633281, 1662790, 1649443, 1649968, 1669100, 1660449, 1686913, 1700015, 1784045, 1852141, 1907455, 2031220, 2081030, 2141510, 2152715, 2042229, 1949234, 1821573, 1742638, 1685746, 1679839, 1741741, 1699065, 1650926, 1690705, 1610596, 1598501, 1563504, 1469249, 1425270, 1388793, 1419912, 1431493, 1455240, 1470300, 1432469]
4343A432469P3835m2478l1004J8172l6059K1749m807L0549j8879j6421M8538M9530
4331A525194j1096J836n7497j8616L0164l498J3167n8380J9320K3971K3635L5909
4319A524109r6861J0859l8954p3303j9966J226N2638Q2745N2055P4678M2845R1700
4307A703771L8335M4089R4867N2075J04310J29950J29561K85694L70586N46231
4297C499469O54640M39422K63288k07067m58324n95248n78023l54555l49170j94373
4287B120059o4509m7997O3871R2j39114j84197k46616j23852p4979m6197K6533
4276A283094j9517j7580q9689k4649n5742m0811N9949J0731J7620K6020p9165
4265A070261n6652m9173j6432M2695Q89L5031L8660N4411k3261o5053j3771o6055
$$ y = [1432469, 1506304, 1463826, 1432822, 1450994, 1414935, 1436684, 1431877, 1462426, 1443547, 1427126, 1475664, 1525194, 1514098, 1515934, 1458437, 1439821, 1469985, 1466487, 1479654, 1421274, 1440594, 1464565, 1488200, 1524109, 1427248, 1438107, 1399153, 1325850, 1305884, 1307110, 1359748, 1442493, 1494548, 1569226, 1612071, 1703771, 1742106, 1786195, 1881062, 1933137, 2037447, 2167397, 2296958, 2582652, 2953238, 3499469, 4154109, 4593531, 4856819, 4649752, 4191428, 3596180, 3018157, 2663602, 2314432, 2120059, 2055550, 2007553, 2071424, 2071516, 1932402, 1748205, 1501589, 1377737, 1302758, 1256561, 1283094, 1263577, 1245997, 1156308, 1131659, 1075917, 1035106, 1095055, 1105786, 1123406, 1149426, 1070261, 1013609, 964436, 948004, 990699, 991588, 1026619, 1065279, 1119690, 1096429, 1031376, 1017605, 951550]
4253I51550j2678L3502n941l9683k9181j5614P31M4687J852N2195M9930N3810
4241A085160r4180j50290n9664j19193L038P1814L2150J22681R7918L4636k1687
4230A002383m2643r5067j48792j4041l689o2236J14644J9837J2107O7080N8223
4219I07806N8921L1041j6628j3451n7487j7697j13587n2430M2343k3337O5061
4208H10555R9948P9017L9559L3133J0696r6397q6772m1421p8985M3585N5329j1747
4196H56500o61K6705l1490j5829Q2050p5276n2502L6688j6932m485J2201k8072
4184G88897N6898O8238N335R595m3631K4086k6852J2302K4703m6825K5473K0068
4172I18287J4444M4360J7816k836m0979k4346P412l8443K9125L0207p3350M2032
$$ y = [951550, 938872, 972374, 966433, 926750, 897569, 881955, 882686, 927373, 929225, 981420, 1031350, 1085160, 990980, 840690, 781026, 661833, 664871, 736685, 768835, 891516, 989434, 1024070, 1002383, 959740, 864673, 715881, 701840, 698151, 635915, 750559, 770396, 782503, 849583, 907806, 966727, 997768, 981140, 967689, 910202, 892505, 778918, 726488, 768831, 745494, 810555, 910503, 989520, 1029079, 1062212, 1072908, 976511, 889739, 848318, 769333, 812918, 868247, 856500, 855839, 882544, 851054, 835225, 917275, 841999, 789497, 826185, 809253, 804768, 816969, 788897, 845795, 914033, 919368, 928963, 885332, 909418, 882566, 894868, 919571, 872746, 898219, 918287, 932731, 977091, 994907, 992071, 951092, 926746, 934158, 895715, 924840, 955047, 881697, 923729]
4160I23729p496l9249j4114j7483o9168k2936M878j9636L6446M3566l8307J5355
4148G95585P175k3524L1460L9682j5517k6276j0558r703k7661j2914M8060J3158
4136H08967M3215M0905l200J0651J4219j8703l4588j0974M337J7521m46L3714
4124I05618J6455R252j1983k3279j9865p172P019J3758K376l262j3112K7535n0708
4111H52632m4341j542n2745j1938M0908M1736N6522k5824K1303n694p9342J1726
4099H03401n7455r577L0296k0310M5721K6049Q928l5998M1052J9590p3596J4993
4087G93094M788K0528P3521m3426k9046q567k3796L6597k1547O9950K4402J6326
4075I12824J5368l7735M2337m2219l0731j4380p0563J5663k1237k5653L0043l3758
$$ y = [923729, 916233, 876984, 862870, 845387, 776219, 753283, 758161, 738525, 774971, 818537, 780230, 795585, 802760, 779236, 810696, 850378, 834861, 808585, 798027, 788324, 760663, 747749, 795809, 808967, 852182, 893087, 889887, 900538, 914757, 896054, 861466, 850492, 854829, 872350, 871904, 905618, 922073, 931325, 919342, 896063, 876198, 869026, 876045, 889803, 892179, 888917, 875805, 903340, 852632, 808291, 806749, 754004, 742066, 782974, 824710, 881232, 855408, 876711, 871017, 791675, 803401, 745946, 736369, 766665, 746355, 792076, 818125, 827053, 791055, 832107, 851697, 778101, 793094, 797882, 818410, 891931, 848505, 819459, 810892, 787096, 823693, 802146, 872096, 896498, 912824, 928192, 890457, 932794, 890575, 859844, 845464, 774901, 790564, 769327, 743674, 773717, 739959]
4063G39959K942k648N674K5372l304L4699n6920j4573k292q6715K1782N1775L7
4050G15788N3693p316K1987l17K1905N358j276M4918L3302j0054m1437J7105j5704
4037H37952l6336l6440m0024J3228J7410J0821j9822n726m4174k7800J1687Q579
4025F89355K0451M1326k4064l7805k049k6353l1399L5771q756k9264L1168K2287
4013F80668j844L1503P52m0772M915J0401M139k6416o4630j6086n2128K9081K4109
4000E83692j7900M4239J8578K6683O120r444M4710m6115n1100o9344n836M8872
3988E73155L818N0602L3265K3103M0109k6525q4576m0060k8291k2607K0915L1381
3976E74289K299J4071R626n0379l3418o812l3228M3178l300J465m999l284j9341
$$ y = [739959, 742901, 740253, 745927, 771299, 767995, 802694, 745774, 731201, 728909, 642194, 663976, 715751, 715788, 769481, 762165, 784152, 783835, 805740, 811098, 809822, 854740, 888042, 877988, 836551, 853656, 837952, 801616, 765176, 725152, 738380, 755790, 766611, 746789, 741063, 696889, 669089, 680776, 689355, 709806, 751132, 727068, 689263, 687214, 660861, 629462, 665233, 656477, 627213, 658381, 680668, 678824, 710327, 711079, 670307, 675222, 685623, 689762, 663346, 598716, 582630, 530502, 559583, 583692, 565792, 610031, 628609, 655292, 661412, 651968, 696678, 650563, 599463, 530119, 524283, 573155, 576973, 627575, 660840, 683943, 724052, 697527, 612951, 572891, 544600, 521993, 542908, 574289, 576588, 590659, 600285, 549906, 516488, 509676, 476448, 519626, 516326, 517791, 512792, 509508, 490167]
3963D90167k9816K0209O278M7212Q1021J1456n1306k8559r43l8739j0410L8485
3951E35055J1123j6110J8091J9702K1377N0409o1478p1902J6948k4771j092k9394
3939D67958l3691l7298p745O9503J1570O7302O3759j3605J6103n1416q5570k6331
3927D40539Q955J9162N8127K1175K4900n8284J1246l47n1687L6200J6777O175
3915E32938Q610K9210j8238q5904m074m4889j4196M1014K2027N3943M0002l7716
3903E22727j5971k8058l8367K2931l5186O560N325K3480K4295j2131M6955K2978
3891E45538j7792J648L0692N310m3848m7228k4325l8711K5124L5650L5967K5280
3879E33305k7216l008l4104m5027L4783m9140K6979L8439k2455P4989k8960k9441
$$ y = [490167, 460351, 480560, 486838, 534050, 615071, 626527, 575221, 546662, 545719, 506980, 496570, 535055, 546178, 530068, 548159, 567861, 589238, 639647, 578169, 506267, 523215, 498444, 497352, 467958, 434267, 396969, 389224, 458727, 470297, 537599, 601358, 587753, 603856, 552440, 466870, 440539, 449494, 468656, 526783, 547958, 572858, 514574, 525820, 525473, 473786, 509986, 526763, 532938, 541548, 570758, 552520, 466616, 462542, 417653, 403457, 444471, 466498, 520441, 560443, 522727, 506756, 478698, 440331, 463262, 428076, 434636, 439961, 463441, 487736, 475605, 522560, 545538, 527746, 529394, 560086, 565396, 521548, 474320, 449995, 411284, 436408, 472058, 508025, 533305, 506089, 503081, 468977, 423950, 458733, 409593, 436572, 475011, 452556, 527545, 498585, 469144]
3867D69144O917k8621J0823l1881J4979O148j3267p19j142L9572J3805R86L0374
3854E17118K5710Q763l5918k9283K1927J3316p428M4291K2852l349J7340k6165
3842E69174j1890j1479J7677n8560o99L8272p164k2104o0925q2028k3485o313
3830C40476M8016J3375K6129K3943K31P7655P776n6450j9213k3591K664L1116
3818D72127J7048K5K1461O6727K4354r876O4967m6764J0689R025r2210k150k2311
3805E13112J291L5172Q1850P5583n8214K5327K2260q8812j1312r1700j02448K7589
3793D29698j8596J9802j0888P4172M3921P11O7311p0852o6181K5531p1384l4427
3781C88818M9485J1648k1337P7391J25248K094J5328J7961p1827l5402Q372l5336
$$ y = [469144, 476061, 447440, 458263, 426382, 441361, 447509, 434242, 433523, 432381, 471953, 485758, 486744, 517118, 542828, 551591, 515673, 486390, 508317, 521633, 514205, 558496, 581348, 577999, 595339, 569174, 557284, 545805, 563482, 504922, 504223, 542495, 535331, 513227, 452302, 370274, 346789, 340476, 388492, 401867, 427996, 451939, 452170, 529825, 537601, 481151, 461938, 438347, 441011, 472127, 489175, 489200, 510661, 577388, 601742, 591866, 656833, 610069, 620758, 629783, 537573, 535423, 513112, 514403, 549575, 631425, 707008, 648794, 674121, 696381, 607569, 596257, 504557, 402109, 429698, 411102, 430904, 420016, 494188, 538109, 538820, 606131, 535279, 469098, 494629, 423245, 388818, 438303, 449951, 428614, 506005, 631253, 633347, 648675, 666636, 594809, 559407, 567779, 532443]
3769E32443l883L7697M9036L7083N2504j3830m3628K614p3121m6992L634R913
3757E43470Q86J8354O4567L574n4955K3737n0076l4570K2794p367K7792L8504
3745E96710l7562o2185P451j4762j9200M0250N9079l4285M1240k042k3434L0054
3733E81314L778k7319o844R491N5869n3857M6515P3358m0053J6861k0498q8162
3721E50453k4504k7810j3135Q188K7287j337l582N4098l2572l1014q301q5062
3709D12709l2576J8760j6557j6528N8897Q2335p319J7893K8933o2606k2277K8604
3697D90268k9626l5602L2228M2440J5244N2482J4793l7775K6596N12l9005M7631
3685E80186L7972p1521m6795l0021n4383l3250N5515L7231K2298R4632j5029n1592
$$ y = [532443, 528560, 566257, 615293, 652376, 704880, 691050, 647422, 650036, 576915, 529923, 533557, 543470, 544356, 562710, 627277, 630851, 575896, 599633, 549557, 514987, 537781, 530414, 558206, 596710, 559148, 496963, 504414, 489652, 470452, 510702, 569781, 535496, 576736, 574694, 551260, 581314, 585092, 557773, 550929, 560420, 616289, 562432, 608947, 682305, 642252, 659113, 638615, 550453, 525949, 498139, 485004, 493192, 520479, 519142, 515560, 569658, 537086, 506072, 497771, 412709, 380133, 398893, 382336, 365808, 424705, 507040, 499721, 517614, 546547, 483941, 461664, 490268, 460642, 425040, 457268, 499708, 514952, 567434, 582227, 544452, 571048, 571560, 532555, 580186, 618158, 546637, 499842, 469821, 415438, 382188, 437703, 474934, 497232, 591864, 576835, 525243]
3673E25243l0783j06296r5076j3544L9285N399O5202J08213L0218L8643m369q7378
3661D74757J7149K9013n6144p431k3601K4594J8799L3188K5508p956J54715M7565
3649G30156n9720J0086n6192o7601n2521k876o148J9469J19863K6164M6401J11146
3637H18227J03795J95998K93887K03341m3087j79121k53064k35934j41562n7767
3627G04713m8412j6197M109J1397J7316M5565j1058l6843j0090N893k5381L0258
3615F71270N5082K3767L4264L0182j6839p445O4387K9311J14333J57179J76236
3604A331727L73975N40140M39840J12506k58188n19120l62383k38497k02299j47549
3594A070152j24541j00490o4535q9112k9700J3044M2450K1378n513l264J2157
$$ y = [525243, 494460, 388164, 293088, 279544, 318829, 324228, 389430, 497643, 527861, 566504, 562135, 474757, 491906, 520919, 464775, 457344, 433743, 458337, 477136, 510324, 535832, 527876, 682591, 730156, 670436, 680522, 624330, 556729, 504208, 501332, 495184, 514653, 634516, 660680, 707081, 818227, 922022, 1118020, 1411907, 1615248, 1572161, 1393040, 1139976, 904042, 762480, 704713, 656301, 640104, 644213, 655610, 672926, 718491, 707433, 670590, 660500, 666393, 641012, 671270, 726352, 750119, 784383, 814565, 797726, 790281, 854668, 883979, 998312, 1155491, 1331727, 1705702, 2245842, 2685682, 2798188, 2540000, 2020880, 1658497, 1420000, 1217701, 1070152, 945611, 845121, 780586, 691474, 661774, 674818, 717268, 738646, 733133, 729869, 742026]
3583G42026L310j1391K1682L0907L3381L744M8507L0093L0253M0207P7632J56069
3571A206420K93895K42583Q7124r9231k11587k29645j47465j42310q8054p4828
3561H36902k1040j486m6825j1290L1355J30k78J7496l7979k1424P053j9233M080
3548G37461K6421P7902M8252L8886J3939j04197m229o0868p5996K4169M2968j1471
3536G53237K7365O7772K5668j9736Q130L450m4217l9329j732o641l2852j1496
3524G29619k468J9536N4430K2009L7721P0286n8604r244r000l6310L0291M2318
3512H90584L5092N974M2708P9320k3167j3862j4132p342K3732k2479P628j9421
3500I84635K0929p223m3395N9406O3766K586M4598O7430J1117m2559k5086m0502
$$ y = [742026, 745336, 733945, 755627, 786534, 819915, 823659, 872166, 902259, 932512, 972719, 1050351, 1206420, 1500315, 1742898, 1830022, 1730791, 1519204, 1289559, 1142094, 999784, 911730, 836902, 815862, 814376, 767551, 756261, 787616, 787746, 787468, 804964, 766985, 745561, 752614, 733381, 737461, 763882, 841784, 890036, 928922, 942861, 838664, 834435, 773567, 697571, 721740, 764708, 753237, 780602, 848374, 874042, 854306, 862436, 865886, 821669, 782340, 780608, 773967, 741115, 729619, 727151, 746687, 801117, 823126, 860847, 931133, 872529, 863285, 854285, 817975, 848266, 890584, 925676, 931650, 974358, 1053678, 1030511, 1016649, 1002517, 995175, 1018907, 996428, 1004056, 984635, 1005564, 998341, 954946, 1014352, 1078118, 1080704, 1125302, 1192732, 1203849, 1161290, 1136204, 1095702]
3488A095702k2929Q399L1519Q6767J18891Q0104N3085L0798l0396p9166l6072
3477A336702n710M3772N0662M6320J521K4204L8429J4966m409M7106Q2783P5804
3465A752150P1566J21062J04857J54019K03274M7861J06321J09111L0898P6594
3455B777713R5683J17627J77212K27485L11857L04309L02032R0060q0614j97494
3445D125870k62154k52649k35395j58481j01853j50413j12709j42580k30011k10209
3435B269416k29587j24759l9362J6147P2616J46904M4206j15204j79766j89144
3425A671467j32806n677J499K4122M6816N0511P2067J7873K0163m7507J4528N5275
3413A788331Q8147J48286J18647O7445R9710O7626Q0627l0313k02951k62292k36098
$$ y = [1095702, 1072773, 1081172, 1112691, 1199458, 1318349, 1398453, 1451538, 1482336, 1451940, 1372774, 1336702, 1330992, 1374764, 1425426, 1471746, 1473267, 1497471, 1535900, 1550866, 1546457, 1593563, 1676346, 1752150, 1823716, 1944778, 2049635, 2203654, 2406928, 2454789, 2561110, 2670221, 2701119, 2777713, 2873396, 2991023, 3168235, 3395720, 3707577, 4011886, 4313918, 4403978, 4323364, 4125870, 3863716, 3611067, 3375672, 3217191, 3115338, 2964925, 2852216, 2709636, 2479625, 2269416, 2039829, 1915070, 1875708, 1891855, 1964471, 2111375, 2155581, 2040377, 1860611, 1671467, 1538661, 1532984, 1534483, 1558605, 1605421, 1655932, 1727999, 1745872, 1766035, 1718528, 1733056, 1788331, 1876478, 2024764, 2143411, 2210856, 2310566, 2378192, 2458819, 2428506, 2225555, 1963263, 1727165]
3402A727165j74643j15890j2705J3202r85J5359q8925j33752q0525o6657m0396
3391A041248k1898L9838L7514L8952O2533j2236p632O800n3167m0753O939J8992
3379A117130k6932L5241R5076P4210J44212O8328r1644q4138j71237j71645j12924
3368H75677n7401m7188p1154R632j2782q162K1757j5687K1544K9720j1768o1835
3356F72353k109j2085j32853j1904K5508j8549M9850O5493K36m6626J5609j6891
3344E88032o9596M5833k3588o3748J7674K1793l5352j5810j9247l4848K7158L8582
3332D76883M0538J2821K7505l5324n3503K4060j1493n5034M1345K8343l6865L1381
3320D90657j1925k9122K9869J3617P803k2082L03q4961r433K3096m4674k6934
$$ y = [1727165, 1552522, 1436632, 1423927, 1437129, 1436144, 1451503, 1362578, 1228826, 1148301, 1081644, 1041248, 1019350, 1059188, 1096702, 1135654, 1198187, 1185951, 1178319, 1185119, 1131952, 1091199, 1098138, 1117130, 1090198, 1125439, 1220515, 1294725, 1438937, 1507265, 1415621, 1331483, 1160246, 988601, 875677, 818276, 771088, 699934, 709566, 696784, 688622, 710379, 694692, 716236, 745956, 734188, 672353, 670244, 658159, 525306, 513402, 538910, 520361, 570211, 635704, 635940, 589314, 604923, 588032, 518436, 564269, 540681, 476933, 494607, 516400, 481048, 465238, 445991, 411143, 438301, 476883, 517421, 530242, 557747, 522423, 468920, 492980, 481487, 426453, 467798, 496141, 459276, 490657, 478732, 449610, 479479, 493096, 500899, 478817, 479120, 394159, 384726, 407822, 363148, 336214]
3308C36214K2438M1683J3139O1870p534p8473N6579l6321k3517M0056o3712l642
3296C58780j3812O04L1090L3164P4906L3986L7025K01n7414n6935o2978R029J8470
3283D06116j7060N1191m0041l4804O946j1147L6831o424k6432O4776j9191n2964
3271C57797k1561l3377o1357k6918L9320k4488P3175P3616L5367m951J2426N9
3259D19108l5086k6450o2270j7205K2901O608N2480P4654K9833O046O0839j3098
3247E18360m5351l5432p9849p9277k9101L2698L6090M4850Q5019K5891M064m4162
3235D33800p0800p2780l7879n149M0920R0407M4247n6053K4765J2068o2303M5216
3223C86459n1870K567P5032M2045q75n2002N4097M2973j6791Q4340j5684N127
$$ y = [336214, 358652, 400335, 413474, 475344, 467810, 389337, 445916, 409595, 386078, 426134, 362422, 358780, 344968, 345572, 376662, 409826, 484732, 518718, 555743, 555944, 498530, 441595, 378617, 387646, 406116, 389056, 440247, 400206, 365402, 372348, 361201, 398032, 391608, 365176, 429952, 410761, 357797, 336236, 302859, 241502, 214584, 253904, 229416, 302591, 376207, 411574, 406623, 419049, 419108, 384022, 357572, 295302, 278097, 300998, 307606, 360086, 434740, 464573, 470619, 531458, 518360, 473009, 437577, 357728, 278451, 249350, 282048, 318138, 362988, 448007, 473898, 477962, 433800, 363000, 290220, 252341, 247192, 288112, 378519, 422766, 366713, 391478, 403546, 341243, 386459, 334589, 337156, 412188, 454233, 453358, 401356, 455453, 498426, 481635, 565975, 550291, 555418]
3211E55418j6260k6568L1337J4909M8067n708J6989O7535m5036j5989k1528j3629
3199E89537L9983j8426J2002K425L4069K8107k5081P8327J09482K9808R7853J68184
3187A146270K33239J86917J64563K7671j19255j57435j75067j56762m5181p2007
3177A032953k2425l7926k1119k4430l1277Q876n1371m7698L8014q240o4232N2599
3165H23724L2419N2064K9570j5165M8212L4559R3108J29214K23182L29983K11602
3154A992472Q7302n0144k61359k73900j82716j13034l6648l2979Q516q9155k8543
3143A019812l9203p6590l3410j4803j1799J0766L9578O8384l9775M9490K8598
3132A001048o7158R61o640l9250k4030P375J4326L2445O1947Q1952M4300L8404
$$ y = [555418, 539158, 512590, 543927, 558836, 606903, 601195, 618184, 685719, 640683, 624694, 603166, 589537, 629520, 611094, 623096, 625521, 659590, 687697, 662616, 740943, 850425, 880233, 978086, 1146270, 1379509, 1566426, 1730989, 1758660, 1639405, 1481970, 1306903, 1150141, 1104960, 1032953, 1010528, 972602, 951483, 927053, 895776, 904652, 853281, 805583, 843597, 835357, 771125, 823724, 856143, 908207, 937777, 922612, 970824, 1005383, 1098491, 1227705, 1450887, 1780870, 1992472, 2079774, 2029630, 1768271, 1494371, 1311655, 1198621, 1161973, 1128994, 1137510, 1048355, 1019812, 980609, 904019, 870609, 855806, 844007, 854773, 894351, 962735, 922960, 972450, 1001048, 933890, 934851, 928211, 888961, 864931, 872306, 886632, 919077, 981024, 1062976, 1107276, 1145680]
3120A145680j6121l1739k8833k3942l041j8755K4015P7839K7703R6271L1431N2005
3108A332513R762j39186j13500r4519p5329j6229M9265K0348j8624J9589j3423
3097I60667l3002m3127p0563n6680J4711J04254P4619Q8007L7330j1020m3135
3086A022061m2448o292n2353J043Q1761o294L6007j0210o1420o7056o6857L254
3074H31196k5069q194J0r8986k7786k8208p4616l888J2232R1127M4164L9412J4709
3061G66103j04432j1108k8150m8010M8682n214O440R549j810n3528j02609M3316
3049E19229j5772k0510K0379n0316Q456j6306m152o7403P204K0556N140O0692
3037D67197K162p3395j7705l4787n5590K5685M2171O0736K3049K3802k6082m7682
$$ y = [1145680, 1129559, 1097820, 1068987, 1045045, 1042004, 1023249, 1047264, 1125103, 1152806, 1249077, 1280508, 1332513, 1342275, 1203089, 1089589, 995070, 919741, 903512, 952777, 973125, 954501, 974090, 960667, 927665, 884538, 813975, 757295, 772006, 876260, 950879, 1038886, 1076216, 1065196, 1022061, 979613, 973321, 920968, 922011, 1003772, 997478, 1033485, 1023275, 961855, 894799, 827942, 831196, 806127, 797933, 797943, 698957, 671171, 642963, 568347, 564459, 576691, 667818, 711982, 751394, 766103, 661671, 650563, 622413, 574403, 623085, 617871, 624311, 633860, 632050, 578522, 475913, 519229, 503457, 482947, 503326, 453010, 461466, 445160, 441008, 373605, 380809, 401365, 406505, 467197, 469359, 395964, 378259, 343472, 287882, 313567, 355738, 416474, 439523, 463325, 437243, 389561]
3025C89561j3701r0403n3407N9926O943K9867L2062K2451n0533j0802J8142p5948
3013B64158o1870Q0270j1219l7272K4243l1140j6874l556j1005l6368p851N2037
3001B03553R019M051R367n5717L1960j3688j502M4020k7977j6668l3457r502K8479
2988A71938j3964M6563M7208K5569J4554M550k3109k6990O810p66o6665J1456
2976A97154p88j1333M9800L195J087M106n290j9338p5467n1951L311p279N5212
2963A42419P410j2548K657m9046l5853L418j2628k1782M7893R7506L7130K3140
2951B29716M1751n2846k4412l5375n9049j4786J1373L4041M5773M2146N4657k6175
2939B46814N49j588p1306k401m1841L176k712P356N8433l4289L291J2603m3874
$$ y = [389561, 375860, 285457, 232050, 291976, 298919, 328786, 360848, 383299, 332766, 321964, 340106, 264158, 202288, 282558, 271339, 234067, 258310, 227170, 210296, 206740, 195735, 159367, 151516, 203553, 212572, 216623, 225990, 170273, 202233, 188545, 187043, 231063, 203086, 186418, 152961, 143459, 171938, 157974, 204537, 251745, 277314, 291868, 296418, 273309, 246319, 253129, 252363, 185698, 197154, 196366, 185033, 234833, 238028, 239115, 243221, 237931, 218593, 143126, 91175, 94486, 87207, 142419, 149829, 137281, 139938, 90892, 55039, 58457, 45829, 24047, 71940, 169446, 206576, 229716, 271467, 218621, 194209, 158834, 99785, 84999, 96372, 130413, 176186, 218332, 272989, 246814, 247363, 245775, 174469, 172068, 130227, 133403, 130691, 138047, 196480, 162191, 165482, 178085, 134211]
2926A34211M8752k9828j0216j5311l521N926o9841M1442l3624l4554O9773k1331
2914H1878K1137P490k8727K896j2208K5314q8170J4874M8494J4271P1248Q230
2902A66727j4339q654J6542J3567m0734K3994l6469m9831L0529j0327q743Q8366
2890A70628J04444K4870R599m3608j11386j05398k2704l1982l396O5026K7088
2879H3181M7487N2397j1440j42227j9450M0087k0193N7008J3517k7700j8772J6124
2867G0019m6751k2635Q4381K6502K2308Q5700j9755p7119n6082k6611o3899N3769
2855B9827N0125l0011Q4726Q5268o6614m6123k8468q2949r256J15157K4713r730
2843A16665M1252r601n9697j5705m1433k8261P8322R2294L7931j4591m4567p9253
$$ y = [134211, 182963, 153135, 142919, 127608, 124087, 130013, 60172, 101614, 67990, 33436, 103209, 81878, 103015, 110505, 81778, 84674, 72466, 97780, 9610, 24484, 72978, 87249, 158497, 166727, 152388, 143734, 160276, 173843, 133109, 157103, 120634, 70803, 101332, 91005, 82262, 170628, 275072, 299942, 309541, 265933, 154547, 49149, 26445, -5537, -8933, 56093, 83181, 130668, 183065, 171625, 29398, 9948, 50035, 29842, 86850, 100367, 72667, 53895, 70019, 23268, 633, 85014, 111516, 133824, 219524, 199769, 122650, 66568, 39957, -23942, 29827, 79952, 49941, 134667, 219935, 153321, 107198, 78730, -4219, -13475, 101682, 126395, 116665, 157917, 148316, 88619, 72914, 31481, 3220, 81542, 173836, 211767, 197176, 152609, 73356]
2831G3356o2841M5648q152J3111R7061l6650J5332K8920p7712j11569L6236L3417
2819D6157J246J2871J0816m2755K923J5317m5247N4221J3703l5520J2863J13411
2807A60006Q203o5274j2905Q746k4660k3719n569J1919Q6869L6777p4985o3560
2795D1848K298j3590K7107M4154j2275K8021L6312j2914r695l5271k9577m9154
2783A7264K6668K141m2872J0932m7391j1318P8449K3062K2727M1417K4507j4464
2771A31122m2114l9144q3584n3591j0072K9470J35157N9656M4684N4826J0382
2760B36792k0255j08751m6258m2989l9437M636L1535P5499K8679O7069J8293n1174
2748A53639J0323r4663n2667Q794m7175n128j073J0196N4765K5401J9590j3127
$$ y = [73356, 10515, 56163, 48011, 61122, 158183, 121533, 136865, 165785, 88073, -23496, 12740, 46157, 47403, 60274, 71090, 28335, 31258, 46575, 1328, 55549, 69252, 33732, 46595, 160006, 168209, 102935, 90030, 98776, 74116, 50397, 44828, 56747, 143616, 180393, 105408, 41848, 44146, 30556, 57663, 101817, 89542, 117563, 153875, 140961, 131266, 95995, 66418, 17264, 43932, 46073, 3201, 14133, -33258, -44576, 33873, 56935, 79662, 121079, 145586, 131122, 89008, 49864, -33720, -87311, -97383, -67913, 67244, 126900, 171584, 226410, 236792, 216537, 107786, 61528, 18539, -20898, -16262, 15273, 90772, 119451, 186520, 204813, 153639, 163962, 69299, 16632, 25426, -21749, -26877, -27950, -17754, 37011, 62412, 82002, 68875]
2736F8875M1804L7352j210L307o0266n4058J523K2583K3927o089M4142q048l4576
2723G9266l581q0401J1285N3803k7540M2488k095N472k5959l3147j9121n0737
2711e0267M3878r099N2756N8626L1903O953n0935n3962K89K9387K6594J8423M4119
2698A48665l64j7501p9826m3795n2531P360Q3755N7051K2009r980l3826k2780
2686E8237k0087n9003l7788M6511P4970M504l9577J5022j0683K668R047J2004
2674E5825M944N775L3345l1212J6030k6983r1373P2619O1741J9632K9809q3J314
2661A51383j5190N130o2556j08892M868L2071J3886M7680O089k037k7572O5930
2649A10790k5323k2562M8332r6896n291M2247p4676O268L949N961K3400R3978
$$ y = [68875, 110679, 148031, 146821, 150128, 89862, 35804, 37327, 59910, 83837, 77748, 121890, 113842, 79266, 75685, -4716, 6569, 60372, 32832, 75320, 73225, 78697, 52738, 19591, 470, -50267, -6389, -15488, 37268, 95894, 127797, 134750, 83815, 29853, 30142, 59529, 86123, 104546, 148665, 148301, 130800, 50974, 7179, -45352, -37992, 45763, 102814, 124823, 114843, 81017, 58237, 38150, -20853, -58641, -12130, 62840, 67344, 27767, 42789, 32106, 34774, 43821, 55825, 60769, 66544, 99889, 68677, 84707, 57724, -33649, 38970, 100711, 120343, 150152, 150069, 151383, 136193, 141323, 78767, -30125, -25257, 6814, 20700, 68380, 74469, 72432, 44860, 110790, 85467, 62905, 111237, 14341, 9050, 51297, -23379, -17111, -13162, -7201, 16199, 110177]
2637A10177L6870n3888O2637l7634j12063J9620k2115l6795L3832K635K7820k4039
2625G057Q1171L5437l5870J04139j05006r9278J0263j0115Q99M1097K3747O523
2613F0064L3713N3989o2680q417L2172m7629M949K2854m1174j5157R174O2581
2601A04439l9063M1625k5920r4609J03969K204m1870m170m9766j7780J4744O5405
2589E9208K0283j0965P5141l8365m4839N2672j9045k4534O9130Q4198l782K9371
2577B48473M4830j16485k0253N5939n8806M5787K2557l5646j7353n3107l5989
2566G9947o3384K0993K0941J2894P6327K2018o8636L1965p273j03320o8617M2185
2554c960j1830M1273K8037m0759l0556L5475j16j6655L0977K847j6990J3022k9305
$$ y = [110177, 147047, 93159, 155796, 118162, 6099, 25719, 3604, -33191, 641, 3276, 31096, 7057, 88228, 123665, 87795, 191934, 86928, -12350, -2087, -12202, -11303, 29794, 53541, 60064, 93777, 147766, 85086, 76669, 108841, 61212, 66161, 89015, 47841, 32684, 41858, 104439, 65376, 107001, 81081, -13528, 90441, 92645, 50775, 46605, -3161, -20941, -6197, 59208, 79491, 68526, 143667, 105302, 60463, 113135, 94090, 69556, 138686, 222884, 219102, 248473, 293303, 176818, 156565, 212504, 153698, 199485, 222042, 186396, 169043, 115936, 79947, 16563, 37556, 58497, 71391, 147718, 169736, 101100, 133065, 125792, 22472, -46145, -3960, -15790, 25483, 53520, 12761, -17795, 17680, 17564, 909, 31886, 34733, 17743, 30765, 1460]
2541A460j1221N40J2821K0997M6310L7328m1960M672m1756M5194M3777k4096K4320
2528A18386j7683k45J1216p1154L106M7327j4587J2271j2440K1792k3182j7932
2516E6875J3966m7983M7401l2633j7109O8971n6912J5918p313j4981J8130J519
2504D5849N8198n3624j296O8932p1208j1819j2097k2301K4247N6P6504J9622j0849
2491A10214j8522n3223O088m9232p242K4043K103N279p279L6419P956J4628Q5880
2478A57112R580m3148J5832m4782l7050j6220o478J9057L1307Q5127j9747J9558
2466A70148Q075q9534m2546j9320Q88j5601P3509Q119J8003M0153k6170q4183
2454D1541J9908q718l8204O846M9581K8723L4149K4264k7205k3432N529n8702
$$ y = [1460, -9761, -9221, 3600, 24597, 70907, 108235, 66275, 70947, 29191, 74385, 118162, 94066, 118386, 100703, 100458, 111674, 40520, 43626, 90953, 76366, 88637, 76197, 97989, 74807, 56875, 70841, 22858, 70259, 37626, 20517, 89488, 32576, 48494, 41181, 26200, 44330, 45849, 104047, 50423, 49127, 118059, 46851, 35032, 22935, 634, 24881, 24937, 101441, 121063, 110214, 91692, 38469, 44557, -4675, -11917, 12126, 14229, 19508, 12229, 48648, 56604, 71232, 157112, 166692, 123544, 139376, 94594, 57544, 41324, 34846, 53903, 85210, 170337, 150590, 170148, 178223, 88689, 46143, 26823, 27711, 12110, 85619, 93738, 111741, 151894, 125724, 41541, 61449, 52731, 14527, 21373, 70954, 99677, 133826, 158090, 130885, 107453, 112982, 54280]
2442E4280n6101p027j1500j9211O1384Q0192k0381N3249J6815j0538M7635l3900
2430A54897q7363j8946L7241l663R511N1862j9653K1136N4998j1765j8456J7424
2418A87223k929l3015M5549J2643l4370r174q01n7285l2079M1988o289J3987J02034
2405B27482K7201l0570k9458o6871o7974k0129M1463J5698Q0080L4170k6276J9444
2393B04260Q873o4862k7055N0618N283L47M9430J665L117K3655l6790q8957J716
2380A31300r453k7483J00248N4549j2487L3768L347k6558m0244N2862k1556j458
2368B36835O0806r954m4524N5384K9238n990J2388L7963k6533L8565K3844o802
2356D01220K9787o284p5205p899K6586j0255l886N7889j0024K0449R9938M9867
$$ y = [54280, -1821, -8848, -20348, -39559, 21825, 102017, 81636, 134885, 151700, 141162, 188797, 154897, 67534, 48588, 85829, 82166, 91677, 143539, 123886, 145022, 200020, 188255, 169799, 187223, 184294, 151279, 196828, 209471, 175101, 165927, 165126, 107841, 75762, 117750, 111461, 125448, 227482, 254683, 224113, 194655, 127784, 59810, 39681, 81144, 96842, 176922, 211092, 184816, 204260, 213133, 148271, 121216, 171834, 177117, 177464, 226894, 228559, 231676, 255331, 218541, 129584, 131300, 121847, 94364, 194612, 249161, 236674, 270442, 273789, 247231, 206987, 259849, 238293, 236835, 297641, 287687, 243163, 298547, 327785, 321795, 334183, 372146, 345613, 384178, 408022, 401220, 431007, 424723, 349518, 341619, 368205, 357950, 354064, 411953, 401929, 422378, 522316, 572183]
2344E72183J3560K0000k799J3253l3167L8530J4917L5033J17612L4647O6650J10203
2332A000622O4285J31226J54951J87112J65693K68842L23711Q1868N7339K2310
2322B457959J34355K82869L16647M13818N70787Q27746J270782K046662M307123
2313A2628748P712471R160973N726062M91958o714709q463053n442878l698538
2305A1401034k485181j923363j500221j198080q55419o62351k39264n6298J31171
2296B612028Q4838j8061k69630l62206k24222j34467k03041m5860r1338k5693
2286A322348p4281j34333p4180r5473k6905k5166m8004Q735J4786J5238n4202
2275H28563q8677o2772l4059r4737k1897j8079o066k8414O529J8371M7253K0149
$$ y = [572183, 585743, 605743, 602944, 616197, 583030, 621560, 636477, 671510, 789122, 823769, 890419, 1000622, 1064907, 1196133, 1351084, 1538196, 1703889, 1972731, 2296442, 2378310, 2435649, 2457959, 2592314, 2875183, 3191830, 3605648, 4176435, 5004181, 6274963, 8321625, 12628748, 20341219, 29502192, 35228254, 35720212, 29005503, 20542450, 15099572, 11401034, 8915853, 6992490, 5492269, 4294189, 3438770, 2776419, 2537155, 2480857, 2612028, 2696866, 2678805, 2409175, 2046969, 1822747, 1688280, 1485239, 1439379, 1348041, 1322348, 1248067, 1113734, 1039554, 944081, 917176, 892010, 844006, 852741, 867527, 882765, 828563, 739886, 677114, 643055, 548318, 526421, 508342, 502276, 473862, 480391, 498762, 546015, 566164]
2263E66164P425j954l2973l2243n6810j9316l9126k3506J5187O938M4244l1300
2251D02730j4218N4491J0407Q322l6928l8135l5486m7233l464n5850o1797J3865
2239A96704L3225L7625L2726J8065L1210m6628l8987q1357q0583L3995k9270Q6283
2227A93008R8731L7118L418r1407J6158m4007l2618j0287p5903O3751J3290j0955
2215A60297N8729J5144O095n6238J9848P33j12487J4700m6656m444Q9896j1099
2203A34518K6804M4206M6791n1525r1581n841k7159J2292J06291j3457M1857J5354
2191B38550j1347j5594o3627r805l9470N1370M4473l1801k1340m6252L922K1336
2179A20415L5908m569m3770L0571J4026k0287l5450m4627k8504L4557L5770L6981
$$ y = [566164, 573589, 571635, 538662, 506419, 449609, 430293, 391167, 367661, 382848, 389786, 434030, 402730, 388512, 443003, 453410, 461732, 424804, 386669, 351183, 303950, 300486, 244636, 182839, 196704, 229929, 267554, 300280, 318345, 349555, 302927, 263940, 182583, 102000, 135995, 106725, 193008, 291739, 328857, 332275, 240868, 257026, 213019, 180401, 170114, 94211, 157962, 171252, 160297, 219026, 234170, 240265, 184027, 203875, 204608, 92121, 106821, 60165, 55721, 145617, 134518, 161322, 205528, 252319, 200794, 109213, 103372, 76213, 88505, 194796, 181339, 223196, 238550, 227203, 211609, 147982, 138177, 98707, 150077, 194550, 162749, 141409, 95157, 99079, 120415, 156323, 151754, 107984, 138555, 152581, 132294, 96844, 52217, 23713, 58270, 94040, 131021]
2167A31021O215L8340R82p2850Q908o265k3735J8024k1383J4096L6583J8985m068
2154A44853j4656L2991J5925m3777k5993m2242P236o771l1711J129N9359M3679
2142A40022N321Q433l9118n9768k8696M997Q962K984M8614J7211N5055K1438p8892
2129A06563p9880j7809j4072l0799O526J4944k0139P2692N2328P958L1404L7759
2117A67475r19O806o0499o1508j13187J6441J5574N803J17197m429L3813N5363
2105A77930J1972K486q1050M3539m3101r327K4018j08760J8458n1102k6360J01849
2093F0552M8889O9196l3471J6995O2599j07434j7422p3850m2237N0413j7180j2251
2081D799r473N570M7498m6955J14866l928n518P7792l2167l7949m8630q3457n9280
$$ y = [131021, 137236, 175576, 176558, 103708, 112616, 106351, 82616, 100640, 79257, 93353, 129936, 148921, 144853, 130197, 163188, 179113, 135336, 109343, 67101, 74337, 67566, 35855, 36984, 96343, 140022, 145343, 153776, 114658, 54890, 26194, 31191, 40153, 43137, 91751, 108962, 164017, 185455, 106563, 26683, 8874, -5198, -35997, -29471, -14527, -34666, 38026, 90354, 98312, 129716, 167475, 166556, 173362, 112863, 51355, -61832, -45391, -29817, -24014, 93183, 88754, 122567, 177930, 189902, 192388, 111338, 154877, 111776, 102449, 126467, 17707, 36165, -14937, -41297, 60552, 109441, 178637, 145166, 162161, 224760, 117326, 99904, 26054, -16183, 34230, 17050, 4799, -4674, 896, 48394, 1439, 116305, 112377, 106859, 184651, 152484, 114535, 65905, -17552, -76832]
2068g6832l0421R4790L7028P2561P9090k5877O5744k3084j16872k9551Q082K7583
2056H2241l6644K2608N4931N273L9994r990n5802k5608P843L0953p175l560j6486
2043H8578K494O0282L559J8315K0718m9927l980j7146n9537k9546k44M478M1003
2030G9047K8533K842L9016l9689j6708j4133n2036k6855J6139M6435M1020p595
2018I6016J4494j5467j9246n003m2532L356m2175O98m360j381K4888J186L4227
2005D4701k2535J3466K4727m3839l0514P589J961L8086k265k0372O6017O1537
1993A38559N7947m6897K3989P357n0474O384p7929O687M4008M1806p985l5785
1981A07667l140k2924n1950N7985k6778n6248L2581m293p530L791J7315o2920
$$ y = [-76832, -107253, -12463, 24565, 97126, 176216, 150339, 216083, 192999, 76127, 46576, 54658, 82241, 45597, 68205, 123136, 128409, 168403, 158413, 102611, 77003, 84846, 115799, 108624, 105064, 88578, 91072, 151354, 154913, 173228, 193946, 144019, 140039, 122893, 63356, 33810, 33566, 38044, 79047, 107580, 110422, 149438, 109749, 93041, 78908, 26872, 17, 16156, 62591, 103611, 96016, 110510, 95043, 75797, 70794, 28262, 31618, -10557, -9859, -14219, -15600, 9288, 10474, 44701, 22166, 35632, 60359, 16520, -13994, -6405, -4444, 33642, 31377, 11005, 77022, 138559, 196506, 149609, 173598, 180955, 130481, 136865, 58936, 65623, 109631, 151437, 143452, 107667, 104527, 81603, 29653, 87638, 60860, 4612, 37193, 32900, 25370, 29161, 46476, -16444]
1969a6444j4220J3418m6873m5811L2156Q164k854M0759P2335N2716L6612K9490
1957A59448l2111p068j7170j32521N936o63n512M2843O6232P3082R875J20283
1945B82654k8151q7565j9908o7591n3900n0277l5844K3192L2441N8713M1893L5068
1933A30725o053n6487m1226Q275n2347j6924m235p713O1383M753l247N146j4151
1920G899K031J2331N1337J4252j0511m721K7912m9408o2295P856N3326M9617K0787
1907A20413k485o2155l2845L4842J8667P9172j740K7577l256n9085k895n7264
1895E8946j1230j1679J7207N2510l6940j9259M0114m1049k0265r38k0539K9467
1883C6345J3816K8802J8435p1290P056m8914k1586k4281L7852P6464J0978Q0921
$$ y = [-16444, -30664, -17246, -64119, -109930, -77774, -69610, -72464, -31705, 40630, 93346, 129958, 159448, 127337, 120269, 103099, -29422, -23486, -24149, -29661, 13182, 79414, 152496, 162371, 282654, 254503, 166938, 147030, 79439, 25539, -24738, -60582, -37390, -4949, 53764, 95657, 130725, 124672, 68185, 26959, 35234, -17113, -34037, -38272, -45985, 15398, 20151, 16904, 22050, 7899, 9930, 22261, 73598, 87850, 77339, 72618, 100530, 51122, -11173, -3317, 50009, 99626, 120413, 117928, 55773, 22928, 57770, 76437, 155609, 153869, 181446, 178190, 119105, 116210, 58946, 47716, 36037, 53244, 105754, 68814, 49555, 89669, 48620, 28355, 27417, 6878, 36345, 50161, 78963, 97398, 26108, 33164, -15750, -37336, -61617, -23765, 52699, 63677, 144598]
1871A44598k7371n2005k6161l2977K3134M268L8799J8401K0183K2386j2262j0881
1859A10112j0897l0289J7392L3530k1293o4277l0668J5501j1345L3192K0569M665
1847F6192J5143j9388k8146k6115o186m1760k3942J02160J8089J2913J8595k3334
1835F4221R572N846J7337l3800n875N0582p6209q490J9117k5664J4446L0100K8761
1822H9944J5385O7440k7977p2593L4827n4213q2093N5862l1014l5257k2378l929
1810f5996k3870P403J09656N5090N4386L0607o7987m2750k7888o3700k1441N2660
1798c830R8090K3365N5257q327p9123K4550j6945j7506J1875N4763L1892m3768
1786A30293k3126q4479o5604M7453j5967J558K2583J8958n46L387l1575j9914
$$ y = [144598, 117227, 65222, 39061, 6084, 29218, 33486, 72285, 90686, 110869, 133255, 120993, 110112, 99215, 68926, 86318, 119848, 98555, 34278, 3610, 19111, 7766, 40958, 61527, 66192, 81335, 61947, 33801, 7686, 1500, -40260, -64202, 37958, 56047, 68960, 87555, 64221, 73793, 79639, 96976, 63176, 57301, 107883, 31674, 23184, 42301, 16637, 31083, 61183, 89944, 105329, 172769, 144792, 72199, 107026, 52813, -29280, 26582, -4432, -39689, -62067, -65996, -89866, -82463, 27193, 82283, 136669, 167276, 99289, 56539, 28651, -35049, -56490, -3830, 94260, 117625, 172882, 164555, 85432, 109982, 93037, 75531, 87406, 142169, 174061, 130293, 107167, 22688, -42916, 4537, -11430, -9872, 12711, 31669, 31123, 34510, 2935, -16979]
1774a6979J9411M1004l618L408L3680p8323m7244K3895K4400P3483M4102O3351
1762A80570K4593k4756l9503p8035l4317j1233J1403L8424N226K5913r361J3552
1750A02476n1214l7998M0616l459k6547L6188j8230j1346m914m8496O916k8567
$$ y = [-16979, 2432, 43436, 39818, 43226, 76906, -1417, -48661, -24766, -366, 73117, 117219, 180570, 205163, 180407, 140904, 62869, 28552, 17319, 28722, 67146, 72372, 98285, 88924, 102476, 51262, 13264, 53880, 50421, 23874, 60062, 41832, 30486, 25572, -22924, -16008, -44575]
$$ [...]
##END NTUPLES=NMR SPECTRUM
##END=
