##TITLE=1H_DE-80H_X3
 200.13MHz, d2o
 8 sc
 
 19ns.26.2.2025
##JCAMPDX= 6.0         $$ Bruker NMR JCAMP-DX V2.0
##DATA TYPE= NMR SPECTRUM
##DATA CLASS= NTUPLES
##ORIGIN= UXNMR, Bruker Analytische Messtechnik GmbH
##OWNER= pz
$$ XWIN-NMR		Version 3.5
$$ Tue Dec  9 10:44:36 2025 Russian Standard Time (UT+4h)  Yarkov@DPX200
##.OBSERVE FREQUENCY= 200.1313
##.OBSERVE NUCLEUS= ^1H
##.ACQUISITION MODE= SIMULTANEOUS
##.ACQUISITION SCHEME= undefined
##.AVERAGES= 8
##.DIGITISER RES= 18
##SPECTROMETER/DATA SYSTEM= spect
##.PULSE SEQUENCE= zg30
##.SOLVENT NAME= CDCl3
##.SHIFT REFERENCE= (INTERNAL, CDCl3, 0, 15.5188)
##AUDIT TRAIL= $$ (NUMBER, WHEN, WHO, WHERE, WHAT)
$$ ##TITLE= Audit trail, XWIN-NMR		Version 3.5
$$ ##JCAMPDX= 5.01
$$ ##ORIGIN= Bruker BioSpin GmbH
$$ ##OWNER= Yarkov
$$ C:/Bruker/XWIN-NMR/data/yarkov2/nmr/H-C/1/pdata/1/auditp.txt
$$ ##AUDIT TRAIL=  $$ (NUMBER, WHEN, WHO, WHERE, WHAT)
(   1,<2025-12-09 10:43:47.45 +0400>,<Yarkov>,<DPX200>,
      <created by zg, POWCHK disabled, PULCHK disabled
       configuration hash MD5:
       00 E9 B6 7A A2 85 ED C7 34 08 36 98 17 FE 4E 26
       data hash MD5: 16K
       F3 F1 44 C8 35 79 EE 76 22 C5 BF D5 69 A8 06 0D>)
(   2,<2025-12-09 10:43:52.28 +0400>,<Yarkov>,<DPX200>,
      <Start of raw data processing
       efp BC_mod = 2 LB = 0.25 FT_mod = 6 PKNL = 1 PHC0 = -5290.919 PHC1 = -3.978085 SI = 16K 
       data hash MD5: 16K
       E8 4D 4B 58 E2 E8 D8 E6 A2 DB 09 4E 76 96 2F 43>)
(   3,<2025-12-09 10:44:09.01 +0400>,<Yarkov>,<DPX200>,
      <pk PHC0 = -3.893458 PHC1 = -1.599997 
       data hash MD5: 16K
       AE 6F 55 64 6F 98 52 20 BE DD E5 41 B1 7D B8 24>)
$$ ##END=
$$ 
$$ hash MD5
$$ 99 FA B7 6F BE 3A E5 35 66 EC 4C 12 86 F9 6E B9
##$RELAX= 
##$RELAX= 
##$RELAX= 
##$RELAX= 
##$RELAX= 
##$RELAX= 
$$ Bruker specific parameters
$$ --------------------------
##$DU= <C:/Bruker/XWIN-NMR>
##$EXPNO= 1
##$NAME= <H-C>
##$PROCNO= 1
##$TYPE= <nmr>
##$USER= <yarkov2>
##$AMP= (0..31)
100 100 100 100 100 100 100 100 100 100 100 100 100 100 100 100 100 100 
100 100 100 100 100 100 100 100 100 100 100 100 100 100 
##$AQSEQ= 0
##$AQ_mod= 1
##$AUNM= <au_zg>
##$AUTOPOS= <>
##$BF1= 200.13
##$BF2= 200.13
##$BF3= 200.13
##$BF4= 200.13
##$BF5= 200.13
##$BF6= 200.13
##$BF7= 200.13
##$BF8= 200.13
##$BYTORDA= 1
##$CFDGTYP= 0
##$CFRGTYP= 5
##$CHEMSTR= <none>
##$CNST= (0..31)
1 1 145 1 1 1 1 1 1 1 1 1 1 1 1 1 1 1 1 1 1 1 1 1 1 1 1 1 1 1 1 1 
##$CPDPRG= <>
##$CPDPRG1= <>
##$CPDPRG2= <>
##$CPDPRG3= <>
##$CPDPRG4= <mlev>
##$CPDPRG5= <mlev>
##$CPDPRG6= <mlev>
##$CPDPRG7= <mlev>
##$CPDPRG8= <mlev>
##$CPDPRGB= <>
##$CPDPRGT= <>
##$D= (0..31)
0 0.7 0 0 0 0 0 0 0 0 0 0.03 0 0 0 0 0 0 0 0 0 0 0 0 0 0 0 0 0 0 0 0 
##$DATE= 1765262626
##$DBL= (0..7)
120 120 120 120 120 120 120 120 
##$DBP= (0..7)
150 150 150 150 150 150 150 150 
##$DBP07= 0
##$DBPNAM0= <>
##$DBPNAM1= <>
##$DBPNAM2= <>
##$DBPNAM3= <>
##$DBPNAM4= <>
##$DBPNAM5= <>
##$DBPNAM6= <>
##$DBPNAM7= <>
##$DBPOAL= (0..7)
0.5 0.5 0.5 0.5 0.5 0.5 0.5 0.5 
##$DBPOFFS= (0..7)
$$ [...]
##$SUBNAM2= <"">
##$SUBNAM3= <"">
##$SUBNAM4= <"">
##$SUBNAM5= <"">
##$SUBNAM6= <"">
##$SUBNAM7= <"">
##$SUBNAM8= <"">
##$SUBNAM9= <"">
##$SW= 18.0517328524113
##$SWIBOX= (0..15)
0 0 2 0 0 0 0 0 0 0 0 0 0 0 0 0 
##$SW_h= 3612.71676300578
##$TD= 16384
##$TD0= 1
##$TE= 0
##$TE2= 300
##$TE3= 300
##$TEG= 300
##$TL= (0..7)
0 120 120 120 120 120 120 120 
##$TP= (0..7)
150 150 150 150 150 150 150 150 
##$TP07= 0
##$TPNAME0= <>
##$TPNAME1= <>
##$TPNAME2= <>
##$TPNAME3= <>
##$TPNAME4= <>
##$TPNAME5= <>
##$TPNAME6= <>
##$TPNAME7= <>
##$TPOAL= (0..7)
0.5 0.5 0.5 0.5 0.5 0.5 0.5 0.5 
##$TPOFFS= (0..7)
0 0 0 0 0 0 0 0 
##$TUNHIN= 0
##$TUNHOUT= 0
##$TUNXOUT= 0
##$USERA1= <user>
##$USERA2= <user>
##$USERA3= <user>
##$USERA4= <user>
##$USERA5= <user>
##$V9= 5
##$VALIST= <valist>
##$VCLIST= <CCCCCCCCCCCCCCC>
##$VD= 0
##$VDLIST= <DDDDDDDDDDDDDDD>
##$VPLIST= <PPPPPPPPPPPPPPP>
##$VTLIST= <TTTTTTTTTTTTTTT>
##$WBST= 1024
##$WBSW= 4
##$XGAIN= (0..3)
0 0 0 0 
##$XL= 0
##$YL= 0
##$YMAX_a= 668231
##$YMIN_a= -498875
##$ZGOPTNS= <>
##$ZL1= 120
##$ZL2= 120
##$ZL3= 120
##$ZL4= 120
##$ABSF1= 0
##$ABSF2= 0
##$ABSG= 0
##$ABSL= 0
##$ALPHA= 0
##$AQORDER= 0
##$ASSFAC= 0
##$ASSFACI= 0
##$ASSFACX= 0
##$ASSWID= 0
##$AUNMP= <proc_1d>
##$AZFE= 0.1
##$AZFW= 0.1
##$BCFW= 0
##$BC_mod= 2
##$BYTORDP= 0
##$COROFFS= 0
##$CY= -3
##$DATMOD= 1
##$DC= 0
##$DFILT= <>
##$DTYPP= 0
##$F1P= 0
##$F2P= 0
##$FCOR= 1
##$FTSIZE= 16384
##$FT_mod= 6
##$GAMMA= 0
##$GB= 0
##$INTBC= 1
##$INTSCL= 3.241238e-09
##$ISEN= 128
##$LB= 0.25
##$LEV0= 0
##$LPBIN= 0
##$MAXI= 10000
##$MC2= 0
##$MEAN= 0
##$ME_mod= 0
##$MI= 1.114404
##$NCOEF= 0
##$NC_proc= -4
##$NLEV= 6
##$NOISF1= 3.799351
##$NOISF2= 2.8
##$NSP= 0
##$NTH_PI= 0
##$NZP= 0
##$OFFSET= 15.51882
##$PC= 1
##$PHC0= -5294.812
##$PHC1= -5.578082
##$PH_mod= 1
##$PKNL= yes
##$PPARMOD= 0
##$PSCAL= 0
##$PSIGN= 0
##$REVERSE= no
##$SF= 200.130000576566
##$SI= 16384
##$SIGF1= 3
##$SIGF2= 2
##$SINO= 0.751879
##$SIOLD= 32768
##$SREGLST= <19F.Aceton>
##$SSB= 0
##$STSI= 16384
##$STSR= 0
##$SW_p= 3612.71676300578
##$SYMM= 0
##$S_DEV= 0
##$TDeff= 16384
##$TDoff= 0
##$TI= <>
##$TILT= no
##$TM1= 0
##$TM2= 0
##$TOPLEV= 0
##$USERP1= <user>
##$USERP2= <user>
##$USERP3= <user>
##$USERP4= <user>
##$USERP5= <user>
##$WDW= 1
##$XDIM= 16384
##$YMAX_p= 525170118
##$YMIN_p= -407001
$$ End of Bruker specific parameters
$$ ---------------------------------
##NTUPLES= NMR SPECTRUM
##VAR_NAME=  FREQUENCY,     SPECTRUM/REAL,   SPECTRUM/IMAG
##SYMBOL=    X,             R,               I
##VAR_TYPE=  INDEPENDENT,   DEPENDENT,       DEPENDENT
##VAR_FORM=  AFFN,          ASDF,            ASDF
##VAR_DIM=   16384,         16384,           16384
##UNITS=     HZ,            ARBITRARY UNITS, ARBITRARY UNITS
##FACTOR=    0.220516191357247, 1,           1
##FIRST=     3105.78141731478, 0,            0
##LAST=      -506.935345690999, 0,           0
##MIN=       -506.935345690999, -407001,     0
##MAX=       3105.78141731478, 525170118,    0
$$ Real data points
##PAGE= N=1
##DATA TABLE= (X++(R..R)), XYDATA
$$ [...]
10480 -185681 -173402 -164866 -160292 -145816 -134373 -131327 -138887 -163803 -191872 -212650 -202471 -161324
10468 -161324 -107649 -98880 -120255 -126342 -125535 -126816 -134598 -160949 -168236 -166624 -176723 -179048 -179239 -167933
10454 -167933 -157991 -149836 -152394 -184992 -192281 -194820 -203785 -197581 -190242 -179723 -157452 -173703 -194944
10441 -194944 -204666 -186292 -149557 -137642 -126411 -133086 -163927 -190501 -224338 -218615 -205013 -189423
10429 -189423 -168856 -148974 -135453 -155804 -160481 -172255 -187631 -182788 -168100 -168431 -160105 -146862
10417 -146862 -161114 -157435 -152040 -149725 -150775 -178262 -216946 -211814 -185867 -169678 -151363 -155495 -150546
10404 -150546 -124663 -124657 -157062 -183623 -195820 -162515 -139812 -155857 -153562 -161807 -160343 -159361 -148168
10391 -148168 -138372 -138831 -150472 -167790 -183085 -188617 -184579 -168626 -145944 -131980 -146045 -162839
10379 -162839 -171915 -191485 -200058 -198702 -151418 -109484 -94194 -115449 -142047 -150190 -147778 -146455 -173782
10366 -173782 -175427 -179385 -150938 -130362 -146604 -146241 -144037 -152858 -140961 -136988 -175196 -182204 -166140
10353 -166140 -177570 -199383 -196317 -165478 -149559 -161167 -172300 -171948 -173110 -186599 -189984 -193220 -198193
10340 -198193 -199383 -172854 -178465 -169592 -173298 -157707 -144762 -139237 -162532 -190926 -176939 -162531
10328 -162531 -166050 -172846 -148195 -163213 -167100 -182058 -190710 -182504 -169342 -153531 -133568 -121882
10316 -121882 -141284 -165807 -181912 -190342 -196726 -181148 -168312 -157370 -162347 -173600 -178129 -179168
10304 -179168 -160295 -149633 -148381 -150175 -157665 -183343 -198262 -194111 -193218 -150000 -116875 -121982 -125921
10291 -125921 -147790 -169031 -183454 -203548 -207861 -175112 -133114 -120807 -121205 -145121 -164319 -155505
10279 -155505 -166952 -170131 -178083 -167375 -164240 -182659 -199242 -174257 -147680 -132863 -139228 -147668
10267 -147668 -149835 -135741 -126220 -149079 -165599 -177283 -158249 -155609 -152290 -140970 -157110 -164489
10255 -164489 -148207 -149088 -159840 -175403 -168139 -162842 -150841 -130801 -120104 -110991 -111919 -118320 -120094
10242 -120094 -166839 -190962 -203680 -203301 -192145 -170334 -143301 -125003 -124028 -121434 -131302 -133653 -140138
10229 -140138 -151122 -171273 -178454 -169392 -155487 -139818 -155381 -153031 -139063 -151400 -165589 -147635
10217 -147635 -137184 -123270 -112338 -122051 -140073 -162714 -161873 -166621 -197855 -192377 -165442 -141057
10205 -141057 -144703 -127796 -143096 -156469 -130436 -115473 -126938 -118735 -136974 -145890 -139529 -136460
10193 -136460 -140968 -144341 -149316 -138673 -157117 -159094 -158386 -156875 -135045 -136012 -144462 -136357 -115993 -117703
10179 -117703 -126179 -138619 -154992 -162740 -143670 -164873 -150062 -128280 -134813 -124159 -122191 -111514
10167 -111514 -111106 -136529 -178905 -182793 -164762 -143555 -119284 -118134 -128589 -138037 -135788 -137331 -124450
10154 -124450 -130207 -133537 -120980 -136440 -160303 -186235 -207994 -202866 -163111 -137292 -117060 -98391
10142 -98391 -115007 -127265 -152323 -179016 -196465 -193436 -159046 -120387 -117510 -130440 -142407 -171547
10130 -171547 -201065 -204815 -196106 -171002 -163756 -157718 -153794 -148791 -136295 -152206 -192770 -181008 -189228
10117 -189228 -191128 -188169 -180430 -191172 -177818 -174130 -179669 -154876 -159716 -183992 -184891 -165388 -175284
10104 -175284 -184062 -186364 -174556 -183319 -177255 -190053 -169835 -158713 -162742 -158511 -136296 -146673 -160348
10091 -160348 -172815 -156405 -142505 -137181 -138446 -145539 -173198 -186561 -171047 -159475 -148318 -132123
10079 -132123 -111524 -104176 -91452 -106662 -145616 -172720 -173725 -174537 -164621 -162243 -158990 -151558 -145491
10066 -145491 -138512 -136929 -122800 -111116 -118481 -137390 -156814 -152132 -161464 -176833 -158189 -147821
10054 -147821 -141129 -120320 -111404 -125346 -145259 -150835 -144528 -139850 -148180 -149383 -151718 -139671 -157128
10041 -157128 -156242 -162572 -172882 -178110 -174633 -162026 -157170 -149447 -148426 -160389 -150182 -142611 -166509
10028 -166509 -174275 -187636 -202146 -204392 -170685 -154065 -141379 -155005 -163368 -155569 -169852 -181880
10016 -181880 -181064 -166934 -164079 -152291 -144808 -152639 -166121 -172550 -176280 -197116 -197008 -181607 -179711
10003 -179711 -178379 -178891 -158584 -149521 -150816 -166051 -179175 -169963 -161424 -177366 -182460 -195130 -172403
9990 -172403 -169074 -149566 -118555 -114360 -103556 -104636 -128198 -167462 -203025 -213884 -189641 -159568
9978 -159568 -166622 -164923 -143081 -137853 -139286 -152384 -159134 -171225 -155846 -148620 -141802 -131018 -114946
9965 -114946 -122736 -139770 -133408 -124746 -133346 -131571 -157241 -173094 -140485 -119227 -121713 -149020 -174042
9952 -174042 -182652 -178011 -163172 -154116 -163071 -186258 -159809 -152269 -147217 -149881 -172852 -144167 -141593
9939 -141593 -128939 -131188 -139769 -142177 -163284 -156829 -167901 -170210 -192056 -197822 -198230 -190288 -148782
9926 -148782 -115880 -115365 -133935 -148544 -145569 -143283 -144916 -193849 -231501 -202317 -187589 -165804 -143774
9913 -143774 -148313 -145829 -131097 -132611 -151953 -155495 -141808 -130296 -126779 -133460 -146648 -159926 -160785
9900 -160785 -168997 -159575 -149388 -127283 -114895 -105722 -111014 -117920 -111825 -121669 -127021 -105679 -93229
9887 -93229 -94242 -80380 -90438 -105640 -110067 -100420 -88014 -83195 -113946 -133943 -134546 -110277 -98233
9874 -98233 -108393 -108169 -88454 -90634 -110731 -140508 -177003 -173748 -165975 -157397 -143855 -135660 -134570
9861 -134570 -153558 -175898 -193518 -165771 -127328 -100735 -80902 -102495 -105838 -114924 -142658 -197591
9849 -197591 -226585 -205055 -163191 -143487 -145326 -151089 -153871 -137294 -137393 -135508 -131982 -144649 -153781
9836 -153781 -155589 -155191 -163345 -155957 -162279 -167878 -175639 -166856 -164322 -136182 -115857 -124469 -148334 -156639
9822 -156639 -156170 -169938 -201670 -197469 -147241 -125118 -132851 -144419 -151563 -162212 -163167 -155400 -144349
9809 -144349 -122148 -89027 -107786 -138843 -166557 -191629 -196391 -168790 -128721 -105290 -76093 -67068
9797 -67068 -81289 -96152 -120883 -115580 -102101 -90519 -87005 -86279 -102137 -118595 -131777 -153431 -147458
9784 -147458 -102342 -66995 -25891 -29309 -76358 -114225 -163851 -197323 -202712 -191930 -151536 -115551
9772 -115551 -85498 -73010 -92663 -95661 -114123 -117500 -128670 -116616 -99595 -84576 -84475 -106722
9760 -106722 -136380 -152208 -142035 -107783 -84618 -57733 -19807 -843 -8449 -23695 -48252 -76167
9748 -76167 -91632 -102800 -96272 -85351 -68583 -71294 -78203 -101029 -127016 -132894 -120184 -106703 -96201
9735 -96201 -86197 -91506 -108857 -130947 -139805 -137574 -146793 -117731 -104372 -84800 -77551 -125378 -173332
9722 -173332 -192728 -188747 -145517 -81497 -49947 -47709 -68217 -100283 -131481 -145441 -162971 -167550
9710 -167550 -142824 -102360 -92824 -91211 -84698 -108247 -115131 -110110 -101860 -86107 -92081 -101801 -101950 -114296
9696 -114296 -117801 -93103 -69270 -61686 -52658 -65129 -61985 -48210 -70061 -78255 -33724 -24831 -24861
9683 -24861 -30274 -17535 -24272 -55930 -66433 -74667 -54694 -38652 -42435 -51081 -71294 -66940 -60309
9670 -60309 -60356 -67893 -64714 -64121 -56957 -24544 -12328 5130 11561 14451 92 -14605 -37629 -16818
9656 -16818 17913 31722 31194 25530 38420 33930 17446 8911 -4039 -129 1924 10242 2347 -26874
9642 -26874 -35398 -26509 -13123 -28078 -24278 2677 -22201 -49129 -61184 -56589 -59914 -31133 -25876
9629 -25876 -53205 -46860 -20972 -39725 -76323 -79724 -78595 -46676 -22116 -25178 -34596 -40737 -61239
9616 -61239 -33541 5141 10756 4387 10836 10543 -8281 -30878 -70761 -86705 -87242 -76984 -53391
9603 -53391 -28844 -27990 -30264 -10509 -9166 -2039 -256 -12344 -44729 -55815 -45752 -37310 -39582
9590 -39582 -42875 -47822 -45350 -45908 -37616 -31008 -33475 -15344 1732 11550 -8040 -29229 -28313 -12919
9576 -12919 -7695 9115 20156 1087 4357 22490 5064 1553 11259 26453 43712 44106 35255
9563 35255 33301 27971 31779 53918 84183 116351 130157 111640 80229 55723 56145 65243 75756
9550 75756 85747 79277 70939 58702 51668 57836 89606 127629 142834 157652 143634 116474 89843
9537 89843 69911 57313 58828 72790 70315 97483 136681 142738 137352 148509 151131 175981 219780
9524 219780 232068 238318 252880 237314 222607 205626 198844 189235 200207 175893 173248 208461
9512 208461 231587 251355 266786 241335 198079 175583 156405 145415 133804 142511 159590 189060
9500 189060 213319 213511 203968 213911 236647 257421 270963 306011 301543 287095 267097 260127 276436
9487 276436 308833 331682 368249 413660 415852 408159 394338 375025 346445 327422 338001 322754
9475 322754 302099 307889 331932 363295 386115 379129 367162 368029 385974 396485 408616 425270
9463 425270 420215 425492 437188 450174 464421 491692 507640 508011 536160 570440 600722 640797
9451 640797 687195 718921 780054 844371 870557 880239 893123 932503 972539 1018627 1054178 1129207
9439 1129207 1235784 1357978 1482216 1589292 1694465 1814677 1966134 2156913 2390779 2714469
9429 2714469 3097615 3558867 4089623 4699324 5402511 6098497 6715412 7294338 7818590 8091155
9419 8091155 8130591 8072121 7892336 7540168 7105806 6675606 6231977 5781796 5356462 4960551
9409 4960551 4607757 4298155 4028759 3783085 3567049 3452599 3422486 3449857 3498626 3565581
9399 3565581 3684224 3870110 4130034 4475972 4874119 5338651 5845192 6380470 6997451 7714441
9389 7714441 8518007 9469733 10626893 11897019 13202905 14407984 15394892 16058292 16357439
9380 16357439 16271948 15744609 14832100 13681696 12390894 11031152 9707283 8509213 7442054
9371 7442054 6477557 5664007 4984419 4435617 3948966 3542582 3227988 2998812 2825879 2712453
9361 2712453 2650721 2591391 2559570 2549262 2527737 2509943 2480072 2457237 2418099 2369374 2325807
9350 2325807 2303090 2292908 2286059 2300390 2314313 2361266 2405606 2451216 2494701 2547815 2619847 2715580
9338 2715580 2838384 2956565 3085389 3236730 3443783 3674443 3923683 4217578 4564982 4983684
9328 4983684 5470646 6039484 6697790 7506626 8510663 9738967 11187260 12891586 14800923
9319 14800923 16733232 18499430 19934818 20849604 21092231 20646109 19654629 18243630 16684922
9310 16684922 15171226 13817998 12707679 11857681 11206710 10724573 10307437 9913236 9470626
9301 9470626 8980547 8448253 7914929 7375385 6854320 6398356 6053241 5826342 5708422 5665749
9291 5665749 5681047 5761332 5912033 6117379 6322645 6560786 6842656 7167566 7556310 8001757
9281 8001757 8450514 8902809 9386194 9790888 9991764 10039670 9892703 9462412 8827926 8133326
9271 8133326 7416005 6733129 6141270 5656509 5277193 5008489 4811619 4680535 4586415 4534349
9261 4534349 4537489 4609039 4813213 5149777 5611770 6207839 6860834 7421056 7789092 7895330
9251 7895330 7724029 7346325 6777304 6110847 5422423 4734157 4128205 3607114 3176368 2820330
9241 2820330 2547955 2331529 2147300 2014392 1879150 1785534 1697737 1613946 1555633 1501414
9231 1501414 1444612 1426818 1392510 1365863 1345599 1316673 1324311 1340443 1327183 1275352 1249950 1246630
9219 1246630 1212370 1178210 1152737 1128478 1102793 1095470 1102611 1097705 1086681 1077557 1066280 1044513
9207 1044513 1007954 977584 936062 942743 947611 911786 896618 862147 817579 789939 781431 786288
9195 786288 795836 794411 775224 779895 763836 723569 697215 693601 690689 711355 727678 740582 743927
9182 743927 740188 719802 712858 717439 730355 716159 714635 705991 688594 689405 700950 700496 715944
9169 715944 748102 801911 845003 835770 815373 764001 739048 738084 748346 787946 814043 834643
9157 834643 858375 871922 905316 906893 917699 908398 912310 932318 912320 892042 878249 857262
9145 857262 849444 857461 859686 831854 797245 793260 805378 827721 820522 793557 789718 795393 783898
9132 783898 763386 730501 694721 675085 663229 681033 676087 689233 707666 707390 701588 713623
9120 713623 700488 700257 691403 665250 655399 667060 689550 705363 717283 759525 772330 777024 783290
9107 783290 777204 767724 789764 798151 806272 805184 806811 805430 807187 809189 798861 798928 788257 796984
9093 796984 800624 797411 775637 755352 754587 780291 801065 806736 844182 866762 885018 897197 924027
9080 924027 972163 1005487 1067840 1121224 1172634 1251883 1330212 1415234 1490820 1588376 1691151
9069 1691151 1776461 1837003 1836863 1805815 1762552 1723809 1671990 1611660 1560504 1514927 1484820 1437065
9057 1437065 1399163 1351714 1317747 1316480 1305517 1299638 1309902 1330046 1350597 1354852 1381413 1445547
9045 1445547 1533270 1606100 1666453 1739516 1825996 1926120 2046367 2180629 2327403 2499265
9035 2499265 2700631 2884121 3045211 3155441 3203560 3229948 3219206 3149733 3024543 2861762
9025 2861762 2669699 2504138 2345110 2182898 2038379 1910997 1808668 1715198 1654303 1607504
9015 1607504 1580491 1568119 1544784 1540577 1531894 1520664 1513220 1495423 1481952 1516804 1533109 1552937
9003 1552937 1589057 1607554 1641189 1692409 1742714 1824188 1879667 1946792 1993261 2018116 2023727 2008138
8991 2008138 1949232 1892800 1814291 1730262 1669814 1592727 1510142 1477506 1419666 1389968 1349933
8980 1349933 1343608 1331865 1328710 1312258 1291127 1273327 1252186 1240785 1253865 1273061 1283210 1298739
8968 1298739 1315982 1340900 1370380 1394090 1401113 1392915 1411536 1427344 1455923 1492770 1521906 1559822
8956 1559822 1643514 1695759 1751668 1800498 1854742 1908934 1971043 2047312 2162953 2277027 2418915
8945 2418915 2541262 2658215 2779049 2967061 3174575 3391227 3573527 3828961 4116155 4505242
8935 4505242 4977943 5611717 6493920 7855020 9925677 13804294 21410129 33587517 44834952
8926 44834952 48961553 48177183 43851419 37046539 29489702 22786590 17597372 13785003
8918 13785003 10977454 8921162 7577284 6740605 6068592 5451844 4910063 4470153 4140683
8909 4140683 3858675 3586125 3349974 3149117 2958475 2825705 2719592 2620615 2524722 2432785
8899 2432785 2322511 2235038 2155967 2067975 2020976 1960206 1931742 1893021 1863859 1845502 1818609
8888 1818609 1812693 1816468 1866529 1890826 1879843 1869627 1874154 1865719 1896873 1925080 1946776 1970834
8876 1970834 1987230 1980345 1916935 1856503 1784311 1694799 1644322 1588014 1537488 1448983 1384177 1290786
8864 1290786 1223698 1144950 1091182 1028294 1011527 1005701 991731 975390 958583 928730 913967 905843
8852 905843 892288 859375 852455 835958 832620 821073 823533 795199 788957 774493 764768 771717 768581
8839 768581 765472 738490 697816 677726 669878 658551 645609 637689 629328 623469 613358 594804 587218
8826 587218 575288 562379 570475 554816 575852 592951 599975 585821 567437 553513 512637 482704
8814 482704 474539 463899 483776 513422 540480 552420 554844 542959 518282 514401 528140 523136
8802 523136 519511 518100 505195 483374 448752 444844 465960 487603 479481 479270 451237 415196 408164
8789 408164 407358 410907 448150 437361 450689 458869 433155 397301 407758 419722 435347 448344
8777 448344 452575 469553 483152 482970 444103 426492 420384 401734 404952 418040 435656 426321 429606
8764 429606 459706 479672 495137 483763 471944 418708 357813 330240 353447 369336 390744 418570
8752 418570 406114 387872 360682 359003 351687 354454 358743 392432 389638 386143 367468 341228 340714
8739 340714 357984 383532 393578 404955 382730 378114 363802 362625 391141 411107 440527 456029
8727 456029 457192 458029 435918 423387 444955 466950 530474 582455 622091 688426 772288 840989
8715 840989 876833 897556 888912 840887 790383 745307 683438 637336 600298 582805 564229 537016
8703 537016 520224 513733 497701 507265 504179 477708 455191 414995 397998 427379 425778 425575 439752
8690 439752 434063 439323 432307 464034 466671 467731 505281 576651 633272 661276 682899 682037 694555
8677 694555 731390 768861 796233 787292 770344 728199 703572 678329 601099 526886 508883 488444
8665 488444 458131 449640 418032 388314 368537 351281 318514 301813 304336 302977 299198 339115
8653 339115 359458 369034 360644 332364 322247 312439 309265 307590 340348 332485 346163 372951 352624
8640 352624 312698 290232 297509 344820 376621 399236 389806 360461 348387 335985 307428 307685
8628 307685 326484 325649 342715 345235 365185 359766 336004 350901 387784 396116 379454 349911 299436
8615 299436 229821 223726 231218 248438 255359 259397 282489 293335 298597 295793 255732 263583 273258
8602 273258 277636 262409 227176 207944 189062 213161 251728 269493 285897 264476 275358 290632
8590 290632 336022 351060 347100 325293 298578 277935 271800 261168 234263 247903 278403 297789
8578 297789 276985 269129 255749 230901 198128 225353 249380 236818 202720 189856 196884 188763
8566 188763 186805 192161 209257 249903 259344 266344 253584 221235 201883 183405 190765 225154 246265
8553 246265 237084 236763 243030 211061 189182 183336 194097 200576 216668 253981 244179 232347 237822
8540 237822 218673 210542 177157 179732 184586 200252 236707 237633 228022 202909 214385 218602 220803
8527 220803 211608 211633 198055 201926 205235 212997 229746 230826 223114 209444 219408 221833 229146 229916
8513 229916 224422 244725 266778 268482 256674 218039 188271 199357 224567 255654 268290 263001
8501 263001 244004 238625 249989 237304 202525 201037 227615 235557 258728 288291 269302 250422
8489 250422 231190 208689 196421 204045 212905 203331 250083 291389 317888 316621 300281 263636
8477 263636 249355 254348 284428 290020 293171 315492 365288 402745 405382 388188 374530 389930
8465 389930 431508 474634 515557 549665 587214 616134 645308 665153 681651 719120 738507 752184
8453 752184 755499 750642 721392 686193 678446 722951 759473 776058 719875 651663 579709 514209
8441 514209 442969 397658 377385 356048 357704 367597 386757 372320 362584 377413 384133 375134 386505
8428 386505 388310 404188 427684 468944 501890 508545 524181 565481 593011 612785 658172 684350
8416 684350 662441 630514 600714 578286 575158 541452 478043 422266 393447 374425 367984 346197
8404 346197 341070 345564 368468 367064 348545 306882 260044 244217 230451 229930 240583 243938 282208
8391 282208 302683 315626 316011 283701 259157 239209 252416 262005 272506 298690 312254 294393
8379 294393 270281 259550 231580 208320 195731 199952 225688 242687 264736 269138 249642 239066
8367 239066 229122 238165 264130 251100 252644 247371 257418 255930 227458 212908 220644 220198 220641 227577
8353 227577 234756 223021 221977 229719 225369 214685 213488 224305 224148 234811 228044 223051 212843
8340 212843 208130 218572 235071 196246 168950 148600 136636 141977 162747 175375 180006 205844
8328 205844 213814 214521 193142 147605 111048 126057 155623 183543 206388 203644 194453 203331 202842
8315 202842 173984 168514 157518 183214 216750 237454 253619 208222 178724 144138 124772 152747
8303 152747 162955 188011 201501 197912 192865 186046 176074 155532 137746 131048 129468 138467 148320
8290 148320 149288 140326 134236 139386 148247 160202 144892 149717 147983 152705 177624 170868 122894 104816
8276 104816 86102 86144 100274 118768 145420 153122 160395 154402 136182 118832 115569 112745 123167
8263 123167 149230 171856 168763 141469 107521 104075 110363 119760 142808 162124 148811 130487
8251 130487 93821 67341 91247 123257 145019 149388 157504 152392 112591 92446 93666 115323
8239 115323 141211 170840 165610 160801 145680 133895 140165 152011 159688 168820 177684 151763 132269
8226 132269 95095 71324 70656 87937 102057 129886 123896 124313 116115 98984 100571 125915 127878
8213 127878 122694 121882 97597 77142 66922 82442 116405 146683 138695 108014 95498 71488
8201 71488 68599 82438 105870 118433 102465 91246 74801 59591 76417 20832 8561 84756
8189 84756 121042 119024 102514 58894 8041 7249 17268 29289 53761 70944 50858 66325
8177 66325 73525 73885 61784 45599 28027 30403 52084 61751 51707 80436 90305 76237 47234
8164 47234 8973 -5553 -23231 4110 51763 88642 128756 166695 146564 96105 44278 20944
8152 20944 12695 7545 28036 44404 62037 69181 68796 59559 52431 66216 77474 79535 68279
8139 68279 59223 51867 30136 30834 24173 19376 19765 46356 76526 63240 71754 81800 98760 106085
8125 106085 93896 70233 69223 75797 79898 67817 50450 52409 55527 51713 51488 27227 39938
8112 39938 72000 69168 61788 59199 56484 46440 46676 28875 18528 21409 3133 -9391 -4123
8099 -4123 904 39682 59263 53973 33693 21807 26673 17972 20532 41473 33364 35957 30721 14672
8085 14672 -17310 -31739 -9438 4391 17740 25701 32852 45345 27683 -915 -341 9537 12342
8072 12342 8725 8582 -7075 3346 23355 33881 30378 17224 14317 26106 17591 -501 -456 17207
8058 17207 47292 56885 81186 40734 19646 -7168 -9549 1295 3527 41520 55867 57653 58733
8045 58733 44943 29698 19080 16790 17604 14061 22603 46565 43546 40023 43635 26036 26191 31457
8031 31457 33799 12094 28078 41334 45957 42814 45685 26659 12914 -9416 -24812 -23224 -5806
8018 -5806 53560 78969 67410 49377 33275 736 -16740 -1293 8408 3816 993 12553 24702
8005 24702 -7764 -28314 -5167 16553 40842 49579 42650 38622 30920 -2945 -16587 -20743 -33175
7992 -33175 -47489 -52516 -30344 20356 42170 57735 44160 27554 7372 9450 636 -6040 -10394
7979 -10394 -9112 -6425 -6453 -14681 -32899 -23433 8569 42417 57605 59500 47190 30865 -2736
7966 -2736 -27560 -27666 1878 20359 22205 3468 -7027 -16709 -9531 -240 6342 41335 52026
7953 52026 80920 63545 28083 11535 -5099 36134 39325 37888 10969 -28291 -48607 -56797
7941 -56797 -39733 -9893 32082 51832 41310 10297 -3115 4258 9628 12659 -4893 -15539
7929 -15539 -27516 -28300 -32799 -12757 5411 9307 33862 34471 1795 -3514 -23659 -36298 -19910
7916 -19910 3025 2097 -584 1004 -28358 -22020 -16350 8048 37734 35676 17957 2568 -33119
7903 -33119 -47189 -35244 -21719 9109 16365 37445 35061 2456 -29771 -38553 -30987 -23922 -16286
7890 -16286 -8070 12832 23878 23651 17407 20617 23153 14191 -3359 -34988 -39885 -27189 -26161 -22559
7876 -22559 1763 5889 -1139 -20590 -50125 -68291 -48972 -38371 -31403 -21985 -26045 -52405 -59286
7863 -59286 -42467 -43351 -29530 -9085 5005 -5887 -10064 -17349 -23422 -19309 -19769 -28464 -32126 -35370
7849 -35370 -29522 -7255 -7485 -12294 9391 23777 11831 -30865 -35175 -25284 -25573 -10586 8758
7836 8758 22723 18057 17261 9582 -11330 -17170 13234 31049 68187 68723 32664 -1565 -13971
7823 -13971 -25005 -36188 -24684 -28600 -15182 -6148 -13337 2516 8253 29723 41508 13857 2145
7810 2145 -1222 36625 -5319 -26791 -37531 -27059 222 -7909 -28484 -31282 -23811 -3208 23391
7797 23391 20708 8278 14531 19011 -17551 -52427 -57924 -48103 -34146 -22898 -27854 -41707 -25955
7784 -25955 -15148 -25590 -19349 -7697 -2620 8544 -20292 -24598 -34136 -34826 -52727 -65211 -51299
7771 -51299 -47073 -14146 -5743 -21490 -26718 -15021 -3330 12388 14204 588 3489 -33183 -65002
7758 -65002 -72037 -75431 -67959 -65305 -29085 -5905 25805 31794 42950 11530 8861 -22799 -51405
7745 -51405 -42845 -43511 -35114 -20575 -17813 -7692 -15392 -18092 -16246 3103 20830 33614 39030 3870
7731 3870 -15473 -22038 -32408 -27839 -33393 -9943 5704 36335 46158 17658 -5736 -18940 -13026
7718 -13026 -6221 5503 5806 11044 29854 14153 1812 -13186 -30914 -36284 -45392 -15222 13678
7705 13678 36123 25830 3382 2392 -5233 -32695 -56119 -38171 -22284 -6591 29298 14645
7693 14645 16409 -13801 -18884 -20711 -20124 -23729 -23809 -9953 13024 39 -22404 -19594 -30441 -11863
7679 -11863 10598 8148 7606 -2366 -5332 -9265 -5784 -5281 -22263 -32709 -40605 -32115 -13296 -2003
7665 -2003 12172 22867 22400 12553 -10234 -11505 -16881 -38250 -28646 5388 13952 19842 15041 -6531
7651 -6531 -20 18219 30139 31554 36262 15898 3134 23028 34263 34166 56822 52322 42068
7638 42068 28850 26139 34718 42267 26991 30092 49003 35545 33037 27066 8870 25717 41549
7625 41549 17545 -13477 -33202 -15059 -3732 12060 21838 22182 23201 21998 13796 10573 11558 14328
7611 14328 20759 13541 26081 29688 10805 20 5444 24053 26247 41935 9623 17377 -4567
7598 -4567 -2044 32506 39473 58671 62394 58146 62213 31903 2914 6247 8711 25636 44479
7585 44479 34370 21642 14991 6113 2806 17632 40617 54997 51649 49368 36392 20247 6907
7572 6907 -1914 -13564 9993 21102 9373 -16458 -25404 -15310 -1561 33647 29328 20295 3936
7559 3936 -6626 -26987 -12585 8600 19432 18623 6922 -9163 -2452 10764 12863 3840 7058
7546 7058 15125 18899 8075 -22802 -52824 -31730 2138 11235 19327 20084 26448 32272 38186 25178
7532 25178 -10201 -18234 -1205 -13867 -17565 -11115 -20950 -3815 21982 48651 48547 30970 14418
7519 14418 4054 11394 17111 25787 18288 8476 1451 90 15919 22010 18057 8779 35118 66491
7505 66491 57755 47996 16486 -8604 -5087 809 -10516 -12663 -19072 2209 51057 67488 65009
7492 65009 47650 18968 15200 -3196 -4343 11052 14948 33886 25198 10274 -7434 -15596 -19291
7479 -19291 -13761 -14969 -10828 -5282 4956 -5331 -17594 1465 21084 32604 30713 14651 15125
7466 15125 22983 6517 -29345 -40778 -37951 2129 23524 18912 14769 5539 10643 27711 46099
7453 46099 42885 17902 9181 -7679 -19071 -31322 -6614 19275 33290 66362 74651 57942
7441 57942 24082 6283 -508 2936 16397 25528 35244 37350 14740 14979 14834 34700 50489 44701
7427 44701 63923 68606 67622 59097 24228 3414 12596 23943 19824 40863 52834 54733 65370
7414 65370 50934 30113 240 -4837 2098 5729 10724 30965 42976 30390 58221 60383 47952
7401 47952 34239 25181 915 8602 44195 49906 45360 23132 12724 25067 29855 26887 8366
7388 8366 -2854 15971 56684 51263 23473 17016 18822 20973 26371 -1697 -7648 9837 37768
7375 37768 49339 43851 32876 18494 4471 -764 10312 4900 -6086 -1108 39757 78053 95797
7362 95797 101373 65991 20135 -9756 -11016 -10201 680 1454 26170 47953 63374 68522 65605
7349 65605 40689 41563 63145 90223 92514 70601 40846 -2739 -25764 -31679 -26046 -12169 28285
7336 28285 52798 100862 129653 109153 72746 56023 34011 29482 35337 30789 16273 10995 -676
7323 -676 15567 30625 52415 64461 73004 87760 91714 85655 63954 19820 141 -2384 29998
7310 29998 44856 54304 58507 50599 63111 66471 41886 59977 87810 103378 94696 76341 59883
7297 59883 44702 56798 57655 49480 65614 71584 66800 83596 72750 57954 80737 118054 122971
7284 122971 133014 112309 89070 86542 95987 108755 124862 132098 137882 125119 104999 116300
7272 116300 121552 121543 135310 127823 128879 124754 110580 121096 98703 85286 98539 124281 158470
7259 158470 181057 172621 139240 107519 76236 70045 85398 67379 62914 82267 76265 49674
7247 49674 52441 63490 87006 106832 118483 99263 69865 35931 26262 42455 55026 71164
7235 71164 64261 61467 53478 58377 57894 65343 79587 90297 95624 83825 53582 33759 2870
7222 2870 1197 50052 95752 104468 79112 55768 35389 44318 68141 79681 101153 125535 121032
7209 121032 78993 16967 -13354 7106 38498 82303 114610 139794 140554 94255 54250 38368
7197 38368 32399 50109 68597 66625 75109 93357 95350 62616 27783 41112 54215 82248 82346
7184 82346 71312 49719 46818 77778 92949 94133 66016 59996 71216 72412 63756 69458 70673
7171 70673 62943 70689 71082 54732 55571 52653 59894 66268 72290 84897 74510 56473 62926 86519
7157 86519 100805 122634 115444 79943 37213 15516 13972 48466 72641 94811 109015 118834
7145 118834 109223 99427 87005 95639 122448 116552 101798 83350 57745 31191 14910 41847
7133 41847 75626 113777 142639 145345 155062 148729 130404 99914 82970 84207 77171 76505 97460
7120 97460 112657 146991 153346 152939 151507 136969 107809 96830 101075 110127 114981 129294 124678
7107 124678 134120 134044 122723 108964 106128 132614 142352 135533 114734 110599 118202 165969 221885
7094 221885 286758 317632 289429 233911 179283 159422 150749 167611 167270 158754 153284 139776 106526
7081 106526 70065 43629 45969 94947 142647 146392 127375 91040 64545 57989 67506 91508
7069 91508 90430 105142 114922 102445 88188 59464 46856 63849 79781 113965 121008 110334
7057 110334 86395 53497 36510 46015 67027 92974 107745 131442 147598 128507 117944 88482
7045 88482 78738 86471 87716 102979 82105 82512 91556 76165 87641 95585 94616 101974 115007 95712
7031 95712 102540 103522 97398 109169 128033 139272 133709 141189 112508 98178 103054 109295 126296
7018 126296 130431 147842 143094 131362 144919 149265 140479 139065 133159 112840 92001 106547 110627
7005 110627 108425 123201 147864 161015 151673 121839 106026 92472 95417 106076 110320 92568
6993 92568 102215 128214 134633 121840 113904 109588 113154 136515 151617 134021 90438 60265 74984
6980 74984 101415 107034 132562 154904 132211 109312 112858 116054 112845 134358 156445 142776 141698
6967 141698 122759 102758 72828 72066 95466 144598 146882 149993 145677 155015 163522 134100 114718
6954 114718 93497 98000 128373 136817 122556 99655 80217 102709 135731 152145 155960 161513
6942 161513 182272 168170 140782 121173 112658 117074 122473 120416 161425 196984 188306 184808 182732
6929 182732 171250 177367 168528 137797 120213 122534 152850 170005 163436 139062 136003 163458 184718
6916 184718 184797 166460 168170 162052 167210 167223 145800 127213 128251 122605 123774 144060 161202 171438
6902 171438 176170 176008 188269 170304 154643 145736 148129 145727 168368 187951 181241 183771 153587
6889 153587 158261 172709 198421 199478 189921 175465 168300 155007 142858 110783 119500 140009 155383
6876 155383 178928 182469 179937 190167 187270 174389 157865 157966 150637 158343 148023 145603 154396
6863 154396 165562 159466 154329 160655 176843 172158 170910 151047 132051 161601 179934 177668 166277
6850 166277 139990 120997 145828 155085 143449 151422 168539 194485 192064 180055 159271 150993
6838 150993 157499 168348 180596 181532 179940 154369 126084 111463 132912 156572 185224 196317
6826 196317 223312 196809 151735 115660 107474 106368 146781 189981 218718 228753 219932 203059
6814 203059 189566 172192 173055 173415 177810 191797 200610 195554 182427 182738 190554 200674 211764 219471
6800 219471 219886 215120 224216 234741 229797 231787 207765 186376 163888 165466 167019 186278 230494
6787 230494 250676 272104 272432 244271 216737 193295 201497 215899 237806 244617 231410 218111
6775 218111 201634 189712 191041 186355 204399 234550 238592 228303 213343 194733 185585 210756
6763 210756 239030 226662 204365 190999 176304 186849 183559 191887 205364 193854 190173 211016
6751 211016 221521 229474 226858 204448 210222 212587 215614 223900 226125 213250 202808 213405 218166
6738 218166 219912 239963 249447 254861 229798 242405 241242 267458 271718 255765 260917 250425 261920
6725 261920 281720 290874 305085 312786 316902 313477 307833 318165 331000 336948 321417 311001 303012
6712 303012 296155 284588 275748 284653 287359 290919 305585 312597 310747 335924 358829 359152 338295
6699 338295 299146 299317 310853 303312 301889 328538 346162 360466 358449 362743 373176 363558 371593
6686 371593 380561 359176 353973 334257 312920 287753 301047 315790 338286 360429 365660 364211
6674 364211 352891 344199 325071 285374 259114 239523 264063 278331 297208 317256 334157 342837
6662 342837 342046 314101 290201 292274 290775 273489 293823 318008 334601 341078 314492 297837 283522
6649 283522 280759 276071 292474 323098 346017 369978 398196 374284 349507 333628 320836 337968
6637 337968 345563 342127 354562 379649 389575 387163 384642 376722 391437 413329 426115 402159 374442
6624 374442 373981 378067 369486 378231 387875 406581 418841 444458 467245 463097 471298 464042 449327
6611 449327 440839 451062 474625 460887 467776 469960 489895 530972 547905 561584 554795 575460
6599 575460 618918 649103 669007 695987 779050 853265 906526 909511 890663 849360 826999 824895
6587 824895 812566 808180 817693 814826 811609 824874 839302 846867 847884 842555 853972 873781 918463
6574 918463 991623 1040544 1060441 1041835 1006789 980875 923467 849031 813642 833488 885963 892313
6562 892313 878467 870266 839950 816084 821135 824243 846947 891376 951450 993395 990466 947256
6550 947256 906031 855917 801151 749871 698253 665295 638432 615865 597701 608328 613777 599997
6538 599997 583203 565672 543857 541309 535106 533918 542952 550303 563177 580240 587449 583883 587819
6525 587819 594814 609861 632674 599035 595292 607443 616587 614417 594229 601023 596787 611175 627830
6512 627830 662104 699889 716955 720286 712671 669833 666439 657552 671070 683829 719941 746431
6500 746431 738553 715874 692370 685362 702591 725239 752382 748074 747320 752722 744772 732851 726463
6487 726463 730872 747098 765019 787358 797182 787021 767517 758791 774606 788745 810583 811870
6475 811870 828008 813597 797082 781895 775294 774377 783351 812364 853251 871436 856094 838919
6463 838919 827354 818792 832175 829182 834608 851716 876870 887673 890469 886738 876306 871523 866267
6450 866267 878050 889570 907105 913947 916775 903253 884748 863164 879110 892143 907618 941995
6438 941995 984092 999306 975873 961758 966152 996110 1018682 1045047 1075586 1084316 1075871 1070124
6426 1070124 1051784 1042596 1044798 1070268 1108691 1140961 1165643 1174067 1183168 1186375 1176562 1166476 1173412
6413 1173412 1189338 1200746 1236835 1265849 1271729 1286047 1289455 1293559 1318932 1357749 1380449 1397821
6401 1397821 1388208 1382995 1373462 1378386 1381429 1397651 1429068 1464894 1513567 1537364 1552790 1572210
6389 1572210 1593149 1619447 1620962 1636323 1662499 1689963 1701460 1705864 1728000 1720668 1727538 1750485
6377 1750485 1772032 1776610 1829450 1884707 1910183 1925626 1931443 1940594 1959849 1972139 1978329 2000775
6365 2000775 2034624 2062614 2091332 2115441 2129636 2176481 2207451 2207203 2211152 2213819 2248846 2284909
6353 2284909 2307276 2307314 2326283 2345721 2379251 2435040 2485906 2539651 2613631 2696708 2783164 2840452
6341 2840452 2855838 2846263 2826060 2812717 2833493 2876464 2916785 2984416 3077801 3136101 3187467 3207957
6329 3207957 3230045 3250087 3235384 3232808 3251500 3270649 3263841 3279769 3317924 3376543 3443750 3496899
6317 3496899 3516553 3527049 3545847 3601916 3666081 3736498 3821273 3894770 3989104 4069272 4112740
6306 4112740 4176974 4269599 4370223 4494368 4621317 4717357 4817882 4916691 5025221 5162228
6296 5162228 5329567 5531119 5731047 5915792 6129396 6398307 6703059 7039607 7302534 7523713
6286 7523713 7701499 7873371 8034142 8190443 8363966 8590629 8917404 9269167 9704792 10193921
6276 10193921 10731037 11248220 11773302 12310663 12894821 13588847 14407141 15288527 16217261
6267 16217261 17209845 18355236 19667138 21266804 23301796 25943054 29511523 34528229
6259 34528229 41829022 52357362 65992389 79870180 89116396 91312355 88415297 82600614
6251 82600614 75070110 67306411 60902383 56985865 56309711 59413821 65796853 72816435
6243 72816435 76832789 77481971 77237079 77726277 80161075 85678467 93588927 100801192 104000917
6234 104000917 102203860 96790382 89537939 82063888 76302057 74085626 75763676 78868322
6226 78868322 79405122 76358546 71780717 66769963 61873155 58337152 57693792 61235153
6218 61235153 69758787 82203232 94224430 100052872 98081106 90952607 80779143 68778156
6210 68778156 56579438 45679254 36775543 29836601 24546084 20605313 17689048 15474424
6202 15474424 13725187 12325007 11224700 10321035 9600268 9001596 8531661 8172014 7850929
6193 7850929 7588721 7357628 7157771 6923974 6726909 6516535 6285770 6074676 5879519 5690750
6183 5690750 5506310 5397880 5275771 5115605 4951425 4775464 4622051 4473923 4321676 4174296
6173 4174296 4050130 4007001 3983044 3943957 3866806 3760247 3652803 3559697 3480082 3370408 3260137
6162 3260137 3164949 3084791 2999817 2906460 2814861 2758172 2690681 2632093 2569055 2511094 2446726
6151 2446726 2359374 2292532 2260163 2237410 2196928 2161734 2125332 2074420 2031262 1994555 1969948
6140 1969948 1935442 1885594 1856261 1835444 1836054 1830505 1828064 1848535 1885203 1951791 1983748 1945477
6128 1945477 1888058 1841660 1784239 1719301 1661621 1616297 1540571 1493940 1436362 1390756 1383576 1378063
6116 1378063 1378849 1361302 1331492 1301564 1273607 1223539 1178770 1188747 1204868 1226398 1231562 1224295
6104 1224295 1180889 1133085 1119685 1113392 1108773 1111448 1138733 1165366 1174375 1161815 1144337 1139721
6092 1139721 1146113 1129887 1090975 1056868 1039928 1035549 1054355 1089529 1095413 1086585 1082330 1080065 1066742
6079 1066742 1049337 1043222 1039902 1060888 1081899 1102871 1098609 1090722 1069668 1072774 1079175 1113813 1139848
6066 1139848 1139862 1120450 1080720 1076825 1107068 1140866 1167795 1191725 1209098 1217207 1193274 1141473
6054 1141473 1123354 1129502 1143324 1193613 1246809 1289127 1333726 1410685 1496478 1575938 1624295 1624796
6042 1624796 1589893 1539643 1482138 1424105 1379795 1376969 1394086 1397287 1394058 1399345 1396087 1362639
6030 1362639 1350016 1337419 1366725 1416249 1453130 1458594 1440592 1392415 1350036 1341889 1339012 1365061
6018 1365061 1374993 1383600 1363084 1304915 1239637 1189930 1154110 1132161 1137798 1151383 1162825 1169569
6006 1169569 1170621 1194828 1196648 1183491 1161100 1112216 1055041 1023237 967132 923058 901320 886283
5994 886283 901395 920753 944167 941490 919447 904784 895383 898124 924194 926054 932398 935397 941177
5981 941177 928485 917291 905560 906648 914395 943220 963038 979875 987671 986230 988163 981973 967369
5968 967369 976592 982432 991691 1008480 1012138 1003578 1006219 1000765 1019297 1048131 1055131 1062229 1034320
5955 1034320 1021526 1023391 1030289 1024056 1031074 1033891 1039345 1035638 1032986 1042480 1039372 1040370 1065965 1086493
5941 1086493 1081962 1063127 1026472 1022528 1064317 1091134 1114504 1113687 1113068 1102281 1095818 1093928 1092110
5928 1092110 1111495 1135231 1168973 1191512 1167363 1152058 1160530 1158129 1170654 1219356 1267925 1323089
5916 1323089 1373744 1403905 1437165 1479082 1501180 1516990 1494548 1455938 1426671 1400385 1397464 1412886
5904 1412886 1448397 1501912 1570375 1641097 1680899 1675264 1657271 1650965 1679266 1727060 1768443 1785780
5892 1785780 1804268 1772886 1730807 1679568 1619711 1634393 1655560 1685321 1738722 1753304 1759470 1755399
5880 1755399 1748388 1736243 1731029 1774163 1816176 1871321 1932513 1989284 2023466 1991985 1939896 1861632
5868 1861632 1813843 1779196 1704180 1668008 1654162 1662728 1688756 1711469 1703258 1686435 1690403 1698716
5856 1698716 1714916 1744009 1772963 1801982 1833398 1840822 1829211 1822658 1804086 1783786 1779067 1806863
5844 1806863 1855662 1915649 1952433 1961500 1971851 1993548 2009298 2034672 2071871 2108726 2144246 2177992
5832 2177992 2183089 2164956 2162074 2173004 2216221 2278114 2305174 2315569 2305302 2323207 2351125 2395093
5820 2395093 2443426 2513373 2589186 2622542 2653140 2652916 2696129 2795676 2934960 3086717 3214717
5809 3214717 3261805 3274110 3230482 3145730 3070629 3047489 3096129 3146262 3198716 3210188 3229328
5798 3229328 3268930 3302099 3327968 3372273 3477062 3552785 3627896 3712076 3768684 3838440 3925742
5787 3925742 4048604 4202167 4351992 4566177 4825096 5095821 5315349 5486734 5584216 5627001
5777 5627001 5638505 5602234 5580804 5601130 5682954 5817240 6002617 6239310 6445515 6608832
5767 6608832 6726723 6826582 6969542 7152369 7391010 7669181 7936090 8187259 8398283 8601890
5757 8601890 8775540 8942501 9185563 9469655 9776789 10069578 10341565 10611528 10897435 11221726
5747 11221726 11601917 12057276 12639277 13305292 14026503 14809647 15609683 16444655 17308926
5738 17308926 18255936 19274400 20417347 21773169 23401106 25366948 27775899 30826810
5730 30826810 34870938 40619745 49127887 61413442 77105541 92721246 102725693 104649906
5722 104649906 100835234 93758259 84767819 75652278 68370033 64376978 64549753 68739527
5714 68739527 74744335 78768943 78959654 77027770 74690370 72926638 73419039 77746585
5706 77746585 85834051 95086599 101663253 103240876 100281928 94757085 88606678 83863075
5698 83863075 81959566 82121630 81168537 77200723 71585792 65683601 59805110 54739100
5690 54739100 51580289 51311044 54687049 62197838 72747188 82551641 86983984 84916455
5682 84916455 78571800 69703204 59445368 49161264 40077856 32688547 26863894 22346548
5674 22346548 18944612 16397982 14459281 12958403 11777854 10845802 10083454 9465457 8935717
5665 8935717 8515366 8192805 7935075 7742312 7631662 7532626 7431893 7317134 7154639 6963014
5655 6963014 6781646 6625722 6520982 6478511 6452907 6395970 6247105 6086493 5928532 5743287
5645 5743287 5564111 5425373 5296659 5174762 5062417 4986340 4916176 4852762 4786313 4728787
5635 4728787 4659648 4572458 4508532 4455324 4402243 4350417 4297413 4257282 4217067 4224177 4250180 4294885
5623 4294885 4404453 4580373 4850666 5242090 5662133 5923007 5876982 5656349 5440651 5178484
5613 5178484 4895050 4618568 4419496 4248464 4171837 4106311 4057859 4020013 3966066 3929082 3856921
5602 3856921 3753772 3663718 3590164 3521876 3480342 3419964 3360496 3310446 3286662 3246164 3229447
5591 3229447 3258680 3364578 3583439 3908505 4300623 4508386 4427383 4221211 3983232 3683366
5581 3683366 3361580 3083193 2879476 2752194 2672554 2619527 2551901 2493357 2427239 2334392 2244748
5570 2244748 2175120 2145710 2119435 2082126 2041604 2018275 1964396 1895411 1880654 1875963 1886490 1935834
5558 1935834 2037010 2132675 2248977 2380497 2434085 2371906 2294762 2220574 2120498 2013390
5548 2013390 1892164 1775338 1669711 1597013 1551176 1515863 1507743 1499242 1476323 1448942 1393449
5537 1393449 1330061 1279090 1242231 1226528 1216319 1190440 1187537 1177944 1161977 1155096 1126257 1123073
5525 1123073 1120620 1114102 1116699 1087154 1031056 989044 965009 924947 888235 872291 848746 829813
5513 829813 803108 804709 784765 757875 712149 686791 659584 638724 642649 644924 649639 663140
5501 663140 679785 673851 665447 655910 642148 640519 641269 638593 643029 622491 589447 583973 602322
5488 602322 587053 584782 623714 632835 610920 584655 586531 571858 566684 560836 584757 634775 668246
5475 668246 683325 687366 653519 593867 553414 532080 559614 607507 650073 669456 692499 673543
5463 673543 623733 573545 571035 573245 580165 600056 628690 632580 602953 581379 565420 584737
5451 584737 632063 671990 709829 689268 671579 640717 629272 633357 644249 667467 654651 668595
5439 668595 692797 694005 717549 765357 810108 841481 850348 845266 825893 807248 807421 795761 797216
5426 797216 812458 826779 828096 812700 803298 825540 859092 874858 898118 916772 889080 839880
5414 839880 800457 796933 830386 902686 969953 994729 1004380 1008631 1016807 996223 983949 1025344
5402 1025344 1060516 1104232 1191312 1277997 1375333 1403866 1410240 1429957 1409201 1398853 1386450 1373126
5390 1373126 1387750 1420653 1482141 1568763 1653990 1748348 1889236 2144745 2578010 3220202 3924161
5379 3924161 4317738 4266701 4107922 3847743 3448174 3058087 2774337 2623844 2622207 2749666
5369 2749666 3060852 3530170 3939984 4024589 3803445 3491681 3129545 2757381 2398230 2112849
5359 2112849 1904271 1768843 1623067 1514862 1426707 1327170 1254102 1181616 1102390 1028491 987544
5348 987544 974498 981798 1003944 1024705 1040299 1046018 1039512 1002819 980105 972865 958935 969100
5336 969100 967151 968196 955958 946440 924590 911264 915180 902381 939190 997581 1019042 1015535 1010845
5323 1010845 986189 961596 959116 958986 985253 1023837 1053816 1060747 1054049 1026936 1015914 990016
5311 990016 942592 924112 927809 930447 934269 934348 924557 929600 949727 974228 977780 959444 942278
5298 942278 924041 907605 937087 973476 1030750 1055168 1075015 1082358 1065956 1041365 1017173 1000237
5286 1000237 993466 984298 959665 926777 915331 900097 895480 903204 941412 979428 982044 995686
5274 995686 1027408 1056845 1076265 1060055 1059725 1076389 1109432 1128921 1144289 1147241 1156356 1176149
5262 1176149 1199963 1197220 1195341 1200868 1217297 1230112 1271412 1296425 1311763 1309050 1315440 1307758 1312365
5249 1312365 1344968 1349126 1336930 1313242 1278979 1253422 1239793 1239021 1224635 1217092 1211458 1209909 1221797
5236 1221797 1230222 1265714 1306201 1351227 1456999 1560990 1646782 1684755 1708640 1720550 1711498
5225 1711498 1726558 1744299 1771511 1761435 1719436 1682688 1668068 1653056 1640066 1628890 1644137
5214 1644137 1642773 1675549 1663564 1622181 1590222 1591341 1580676 1626789 1664308 1700504 1720391 1758845
5202 1758845 1814684 1905413 1964126 2043154 2071952 2074861 2051740 2028036 2021029 2031901 2066272 2100410
5190 2100410 2168264 2230051 2283005 2328543 2371145 2407894 2441549 2469389 2493044 2489930 2496870 2518970
5178 2518970 2522790 2557544 2579824 2577921 2584413 2583437 2584943 2657503 2724049 2837068 2945601 3009886
5166 3009886 3034069 3027773 3037905 3058339 3062221 3084399 3121682 3157790 3129959 3112425 3104314 3103304
5154 3103304 3116369 3173825 3244480 3329885 3381724 3411685 3427618 3445000 3493559 3570910 3697562
5143 3697562 3837016 3964461 4103207 4198605 4273472 4352927 4408402 4442225 4485800 4537856 4557986
5132 4557986 4594495 4626163 4663288 4712786 4780164 4839527 4903930 4950646 4962482 4985743 5079431
5121 5079431 5208112 5394308 5568062 5737602 5861548 5952790 6043375 6155826 6268496 6375334
5111 6375334 6487209 6586502 6712908 6908491 7147068 7402431 7669957 7967245 8170786 8345642
5101 8345642 8498555 8697085 8924781 9192129 9459599 9767042 10192887 10751644 11286333 11796638
5091 11796638 12299535 12818113 13289073 13783363 14291616 14844374 15464197 16156893 16903233
5082 16903233 17806220 18813165 19891670 20992848 22166777 23382124 24769117 26320900
5074 26320900 28203239 30347185 32623280 34847468 37215878 39956782 43418564 47660306
5066 47660306 52723492 58487188 64790433 70991926 77890056 86388812 97842497 113669565
5058 113669565 136649446 172593551 231807109 322578689 430961098 510492867 525170118
5051 525170118 495092646 447821890 385147011 311977894 242040752 184114991 139868164
5044 139868164 106836838 82512760 65509929 53724676 44585110 37175077 31284328
5037 31284328 26810371 23544702 21130295 19206961 17861648 16894578 16173916 15588188 15103495
5028 15103495 14555111 13950281 13253551 12600073 12001922 11401773 10832240 10401312 10064251
5019 10064251 9832435 9648593 9463706 9192394 8930607 8673089 8430834 8191112 7939943
5010 7939943 7670531 7378788 7125441 6924043 6802213 6689537 6506068 6308960 6143187 6001559
5000 6001559 5898841 5878626 6020074 6316120 6631568 6770476 6677871 6420819 6066725 5632418
4990 5632418 5179085 4715909 4331725 4034591 3871975 3780651 3741353 3704249 3599769 3481752
4980 3481752 3380670 3254873 3144507 3007099 2901859 2798555 2681749 2566466 2480337 2374996
4970 2374996 2305998 2241590 2171601 2104321 2048270 1958737 1885879 1851113 1832890 1863651 1939733
4959 1939733 2021066 2109176 2161523 2151608 2149071 2138215 2084172 2031780 1971713 1929002 1918025 1936481
4947 1936481 1937201 1942907 1942682 1946341 1950225 1969142 1975833 1957241 1961464 2031087 2130961 2284185 2446946
4934 2446946 2631526 2830346 3020216 3205743 3388884 3544697 3661561 3761164 3836901 3841478
4924 3841478 3817718 3747020 3682399 3619383 3596923 3616272 3678893 3779063 3912938 4081697 4330117
4913 4330117 4661851 5018733 5397438 5776644 6084947 6294088 6396851 6404540 6312471 6148756
4903 6148756 5929583 5682800 5448963 5199459 4978049 4807309 4720371 4683629 4718512 4813663
4893 4813663 4919944 5042645 5140247 5211023 5242598 5256074 5272744 5291194 5307715 5301308 5299844
4882 5299844 5315452 5337794 5369182 5421776 5472643 5485602 5497544 5529921 5525955 5510812 5468321 5412466
4870 5412466 5365286 5371069 5387476 5373463 5394702 5480756 5631694 5861412 6160457 6504749 6879908
4859 6879908 7264806 7652075 7998891 8230524 8282089 8147999 7839698 7391190 6895902 6385066
4849 6385066 5889452 5494619 5166944 4919162 4745938 4624326 4537396 4495762 4501890 4538856
4839 4538856 4594378 4646380 4630235 4531233 4366048 4153153 3920511 3669803 3441531 3199275
4829 3199275 2988869 2805476 2657835 2522671 2429545 2342539 2259490 2180615 2109238 2020350 1943304
4818 1943304 1882315 1862799 1836598 1832058 1825640 1807017 1767831 1752570 1752647 1760401 1761474 1796590 1851870
4805 1851870 1906538 1933162 1952300 1944087 1921951 1916572 1893049 1872199 1848999 1787037 1716935 1665255
4793 1665255 1633925 1644196 1650108 1665655 1700331 1729765 1765400 1797138 1804320 1808990 1816077 1817699
4781 1817699 1822982 1833279 1853324 1914715 1985629 2055277 2130336 2191804 2219536 2251710 2299674 2356199
4769 2356199 2431519 2531601 2632960 2772040 2938337 3110138 3301530 3516801 3758251 4084563
4759 4084563 4528810 5126427 5831605 6556935 7168537 7591371 7781144 7739502 7517322 7181499
4749 7181499 6772261 6364990 5972189 5619200 5315635 5081974 4946310 4869336 4879030 4994482
4739 4994482 5231520 5703272 6398253 7159140 7709559 8015241 8229446 8436570 8691570 9058735
4729 9058735 9591603 10211318 10812798 11185718 11245840 11068618 10724376 10161373 9402592 8561513
4719 8561513 7697220 6860163 6119508 5499105 5013419 4625393 4334711 4132570 3974209 3917766
4709 3917766 3913073 3973593 4117747 4395092 4790062 5314380 5894822 6498468 7059118 7548244
4699 7548244 7933458 8173846 8256572 8118554 7803906 7281516 6671805 6049008 5445235 4907549
4689 4907549 4474767 4143813 3871067 3667417 3507022 3372963 3271892 3226625 3234909 3275652
4679 3275652 3359845 3480668 3622296 3792262 3980292 4097022 4154941 4145216 4065579 3912190
4669 3912190 3727547 3549670 3382294 3256635 3130250 3018216 2931495 2858998 2842498 2810198
4659 2810198 2766641 2716548 2688876 2686444 2700888 2728830 2752177 2767630 2803527 2837304 2858411 2861621
4647 2861621 2856221 2891000 2939450 3027493 3128306 3252636 3345949 3447096 3550709 3670157 3843900
4636 3843900 4049799 4273111 4511536 4751671 5004542 5249360 5456029 5612103 5712415 5771525
4626 5771525 5780556 5753256 5720409 5694102 5690591 5731633 5796940 5866925 5915609 5932814 5942373 5934170
4614 5934170 5866909 5763001 5655814 5504395 5330074 5147846 4965162 4835720 4719970 4615378
4604 4615378 4546862 4529525 4545710 4525945 4507471 4505150 4563836 4646156 4752556 4875089 4992431
4593 4992431 5072946 5181415 5287432 5413261 5585233 5830161 6149657 6526769 6975824 7474127
4583 7474127 7997985 8500411 8968348 9373767 9695385 9927152 10048181 10071870 10073006 10054667
4573 10054667 10040272 10049110 10078886 10165563 10274663 10387905 10472619 10484714 10397946 10215461 9939111
4562 9939111 9556863 9160629 8750733 8346169 7960871 7636110 7365810 7131289 6927442 6785403
4552 6785403 6683523 6630488 6637766 6686262 6725808 6758366 6800004 6885845 6962382 7047481 7144893
4541 7144893 7259245 7375513 7478768 7548848 7637505 7771933 7961951 8239060 8638909 9092799
4531 9092799 9593273 10115429 10661254 11229203 11810999 12376623 12971093 13654931 14365598 15016515
4521 15016515 15510560 15769953 15770923 15561555 15244308 14790900 14199987 13529442 12801138 12098834
4511 12098834 11461393 10915064 10483962 10153676 9924859 9785100 9755554 9799598 9947236 10143873
4501 10143873 10416890 10783336 11238712 11854202 12598042 13409927 14251705 15076553 15680010
4492 15680010 15886787 15712035 15316986 14724209 14012865 13297098 12633216 12025297 11475195
4483 11475195 10998458 10624777 10353033 10161859 10067101 10023630 10045555 10139742 10295073 10519037
4473 10519037 10822285 11229774 11722948 12342608 13090641 13938969 14790205 15662059 16541336
4464 16541336 17396494 18250713 19142098 20175274 21546306 23427019 26080823 29872263 35065829
4455 35065829 41473610 48033561 52837841 54522521 53282467 50058667 45475740 40185601
4447 40185601 34979246 30406436 26683471 23856256 21859705 20665300 20228981 20618328
4439 20618328 22193056 25289895 29483354 32740309 32969295 31131191 28592606 25451771
4431 25451771 21996486 18835515 16289292 14352024 12891323 11777221 11003205 10450575
4423 10450575 9981191 9554012 9184212 8876439 8637077 8442976 8293153 8192550 8124313 8093646
4413 8093646 8103303 8114836 8103873 8049418 7985884 7959125 8016937 8109006 8253589 8454396 8706828
4402 8706828 9053813 9521102 10104681 10785714 11589117 12519614 13487161 14330339 14919054 15212138
4392 15212138 15252883 15122223 14920185 14647707 14467829 14419930 14445288 14532845 14560178 14589017
4382 14589017 14629187 14681500 14765819 14820703 14767011 14558119 14151213 13590505 12913631 12182634
4372 12182634 11479972 10829611 10205759 9653537 9171660 8754723 8377463 8059189 7745486
4363 7745486 7498808 7295600 7147308 7050429 6967248 6906785 6841685 6719710 6531493 6311791
4353 6311791 6103868 5867755 5662890 5476977 5317077 5180866 5048558 4966832 4928935 4933348
4343 4933348 4987224 5036702 5077680 5134634 5211173 5283050 5337690 5378105 5393033 5401154 5438413 5543647
4331 5543647 5673896 5786265 5790911 5690929 5613141 5506516 5348376 5186521 5053421 4963309
4321 4963309 4908925 4846128 4778322 4715790 4667158 4620185 4550636 4463467 4387419 4304639 4227696
4310 4227696 4202807 4199050 4209653 4262605 4375186 4519995 4696094 4964698 5299775 5653564
4300 5653564 6006353 6306480 6481117 6436546 6198409 5816137 5364951 4901616 4471031 4079929
4290 4079929 3730802 3436646 3213183 3055781 2905754 2760582 2624112 2540778 2491418 2453434
4280 2453434 2420968 2382506 2358993 2350466 2335815 2314643 2290189 2240379 2197629 2155354 2148257 2137386
4268 2137386 2128351 2119548 2098730 2095876 2103621 2084495 2071507 2050742 2046326 2088252 2157578 2203249
4256 2203249 2254435 2248653 2233219 2252476 2251234 2232335 2206355 2140759 2091298 2060807 1999126 1905886
4244 1905886 1824591 1751573 1702875 1674956 1616346 1555739 1537021 1511359 1488645 1468111 1436923
4233 1436923 1412540 1365165 1332996 1311026 1310303 1301675 1278232 1223719 1174409 1155315 1136217 1096424
4221 1096424 1046752 997798 962738 949444 912091 857411 773835 702662 648401 631121 611488
4210 611488 581442 540862 526680 531823 513917 491907 479253 454766 450406 441522 428597 406743
4198 406743 393172 392319 370741 358134 358834 333713 311719 311040 289118 296431 315781 322332 284344
4185 284344 267195 254677 246244 243292 227734 230664 236760 236445 244317 227810 225074 233956 225604 224951
4171 224951 235324 225034 209064 198443 186028 172582 183835 204681 228918 255586 282958 284377
4159 284377 287884 295924 273410 297497 354896 380916 384215 372051 398844 441145 481290 516202
4147 516202 526874 527135 517334 493905 456748 424255 343197 300372 309479 300349 323566 325437 320857
4134 320857 334694 380463 428072 463589 463800 440082 423233 410194 384933 350226 319436 297043
4122 297043 295990 312224 305988 265909 226932 225261 239112 273410 296482 311634 318122 306921
4110 306921 302419 271935 261446 263763 265082 284838 326726 352895 359312 353026 344803 380711 416629
4097 416629 471338 522423 545214 571622 618663 665993 713815 748535 767290 801045 835127 863350
4085 863350 847279 838471 842780 837012 860783 869741 846996 817341 790395 777179 759567 780964
4073 780964 792614 790971 808992 813121 821605 838905 843000 817799 809059 792710 789267 765555 724268
4060 724268 690198 679349 684703 679591 677819 635366 583032 574277 606709 663644 710191 734734
4048 734734 795683 851500 880053 884934 915883 972773 1057205 1167675 1244151 1283984 1310386 1323197
4036 1323197 1360358 1380655 1431565 1477454 1515219 1553361 1543337 1535719 1531029 1532964 1559733 1616595
4024 1616595 1665902 1722692 1770498 1777161 1747603 1750095 1759664 1760933 1724437 1688628 1676011 1666836
4012 1666836 1614921 1543800 1429095 1323472 1275613 1204339 1138729 1091796 1053003 988208 954224
4001 954224 908134 882261 811916 751291 712018 682691 654464 638124 593496 540041 502514 477557
3989 477557 464055 458041 454458 418068 383266 375533 335061 307844 275741 249106 282416 306900
3977 306900 320458 322263 299727 295790 310603 296212 283647 264466 265232 286799 325088 338752
3965 338752 330368 317497 322202 306155 284002 275091 271847 283676 288568 308727 325038 326265 307177
3952 307177 274156 252938 247429 251109 263329 243442 197897 164393 137057 94130 58221 49036
3940 49036 57163 91204 121806 125026 102333 58625 12507 -760 -8505 -9185 -3885 -8132 -17825
3927 -17825 -42779 -68895 -75164 -68862 -61886 -47647 -30012 -24270 -20398 -48671 -74688 -92550 -105680
3914 -105680 -114494 -121891 -139797 -121518 -98514 -64606 -65979 -79321 -104520 -107965 -90255 -88989 -96889
3901 -96889 -87244 -90012 -87419 -79286 -89281 -119519 -133397 -124093 -108870 -112347 -114669 -92514 -84730 -75033
3887 -75033 -103538 -123617 -119517 -86498 -85146 -97156 -116955 -148885 -181275 -175463 -157524 -140956
3875 -140956 -114626 -82190 -67239 -79621 -92061 -123823 -144887 -154670 -156727 -151902 -130261 -118315
3863 -118315 -123222 -144971 -169881 -150466 -108585 -95287 -97207 -114426 -127881 -121046 -119925 -119407 -117925
3850 -117925 -113120 -119787 -119023 -103745 -104495 -99996 -102134 -92736 -77546 -74188 -90071 -112952 -128971 -119475
3836 -119475 -88373 -45477 -16113 -15303 -56175 -75499 -71883 -70451 -40746 -28867 -22939 -16289 -2296
3823 -2296 6166 2393 -14142 -15478 -3888 2563 -2742 23807 25770 18761 26522 50592 60633 59115
3809 59115 50116 47068 40066 40256 58723 75161 93270 96408 84331 115335 108360 121577 142183
3796 142183 170476 170974 184657 188001 155827 155447 178289 198905 205283 235662 243095 257575 279958
3783 279958 311399 346150 350014 354996 357045 337373 337106 359608 389528 426069 459503 498011 538372
3770 538372 561943 566074 576238 593549 634594 672176 700628 740092 776077 802636 816909 854078
3758 854078 904295 973862 1058083 1147021 1214112 1286584 1340871 1414578 1481664 1572151 1663472 1769601
3746 1769601 1907546 2040561 2179990 2327035 2433685 2550943 2672595 2798071 2941933 3092962
3736 3092962 3212292 3357708 3528916 3691360 3837401 3975500 4106599 4209457 4333539 4447870
3726 4447870 4541447 4638945 4747562 4821694 4881116 4933663 4955057 4988350 4997014 4992938 4958517 4923409
3714 4923409 4890826 4823722 4746657 4663786 4582154 4526093 4460414 4363751 4292821 4219508 4110000
3703 4110000 3998992 3866593 3728843 3628614 3542785 3456651 3370436 3289762 3224436 3153796 3049206
3692 3049206 2973299 2904172 2870213 2840239 2820905 2829566 2869865 2878217 2925349 2988238 3057151 3138429
3680 3138429 3209159 3263563 3313355 3380059 3443908 3513487 3563628 3611164 3678644 3745732 3826380
3669 3826380 3881436 3926005 3952103 3988164 4040220 4060920 4078736 4053445 4030767 4003982 3980881
3658 3980881 3922224 3869787 3787815 3726342 3657448 3583565 3501745 3395888 3313150 3214673 3118215
3647 3118215 3004108 2878087 2734098 2602541 2475479 2349358 2236684 2126886 2001610 1857399
3637 1857399 1704371 1574851 1478494 1360259 1245161 1155514 1065438 970301 884278 809831 744862
3626 744862 666196 598594 551772 506207 448062 395838 368112 332907 311273 288288 259663 233438
3614 233438 227676 210097 165871 147323 119680 104646 82373 61700 62238 70513 56778 23131
3602 23131 15762 -822 -18017 -12586 -11710 -22532 -18907 -22446 -35361 -62083 -58094 -74681 -84844
3589 -84844 -80675 -68509 -76410 -82430 -76808 -79444 -96505 -104384 -87796 -76494 -68811 -87902 -120892
3576 -120892 -136411 -130305 -114730 -99510 -94541 -110130 -101143 -105157 -123177 -117542 -149036 -177029 -197823
3563 -197823 -212595 -187836 -163514 -134408 -150179 -177055 -159065 -148923 -136894 -130296 -140862 -144307
3551 -144307 -108398 -123813 -143477 -156138 -180016 -184441 -154748 -124727 -110486 -103997 -97207 -86786
3539 -86786 -108514 -119467 -126980 -128171 -124174 -147854 -114388 -93365 -98030 -105699 -120293 -117824 -107376
3526 -107376 -79656 -52785 -46260 -30609 -53712 -73267 -102055 -141056 -156986 -148928 -106114 -75570
3514 -75570 -48054 -18522 14454 13303 -2728 -4000 -16353 2554 10678 13481 15565 8809 16396
3501 16396 24555 40127 51936 77078 102955 109894 102543 70655 48693 58626 54075 59787 94518
3488 94518 104814 119449 131201 106599 115615 132188 160614 171978 168961 164785 146094 132409
3476 132409 133301 122370 114980 129449 162207 183847 198226 226273 245924 242052 262102 264038 285460
3463 285460 292843 289855 278481 287361 321383 361848 398355 419592 446347 475575 491704 466663
3451 466663 456561 450950 429069 460208 480926 494473 508016 521074 521382 498922 480405 479034
3439 479034 513474 539126 575120 612543 626698 654233 662344 661184 670220 678937 692758 704064
3427 704064 732597 740820 748845 762961 788183 802562 833745 867577 930223 941416 939435 940505
3415 940505 931003 946361 990841 1041749 1102979 1189915 1289360 1383000 1444189 1543022 1636023 1746270
3403 1746270 1919589 2125916 2386660 2749294 3262338 3878568 4403316 4636797 4671235 4628583
3393 4628583 4553892 4409784 4260617 4169921 4113699 4068255 4040228 4026141 3991975 3926374 3789270
3382 3789270 3594548 3374248 3117952 2830730 2558698 2308293 2065808 1874243 1722762 1633635
3372 1633635 1581223 1608987 1724592 1952808 2401533 3108614 4015825 4578859 4490846 4120624
3362 4120624 3647261 3057466 2426627 1861855 1406851 1068039 848015 680706 588271 510110
3352 510110 447452 403147 347956 297011 279339 241973 226524 222124 239525 244371 262050 336676
3340 336676 396128 434133 516540 673561 923040 1300918 1702834 1949223 1905692 1740110
3330 1740110 1510596 1233282 925211 649001 455166 307764 193865 111411 80810 60429
3320 60429 22240 -19847 -43775 -74325 -101882 -136337 -149260 -154431 -155603 -152116 -140848 -139951 -160552
3307 -160552 -190957 -178234 -146111 -136671 -132991 -148184 -163350 -177954 -184883 -202120 -193721 -181267
3295 -181267 -166646 -144541 -146922 -165103 -196384 -194633 -203105 -196603 -184120 -190187 -205618 -244238 -272201
3282 -272201 -269348 -264262 -234244 -226377 -216721 -192747 -178993 -204729 -247414 -277481 -285378 -262530 -243511
3269 -243511 -246894 -247655 -250736 -258157 -247397 -239148 -251904 -263177 -247677 -274444 -320542 -334482 -311757
3256 -311757 -318838 -297658 -284832 -275646 -266897 -298216 -327940 -335142 -343524 -316789 -293638 -298761 -324721
3243 -324721 -353384 -360662 -347262 -339274 -332002 -316442 -312701 -307958 -336959 -371387 -368686 -349723 -319814
3230 -319814 -295365 -282316 -299279 -307231 -312808 -344591 -359704 -352119 -319618 -294304 -305250 -323788
3218 -323788 -347571 -358341 -350808 -340609 -302175 -287172 -294446 -325776 -359561 -355409 -358705 -353991 -347776
3205 -347776 -340488 -318577 -323094 -331850 -330071 -329923 -320314 -306882 -279312 -266838 -294644 -327948 -368280
3192 -368280 -357776 -335215 -318594 -315551 -313160 -312795 -299695 -288904 -281930 -293348 -320738 -338371 -331659
3179 -331659 -301568 -290845 -307785 -301032 -304388 -298147 -299652 -320759 -328103 -343168 -346936 -332175 -316366
3166 -316366 -288211 -268875 -279877 -282017 -290805 -308627 -310068 -318138 -327112 -335073 -348251 -344443 -355913
3153 -355913 -339125 -326779 -298256 -279089 -276324 -284690 -285065 -290895 -314051 -328738 -339539 -349998 -337566
3140 -337566 -333171 -319328 -321325 -313107 -288372 -264570 -274662 -287519 -309069 -347177 -349482 -328454
3128 -328454 -323402 -316099 -287218 -276998 -279618 -276468 -275721 -276588 -264843 -259590 -261757 -290276 -288033 -294546
3114 -294546 -310089 -292953 -256254 -248894 -233967 -241025 -267259 -271440 -244225 -229906 -221648 -217123 -244843
3101 -244843 -277270 -285368 -284117 -284667 -256390 -214356 -174753 -151640 -146709 -184361 -209578 -222890 -224013
3088 -224013 -208767 -167757 -149282 -147113 -155942 -156816 -126704 -103326 -68393 -19784 18429 1381
3076 1381 -18607 -28205 -48784 -58688 -60663 -48611 -44317 -58655 -88456 -111891 -106107 -87720 -46150
3063 -46150 -8581 14593 3822 929 -27057 -60486 -59283 -23523 34885 72448 106122 120401
3051 120401 175422 228626 236085 247451 225645 186693 144593 75192 12018 -20681 -38816 -62803
3039 -62803 -54431 -45613 -53096 -59718 -79838 -93571 -98231 -83285 -70978 -63586 -81367 -100964 -109921
3026 -109921 -99359 -90209 -85021 -70824 -68895 -42301 -31185 -58839 -78605 -94267 -87379 -100927
3014 -100927 -109857 -123944 -154709 -161088 -188343 -203187 -187032 -174680 -175464 -178066 -176466 -189886 -196176
3001 -196176 -206118 -235056 -258489 -255704 -262829 -254881 -242237 -264841 -254348 -224496 -222284 -241344 -268528
2988 -268528 -298387 -319673 -327520 -313745 -300200 -294984 -302897 -275993 -268913 -292438 -302649 -323303
2976 -323303 -328628 -322452 -317415 -300658 -280785 -288463 -296879 -298160 -317140 -326198 -329084 -348092 -348176 -332308
2962 -332308 -306933 -303921 -326549 -331756 -342128 -348795 -331304 -315467 -293351 -292557 -305911 -306154 -343314
2949 -343314 -342763 -365279 -355386 -324076 -327955 -342335 -334271 -317790 -324045 -334001 -350558 -366709 -347270
2936 -347270 -325139 -329984 -306930 -332340 -346848 -337640 -343673 -331639 -354034 -366618 -372659 -373814 -370850
2923 -370850 -333926 -301422 -308383 -330650 -364100 -373941 -367099 -366270 -361638 -341285 -352278 -339773 -330654
2910 -330654 -340425 -349627 -367997 -388722 -356637 -332998 -328070 -321683 -329122 -330924 -340563 -354591 -359377
2897 -359377 -352511 -353239 -351090 -344623 -338277 -365306 -382728 -380533 -371932 -340063 -294630 -279968 -320173
2884 -320173 -343560 -354715 -368787 -362078 -335243 -334045 -326440 -321249 -323703 -346163 -380059 -386923 -397542
2871 -397542 -361162 -331708 -321368 -316438 -306309 -296481 -330972 -340794 -331835 -329717 -319682 -314765 -326409
2858 -326409 -348409 -341402 -343480 -356318 -354966 -336962 -318889 -321879 -322106 -334009 -339046 -348513 -328231
2845 -328231 -325909 -329936 -334029 -351475 -359831 -371178 -375346 -356138 -346481 -339958 -320707 -334900 -363621
2832 -363621 -383074 -399480 -407001 -396865 -382726 -366995 -351824 -341885 -347025 -366332 -367300 -367658 -356103
2819 -356103 -335688 -342992 -351051 -355815 -362073 -371978 -345502 -328113 -324565 -330920 -356236 -361703 -362630 -349782
2805 -349782 -340258 -345676 -338885 -329786 -333640 -331152 -345089 -355723 -343055 -334308 -336033 -336088 -328238 -336775
2791 -336775 -341572 -328144 -330626 -337183 -345913 -373750 -367904 -383469 -372688 -344750 -329831 -330273 -313104
2778 -313104 -308684 -334573 -352172 -364365 -347124 -319575 -297602 -277895 -290764 -314808 -357788 -368576
2766 -368576 -354034 -349499 -339485 -318836 -297950 -291478 -311818 -346341 -359159 -368558 -350036 -355511
2754 -355511 -341866 -334450 -336286 -341208 -341191 -331199 -331553 -333250 -319989 -324100 -343672 -343635 -322122 -335537
2740 -335537 -346208 -363760 -388557 -388872 -357478 -350098 -330688 -318020 -318288 -320846 -346632 -353631 -371173
2727 -371173 -375687 -387723 -382160 -348539 -324092 -327446 -323230 -328125 -349356 -355654 -337213 -332314 -353144
2714 -353144 -347480 -349783 -335440 -329751 -336383 -343390 -346970 -346039 -339685 -328120 -323475 -306170 -319817 -329200
2700 -329200 -357259 -367519 -369021 -361073 -341037 -318137 -296973 -287141 -281168 -324991 -359206 -357548 -350084
2687 -350084 -337016 -312092 -291487 -294750 -300213 -329387 -358321 -366817 -367801 -356895 -314428 -295121 -284939
2674 -284939 -294059 -306225 -322051 -345589 -347233 -321522 -309691 -303855 -290489 -316505 -348345 -353716
2662 -353716 -335572 -342253 -335815 -303549 -295673 -304699 -318364 -342893 -352625 -345329 -326113 -318751 -341382
2649 -341382 -348372 -342299 -348171 -341612 -331462 -323090 -314506 -305254 -304381 -318892 -332817 -327100 -322397 -330861
2635 -330861 -320084 -322627 -316747 -306387 -335095 -337987 -334099 -347238 -347695 -337932 -347690 -352792 -341455
2622 -341455 -328784 -307804 -294339 -288586 -295990 -306327 -342444 -388396 -403409 -384815 -341699 -308987
2610 -308987 -296790 -284657 -294973 -330208 -353668 -374041 -368650 -356516 -334510 -311185 -298832 -302977
2598 -302977 -298713 -322780 -354263 -349037 -354546 -359195 -351727 -358796 -341546 -318599 -298742 -281909 -307679
2585 -307679 -324448 -334392 -333775 -336035 -335536 -341811 -324185 -310831 -320643 -335739 -335050 -344440 -333164 -317002
2571 -317002 -309245 -310474 -322510 -339485 -334839 -326333 -320966 -297914 -318586 -314876 -319505 -316653 -311861
2558 -311861 -322506 -327755 -326597 -329370 -312461 -294441 -308528 -319004 -327804 -322235 -298202 -296553 -286941
2545 -286941 -289330 -303698 -307498 -328071 -334588 -328220 -320960 -305443 -293491 -305562 -299843 -301812 -291433
2532 -291433 -300271 -318535 -322272 -325475 -308804 -312259 -306069 -318850 -307142 -307667 -291372 -266102 -256957
2519 -256957 -251278 -257866 -281938 -301114 -319946 -319209 -303694 -287906 -320893 -348121 -325912 -324487 -332557
2506 -332557 -339347 -319016 -316422 -307441 -300942 -328101 -350440 -362137 -342702 -330945 -341603 -334544 -319892
2493 -319892 -318310 -327856 -332188 -328228 -326186 -332149 -329010 -303344 -319634 -326337 -322292 -340834 -346698 -325667
2479 -325667 -307953 -288496 -269778 -281166 -270991 -278027 -285149 -308373 -331727 -320834 -304999 -275173
2467 -275173 -262289 -284910 -289990 -302716 -303696 -308996 -288051 -272200 -256043 -235222 -241526 -307431 -336787
2454 -336787 -333831 -327539 -304051 -286734 -256320 -247173 -269933 -308139 -339022 -331827 -333563 -314858 -290153
2441 -290153 -289790 -296818 -282846 -302088 -338030 -351040 -308996 -278913 -271725 -249486 -259282 -274979 -307429
2428 -307429 -330654 -342069 -328564 -306956 -282358 -278022 -278369 -300053 -312899 -308119 -321862 -326324 -316475
2415 -316475 -313358 -303540 -290024 -289083 -291690 -285469 -292512 -308608 -322644 -328004 -305828 -297071 -268152
2402 -268152 -263299 -260622 -268658 -276261 -288164 -299762 -294751 -297267 -262241 -253291 -258498 -279689 -284225
2389 -284225 -278844 -262388 -253428 -253435 -240645 -245010 -263640 -273914 -299864 -309418 -303233 -273930 -242975
2376 -242975 -225145 -226172 -227444 -257397 -290641 -295684 -284060 -256749 -257592 -281012 -266670 -254498 -247190
2363 -247190 -247846 -248027 -216598 -197368 -201084 -237635 -272956 -287893 -290373 -283499 -245128 -212264 -196303
2350 -196303 -189442 -215781 -233286 -261740 -287928 -264438 -236683 -220940 -198556 -190233 -200189 -217698
2338 -217698 -217834 -238986 -235277 -220946 -234846 -249474 -246833 -242560 -226871 -220577 -224107 -202760 -205408
2325 -205408 -214894 -220629 -224542 -227762 -218859 -195142 -183537 -188515 -198605 -210225 -190437 -189804 -200499
2312 -200499 -184980 -176354 -169690 -182155 -171230 -168944 -137727 -122626 -124399 -123249 -121983 -112927 -123552
2299 -123552 -123910 -142930 -123179 -78342 -76813 -71417 -72036 -82611 -63053 -37035 5822 29729 44115
2286 44115 26825 15732 20634 27165 53674 101283 167012 223636 239410 258555 290078 298126
2274 298126 347605 416319 488710 607055 736172 821629 883226 929156 966551 1013025 1104592
2263 1104592 1240555 1441306 1759577 2196653 2812996 3802966 5527652 7930326 10096955
2254 10096955 10508792 9639650 8555154 7177022 5564129 4063310 2867962 2013475 1405270
2245 1405270 947356 638702 469059 391885 362067 332216 271218 205929 141811 49376 -27071
2234 -27071 -66524 -98671 -98160 -83802 -104209 -146684 -153728 -157621 -164393 -200247 -228359 -248297 -245947
2221 -245947 -235079 -212706 -209349 -207278 -217090 -232024 -242992 -234344 -256352 -270373 -255538 -259740 -274675
2208 -274675 -268317 -292205 -306826 -295484 -284083 -263359 -233257 -237588 -256855 -278696 -315569 -352630
2196 -352630 -331545 -308893 -303034 -281239 -274336 -279095 -303942 -319994 -335287 -325070 -318327 -298672
2184 -298672 -311235 -328806 -331723 -326540 -315300 -295530 -299624 -288329 -291241 -298875 -284399 -298306 -308802
2171 -308802 -322720 -300598 -302909 -305762 -324303 -328120 -331804 -332672 -315188 -330265 -339635 -328117 -329897
2158 -329897 -326560 -322136 -318076 -305274 -296152 -294667 -296137 -321854 -328218 -326404 -321466 -294512 -273466
2145 -273466 -270113 -288607 -310632 -344908 -368169 -356769 -337729 -333627 -323918 -302112 -290951 -296479
2133 -296479 -329390 -341350 -350703 -336387 -311570 -295366 -313097 -346052 -353990 -366308 -377540 -373655
2121 -373655 -371202 -335884 -317272 -303138 -281830 -277362 -283506 -326466 -364221 -403051 -395714 -390341 -357761
2108 -357761 -334729 -303156 -279938 -278759 -300363 -319954 -360498 -381366 -367357 -352923 -328388 -330109
2096 -330109 -337782 -336044 -332670 -324761 -323367 -301300 -297241 -302283 -305058 -317612 -324342 -330848 -337953 -326907
2082 -326907 -315488 -289577 -277792 -300643 -336802 -337724 -342704 -327657 -325322 -323917 -316760 -293418 -268376
2069 -268376 -267245 -298885 -330405 -336884 -333523 -308845 -306239 -294158 -287301 -269988 -285113 -309938 -324594
2056 -324594 -325576 -318488 -311640 -321615 -306244 -298399 -319041 -330491 -336959 -333735 -297860 -283499 -291235
2043 -291235 -304558 -317313 -329785 -312240 -314072 -316826 -308508 -282414 -294888 -316767 -329834 -353804
2031 -353804 -348452 -351296 -333903 -299466 -309805 -306416 -316866 -321466 -328532 -338984 -330780 -323352 -328202
2018 -328202 -343348 -334669 -352006 -354644 -360737 -338470 -325004 -323998 -329917 -338040 -348514 -326354 -309648
2005 -309648 -305662 -298133 -298356 -319019 -316972 -321360 -343395 -355142 -324654 -282843 -290440 -301998 -315522
1992 -315522 -325559 -329559 -294975 -270944 -271487 -273053 -263570 -270285 -290926 -296470 -270547 -274599 -262756
1979 -262756 -243884 -244703 -260362 -295527 -331405 -348130 -335688 -325699 -307481 -301714 -297006 -307166 -320177
1966 -320177 -311635 -303447 -318883 -338491 -337358 -320314 -304305 -298989 -276679 -261192 -277863 -300031
1954 -300031 -316662 -346742 -353603 -353527 -344688 -340014 -317721 -305489 -307303 -290371 -293167 -284593 -311584
1941 -311584 -341331 -365031 -379459 -368507 -347072 -332165 -295061 -267838 -251905 -267748 -310531 -324110
1929 -324110 -358284 -358711 -330784 -325433 -338183 -338071 -337804 -331793 -324178 -326459 -302852 -294668 -287934 -297774
1915 -297774 -316490 -329741 -334077 -341139 -334745 -312728 -326850 -339065 -337877 -336968 -343424 -343710 -320350
1902 -320350 -321640 -324773 -313662 -315256 -303594 -300974 -304799 -316176 -320686 -324882 -325654 -330404 -325413 -324319
1888 -324319 -339890 -317860 -298438 -285410 -277182 -314014 -343144 -348396 -373782 -355474 -343654 -354568
1876 -354568 -339322 -307327 -287485 -270990 -272259 -276946 -277528 -299122 -312389 -315573 -322979 -327930 -315492
1863 -315492 -314795 -324588 -321650 -310943 -323526 -317865 -302215 -302138 -310660 -312502 -329113 -334639 -330642 -319623
1849 -319623 -291281 -277125 -285591 -288167 -291341 -301822 -311615 -304993 -309907 -311570 -303082 -315166 -307014
1836 -307014 -297972 -299966 -300655 -312933 -330132 -337718 -340609 -335546 -332351 -310633 -291846 -275194 -284486
1823 -284486 -296266 -316384 -349753 -364140 -354779 -339607 -324559 -308575 -311626 -295210 -294873 -309330
1811 -309330 -301388 -296709 -294448 -286966 -296565 -307275 -311754 -309579 -314946 -323425 -324676 -322858 -314577 -332282
1797 -332282 -336821 -328358 -312169 -313682 -313351 -338172 -350732 -340979 -347158 -343410 -332427 -301292 -285747
1784 -285747 -304215 -316947 -314830 -326404 -333374 -321968 -314172 -323133 -332262 -348222 -335602 -326751 -300536
1771 -300536 -261096 -243063 -259210 -278156 -300021 -324477 -318405 -318263 -304736 -272051 -261706 -266161
1759 -266161 -290427 -298004 -306075 -312681 -292842 -285630 -277552 -290765 -291126 -282225 -314247 -299520 -300591
1746 -300591 -307170 -302838 -299211 -312388 -302996 -300506 -304095 -295181 -317793 -308969 -273667 -276919 -312579
1733 -312579 -338780 -345847 -304316 -283786 -295625 -318698 -331285 -328922 -329028 -331002 -307434 -286041 -271215
1720 -271215 -276300 -300148 -348829 -372889 -362255 -331464 -306907 -282467 -271440 -282917 -313458 -343397
1708 -343397 -358948 -344210 -327667 -323748 -317734 -304035 -283861 -270612 -279818 -304679 -304784 -299354 -307387
1695 -307387 -336561 -363002 -368041 -340075 -281813 -269703 -265090 -274152 -291432 -291861 -339921 -356965 -342753
1682 -342753 -326350 -319043 -315338 -318661 -319140 -305232 -278977 -272548 -268210 -270418 -279420 -301143 -346682
1669 -346682 -354577 -344342 -318108 -291747 -265016 -271547 -276662 -305841 -317471 -323575 -313932 -271767 -257810
1656 -257810 -258548 -280770 -316253 -327066 -309317 -292016 -281926 -281413 -283036 -298249 -320895 -325227 -324241
1643 -324241 -313515 -268379 -220124 -230001 -249525 -281716 -324106 -336740 -350955 -332620 -313758 -289188
1631 -289188 -284808 -297232 -306115 -297896 -307677 -300592 -290799 -277759 -282576 -290434 -315532 -344506 -347207
1618 -347207 -309999 -276145 -255641 -251973 -287197 -298983 -300226 -309421 -326673 -328551 -325393 -302136 -286454
1605 -286454 -304797 -315529 -329558 -322203 -306112 -300107 -293498 -274142 -288099 -298835 -313326 -312545 -303099
1592 -303099 -303682 -279114 -275176 -257483 -256961 -264100 -283288 -301524 -306280 -303239 -277030 -296417 -311270
1579 -311270 -318227 -308698 -283696 -274197 -279902 -290939 -296056 -308464 -305801 -307855 -295795 -276122 -248345
1566 -248345 -260500 -280034 -283160 -292970 -313397 -317105 -271072 -257123 -260708 -268832 -291683 -312437 -335829
1553 -335829 -326804 -290571 -252483 -254292 -252521 -266202 -311183 -330316 -315756 -315542 -304113 -277769 -252779
1540 -252779 -278195 -317609 -331788 -334856 -321493 -300883 -281515 -273994 -288907 -291853 -303238 -302190
1528 -302190 -286844 -277894 -274035 -281447 -283247 -296479 -310023 -317260 -315591 -315645 -312325 -298891 -299613 -309106
1514 -309106 -293539 -272102 -270575 -270332 -287001 -305225 -311046 -325855 -345446 -337250 -297452 -263211 -261191
1501 -261191 -267870 -285429 -291501 -272075 -279096 -292482 -313749 -319360 -335857 -343002 -329237 -313204 -288664
1488 -288664 -277903 -284987 -299996 -313386 -337364 -347009 -328443 -302173 -281312 -274014 -281359 -285523 -311769
1475 -311769 -312734 -316485 -345100 -338237 -322965 -312922 -321478 -304188 -289834 -286045 -268258 -268939 -296787
1462 -296787 -314882 -331701 -354711 -356878 -323181 -278252 -249363 -245837 -268603 -308795 -316704 -303827
1450 -303827 -299338 -293077 -303105 -295705 -286550 -297232 -319710 -333394 -304677 -280224 -240287 -233143 -259388
1437 -259388 -274955 -288545 -315376 -325976 -301928 -289285 -279146 -296660 -313664 -304861 -288461 -276292
1425 -276292 -286971 -298536 -288503 -269989 -252432 -279455 -280933 -273993 -279596 -274950 -287250 -307059
1413 -307059 -318387 -312991 -304193 -298826 -274842 -248948 -248946 -261015 -287315 -337556 -343702 -329676 -331109
1400 -331109 -305023 -321565 -318286 -311714 -308819 -316795 -306027 -301548 -291827 -278998 -312174 -333268 -333359
1387 -333359 -334994 -337408 -322500 -290388 -286817 -274055 -261969 -287657 -312236 -323822 -305840 -289467
1375 -289467 -283799 -294478 -282503 -290529 -298655 -319431 -326602 -296219 -270229 -267772 -280657 -297717 -308258
1362 -308258 -308142 -307308 -301516 -289602 -265291 -244715 -263523 -280528 -300730 -308999 -289524 -301367 -289183
1349 -289183 -281737 -273559 -266815 -277969 -279750 -261601 -239261 -243528 -266342 -280270 -294482 -293801 -299547
1336 -299547 -309434 -298893 -277794 -253120 -232695 -226489 -259203 -285304 -289848 -297944 -297193 -278475 -290622
1323 -290622 -292426 -297400 -308014 -312046 -323725 -300391 -284441 -262310 -248945 -236779 -247715 -288949
1311 -288949 -317110 -353540 -340069 -292532 -268820 -247390 -249577 -273518 -280932 -302282 -329374 -345070
1299 -345070 -317006 -276699 -277814 -286238 -284251 -295300 -308241 -317938 -326686 -330414 -321219 -294231 -293643
1286 -293643 -306774 -282671 -277872 -288680 -314416 -325005 -333177 -332964 -320122 -320305 -301172 -274314 -269410
1273 -269410 -272784 -269246 -295566 -298059 -304346 -286811 -295230 -312277 -312056 -298423 -282459 -287907 -300891
1260 -300891 -296560 -269183 -268138 -268022 -286505 -286330 -282849 -285014 -282246 -299190 -291626 -275090 -290760 -297348
1246 -297348 -310905 -292577 -266168 -256887 -266418 -285213 -287000 -269281 -272670 -285750 -290264 -278115 -268528
1233 -268528 -268470 -269508 -276839 -261735 -265103 -285976 -304003 -327260 -319700 -300997 -271687 -255363 -261412
1220 -261412 -271976 -287932 -305855 -329811 -322456 -304775 -286005 -272610 -266114 -286098 -314869 -331362
1208 -331362 -319992 -302601 -285911 -277199 -287216 -289926 -314558 -315527 -299683 -291330 -297439 -293086 -286658
1195 -286658 -281562 -270521 -280227 -299451 -291493 -259881 -257451 -283556 -318445 -325628 -326122 -305838 -273284
1182 -273284 -257380 -257041 -270357 -293572 -317137 -334658 -329247 -312638 -268056 -258602 -256281 -278817 -309637
1169 -309637 -337424 -334039 -304796 -274766 -239044 -235616 -254566 -274113 -276382 -266281 -264961 -271888 -293057
1156 -293057 -311974 -300117 -289242 -308148 -299691 -266508 -245426 -248856 -250995 -273742 -297620 -289536
1144 -289536 -291975 -303269 -290531 -267275 -244520 -267267 -280053 -286588 -288701 -286847 -298826 -277253
1132 -277253 -248337 -247827 -274879 -298339 -315051 -310580 -296160 -263218 -262075 -269315 -270447 -279762 -286568
1119 -286568 -301095 -300950 -281189 -260950 -241597 -249548 -281391 -290093 -289844 -306050 -290396 -285231 -256797
1106 -256797 -246748 -272410 -299493 -328731 -322750 -290121 -293857 -292036 -275501 -244342 -237323 -276020
1094 -276020 -342033 -359211 -333170 -299261 -287873 -272713 -253351 -237902 -247725 -272648 -297595 -307776
1082 -307776 -303705 -301882 -306436 -314706 -325342 -325285 -307550 -301277 -283560 -256353 -235509 -259611 -296056
1069 -296056 -304674 -306290 -313282 -300547 -311947 -312693 -311697 -285082 -269955 -266800 -256075 -253477 -238615
1056 -238615 -266788 -310309 -338089 -346790 -328151 -306794 -293006 -261796 -234027 -245638 -282015 -325212
1044 -325212 -353172 -333717 -305934 -287448 -278109 -264860 -261517 -270202 -274099 -278885 -261961 -242451 -245401
1031 -245401 -266467 -283520 -305778 -304229 -277118 -259707 -254160 -235944 -219897 -242320 -254773 -290987
1019 -290987 -296435 -284852 -277669 -265530 -271512 -279903 -289381 -278760 -271528 -266912 -252973 -255657 -268735
1006 -268735 -277029 -292938 -312315 -296256 -270588 -265924 -244802 -237594 -275485 -323327 -343690 -341243
994 -341243 -310038 -285932 -289718 -291034 -295801 -307183 -301097 -299344 -319089 -310794 -264669 -244338 -282016
981 -282016 -331412 -328313 -344852 -326070 -305624 -295389 -285774 -282156 -290593 -296179 -301298 -306576 -294750
968 -294750 -294292 -302639 -317127 -328327 -310661 -297518 -280479 -278301 -275913 -260121 -260554 -290715 -308799
955 -308799 -308948 -284099 -255367 -272926 -290846 -294026 -305037 -296251 -285825 -271231 -261373 -243395 -240222
942 -240222 -256299 -268418 -293705 -276457 -277944 -283923 -289554 -297038 -292459 -296158 -287476 -278406 -265120
929 -265120 -230779 -239794 -261207 -290508 -298585 -287859 -272930 -268487 -271193 -267446 -267203 -259617 -279814
916 -279814 -288417 -274567 -238802 -253866 -256406 -260695 -280909 -293180 -301809 -291546 -263236 -227711 -223597
903 -223597 -256630 -304745 -317168 -337772 -299526 -276737 -270709 -265805 -261084 -267829 -277709 -287889 -293938
890 -293938 -285350 -292236 -308619 -309110 -301243 -297358 -292622 -286099 -294009 -266520 -255645 -249677 -257295 -297062
876 -297062 -320134 -328699 -335177 -317246 -317130 -326480 -291808 -262041 -256721 -285919 -304525 -291943 -285166
863 -285166 -299083 -321799 -325879 -305942 -272790 -252712 -255465 -262219 -275647 -300408 -317532 -321866 -310344
850 -310344 -278400 -254326 -240632 -250919 -276637 -296782 -333013 -334201 -311899 -283766 -258227 -256733
838 -256733 -280452 -297919 -311679 -321306 -284237 -260727 -267254 -264851 -256229 -270072 -280591 -287966 -297113
825 -297113 -295379 -271601 -274020 -281894 -282785 -301263 -297897 -288021 -276232 -271589 -265866 -258894 -273614 -278508
811 -278508 -280580 -277719 -278638 -280776 -275224 -250826 -249300 -271247 -272974 -270561 -277497 -274532 -281583 -285185
797 -285185 -282689 -276974 -267598 -275962 -284815 -286598 -286860 -280029 -281837 -285752 -293851 -289938 -291841 -292290 -308502
782 -308502 -299238 -285431 -265116 -255105 -270256 -283337 -279944 -295834 -306047 -292666 -285748 -266865
770 -266865 -244021 -234123 -243530 -241846 -256092 -281997 -321147 -340205 -327879 -310400 -307063 -302599 -306472
757 -306472 -286278 -260283 -254549 -248562 -259062 -280172 -306964 -340070 -343663 -319127 -318895 -291365 -260479
744 -260479 -239987 -269169 -294398 -293180 -288763 -282680 -291309 -280871 -272490 -281231 -295922 -282303 -284901
731 -284901 -277253 -263157 -258590 -245517 -241829 -259426 -253689 -271364 -288511 -294110 -297041 -292577 -280330
718 -280330 -283318 -268760 -240395 -228000 -227948 -231565 -241704 -266006 -277076 -264187 -260266 -267513 -246464
705 -246464 -236946 -225436 -228709 -243747 -279744 -284200 -284455 -256543 -254634 -273191 -277805 -290623 -275292
692 -275292 -271196 -259626 -244163 -236951 -225906 -237506 -248882 -269127 -300947 -298929 -291576 -264659 -254044
679 -254044 -278168 -282398 -293798 -294471 -258996 -241198 -249149 -268546 -274462 -276923 -285162 -306159 -318134
666 -318134 -318708 -291832 -289904 -289329 -306877 -322135 -313555 -289490 -274217 -273755 -261640 -251785 -282843 -309892
652 -309892 -333199 -344577 -303810 -284061 -282106 -290394 -281910 -280664 -276680 -272117 -274422 -278005 -279366 -286676
638 -286676 -294665 -305692 -317257 -293126 -255338 -238217 -228643 -210998 -245650 -280288 -304307 -317076
626 -317076 -305472 -257476 -234506 -242838 -246294 -268051 -284745 -287909 -295162 -284447 -273959 -269696 -253311
613 -253311 -249460 -239467 -236373 -252017 -248848 -237150 -237275 -243625 -238698 -265803 -283663 -278746 -267685 -257131
599 -257131 -269596 -263134 -255944 -248068 -212487 -216209 -244860 -262472 -288658 -275553 -302130 -312965 -303109
586 -303109 -270987 -246386 -224435 -228699 -241618 -267265 -283012 -283296 -289778 -280726 -279155 -276300 -284688
573 -284688 -312473 -308475 -295593 -286729 -265559 -258163 -265998 -270822 -278702 -307318 -331151 -328131 -287184
560 -287184 -255864 -240739 -268500 -291911 -294446 -276710 -312268 -350767 -336679 -275217 -234897 -238403
548 -238403 -257062 -290351 -273586 -281610 -282676 -290120 -256790 -248866 -277997 -291121 -290776 -297510 -271287
535 -271287 -254520 -244951 -261825 -274048 -274308 -282910 -296401 -286409 -261092 -242150 -238638 -256256 -275953
522 -275953 -267515 -260544 -268956 -262130 -295512 -294865 -280037 -266548 -252913 -224569 -208430 -219720 -237801
509 -237801 -266618 -299999 -315981 -287968 -260201 -254844 -236762 -238490 -264961 -291780 -299406 -285395
497 -285395 -252331 -227319 -213382 -249472 -288512 -314733 -311178 -319952 -289338 -254326 -222144 -203699
485 -203699 -239716 -290446 -299149 -292904 -280380 -263487 -260994 -260901 -260657 -279584 -291760 -309338 -302577 -261790
471 -261790 -223232 -221067 -248048 -266103 -287800 -304032 -315869 -301305 -287422 -257231 -249851 -278428
459 -278428 -281419 -263166 -267622 -277984 -280601 -282665 -282227 -248663 -266421 -288120 -302690 -288015 -261744
446 -261744 -272625 -279877 -299140 -288130 -276748 -264190 -254304 -267791 -286140 -275678 -273301 -295201
434 -295201 -317907 -308243 -278366 -250563 -245694 -250364 -259386 -283357 -281300 -271192 -276256 -263240 -248198
421 -248198 -250067 -282405 -310428 -302970 -277469 -251124 -236133 -224703 -205039 -209483 -240952 -295999
409 -295999 -319333 -305313 -267044 -227220 -233092 -227702 -245272 -260302 -283671 -306459 -295600 -291937
397 -291937 -273132 -251704 -261607 -267352 -272907 -263469 -252939 -250506 -259224 -264392 -297675 -296788 -310469 -300029
383 -300029 -254811 -225732 -225584 -234264 -249939 -286932 -304068 -307851 -300957 -275335 -232728 -226887 -242195
370 -242195 -267327 -300728 -307538 -299415 -286983 -255673 -234065 -229748 -240500 -275255 -300206 -340192
358 -340192 -322965 -310013 -280720 -242875 -236174 -226118 -257592 -281975 -298566 -301212 -308252 -313447 -291375
345 -291375 -278451 -276981 -282656 -287201 -284105 -295255 -289557 -265808 -233898 -239284 -258599 -273742 -299040
332 -299040 -308957 -320902 -339444 -315503 -266157 -209623 -184376 -214733 -264828 -290984 -307641 -307253
320 -307253 -293063 -252686 -230665 -233957 -243503 -258929 -272254 -265545 -265070 -265992 -247247 -254624 -263401 -256963
306 -256963 -272644 -285142 -274208 -264422 -245705 -238932 -238741 -236920 -239448 -251372 -274718 -272006 -269990
293 -269990 -262970 -254260 -242386 -238868 -235151 -222892 -225116 -238732 -265181 -270100 -256680 -245072 -235156
280 -235156 -233489 -253806 -276606 -295767 -294994 -301487 -285248 -276410 -271985 -273907 -275525 -279565 -293548 -293879
266 -293879 -295734 -270814 -259901 -237126 -267395 -294006 -324733 -322222 -315638 -314423 -300593 -296089 -276890
253 -276890 -258865 -237596 -245510 -268670 -294111 -291169 -310258 -332488 -325994 -314932 -285128 -260505
241 -260505 -245683 -224336 -218951 -230666 -253501 -290242 -325650 -332334 -325519 -310329 -276814 -251929
229 -251929 -231673 -215242 -232168 -251116 -271760 -276543 -284736 -283742 -274893 -283330 -286689 -279663 -276384 -287328
215 -287328 -282911 -243264 -230849 -232685 -244438 -271929 -283854 -294244 -284370 -249351 -225493 -218566 -235711
202 -235711 -241915 -265923 -281691 -268767 -255574 -236234 -225456 -235959 -243540 -265061 -269035 -261399 -253077
189 -253077 -238203 -257136 -274837 -293585 -316452 -317616 -289914 -265659 -245298 -227556 -208783 -237328
177 -237328 -270573 -289212 -289300 -276981 -288480 -266817 -261205 -270359 -274808 -272015 -264801 -255753 -242245 -250108
163 -250108 -240936 -262519 -271749 -265166 -289552 -296809 -307082 -299001 -284627 -259708 -244737 -245016 -242562
150 -242562 -240694 -253363 -278662 -287869 -301209 -293075 -270021 -252466 -258885 -268567 -278190 -255974 -233059
137 -233059 -238721 -256211 -261578 -263473 -279260 -261748 -261384 -263562 -251145 -235395 -226540 -238426 -260006
124 -260006 -268921 -248804 -263067 -259821 -229738 -237366 -248838 -254217 -255023 -253077 -256754 -251209 -245570 -237870
110 -237870 -238579 -235167 -237608 -247944 -252432 -250735 -241925 -242782 -240463 -254678 -254199 -243292 -225156 -222495
96 -222495 -239888 -250732 -260187 -269306 -275833 -276666 -272277 -258280 -255358 -232907 -225704 -243324 -234345 -230227
82 -230227 -240475 -245876 -235441 -235957 -251549 -267688 -259225 -251388 -242456 -225561 -226354 -236366 -232985 -232655
68 -232655 -247690 -272915 -289853 -281829 -258821 -227157 -214366 -225993 -231991 -227738 -242843 -271143 -292243
55 -292243 -275979 -255036 -225215 -224633 -226632 -228420 -245077 -250710 -252359 -243031 -239980 -240301 -246156 -271645
41 -271645 -276394 -260670 -229793 -229056 -227458 -230886 -238299 -243671 -255953 -268897 -274738 -262970 -245767 -222251
27 -222251 -231135 -242716 -253001 -243491 -220799 -210166 -200844 -193395 -207260 -238764 -271115 -280698 -289004
14 -289004 -273183 -237479 -210631 -204341 -210663 -221508 -244515 -244085 -235070 -231977 -209515 -215186 -224831 -245845
0 -245845
$$ Imaginary data points
##PAGE= N=2
##DATA TABLE= (X++(I..I)), XYDATA
16383 -399398 -370032 -362342 -346441 -349500 -352878 -370613 -385547 -375574 -365752 -327557 -290874 -288656 -284318
16370 -284318 -282722 -291052 -296465 -282146 -267282 -259797 -236776 -238510 -234381 -250444 -253274 -250320 -232263
16357 -232263 -213158 -187751 -161862 -145638 -137002 -144012 -153379 -153719 -142917 -142553 -130055 -124095 -99017
16344 -99017 -86967 -75756 -86515 -94787 -81211 -70567 -48301 -31781 -26718 -13800 -6500 -4439
16332 -4439 -7313 -24966 -7428 1985 17350 43352 55119 59942 69025 65949 57363 63682 83629
16319 83629 104653 120937 127358 133641 141800 140229 138512 111958 107890 150208 190019 207617 228386
16306 228386 229448 223769 212016 198033 186653 206946 234274 258402 275301 271541 253733 253184
16294 253184 247790 236809 253799 251987 269058 292361 294832 303108 315652 310361 328173 331360 336858
16281 336858 357728 355153 362473 351586 347354 364789 378041 395774 405369 395442 391711 392936 412894
16268 412894 436805 441682 457611 472679 458779 453200 441377 438935 453688 473001 488078 495913
16256 495913 500188 500136 502494 498122 478863 466113 474268 497046 507018 519593 551028 558056 542869
16243 542869 542427 556839 562139 564547 555077 545489 516949 529296 546075 571178 590577 596611 628695
16230 628695 654784 635469 614154 584156 583499 589105 602225 612653 630725 634552 630266 634275 628114
16217 628114 622792 624477 665476 687817 698925 707354 696934 656190 625751 604865 586674 620313
16205 620313 662972 713002 728955 736140 745299 735078 720903 710404 695062 718803 756787 771278
16193 771278 763279 721111 688723 674707 688548 701831 727788 747440 772631 773998 773606 750778
16181 750778 749954 751290 751934 763244 772624 768558 765226 736008 730741 750933 763730 785808 799225
16168 799225 798332 786762 782061 774625 781643 775322 766266 794268 789054 785916 779501 783443 809684 836487
16154 836487 828326 821387 806075 799879 811196 821983 816938 822291 833457 824046 822602 808787 785683
16141 785683 790182 827491 857110 859731 847514 837853 819995 793916 793311 816414 830712 864429
16129 864429 882728 861842 826006 798427 793779 803614 823291 837863 865189 886631 864936 831724
16117 831724 792494 788486 817087 854778 875240 900467 898940 891458 863916 832399 828711 826075
16105 826075 844965 869697 869755 864190 855657 838414 827543 849863 863498 873339 889557 895615 886441
16092 886441 874417 868069 881671 876681 880172 883248 870356 884827 879850 858255 855442 872517 895921
16079 895921 891960 890251 890995 896994 892540 878139 872172 865181 874504 882560 875331 875109 875746 861139
16065 861139 876321 888963 882797 886642 897807 905885 877383 871858 868565 857223 862017 878890 874050
16052 874050 878774 877649 882034 878794 874044 877695 888525 884738 869561 856016 877622 893294 900370
16039 900370 883558 879784 891695 886400 893964 851378 825626 850246 875442 885979 889212 884967
16027 884967 905186 900199 894541 865280 866171 859606 880554 900352 905393 874285 856740 866195 872704
16014 872704 874716 856027 863494 905857 906613 893283 900893 909765 915588 909045 899784 887553 879653
16001 879653 878693 867871 874762 886712 903784 915293 918407 891607 875167 881964 891743 887567 872886
15988 872886 881901 898747 925561 914703 884995 880740 897369 908164 909313 894740 900633 883280
15976 883280 868564 878123 884039 900074 942717 964127 935760 893881 858591 843740 846899 844267
15964 844267 862692 880205 920589 927465 894319 879242 884310 907997 924386 907698 892276 886884
15952 886884 872199 853104 840969 849852 881926 928034 927178 914291 912717 917555 904262 898338 895117
15939 895117 895525 908569 921390 904080 874239 858290 874255 893470 907394 897272 884535 908013
$$ [...]
##END NTUPLES=NMR SPECTRUM
##END=
