##TITLE=1H_DE-80H_X3
 200.13MHz, d2o
 8 sc
 
 19ns.26.2.2025
##JCAMPDX= 6.0         $$ Bruker NMR JCAMP-DX V2.0
##DATA TYPE= NMR SPECTRUM
##DATA CLASS= NTUPLES
##ORIGIN= UXNMR, Bruker Analytische Messtechnik GmbH
##OWNER= pz
$$ XWIN-NMR		Version 3.5
$$ Thu Dec  4 10:09:08 2025 Russian Standard Time (UT+4h)  Yarkov@DPX200
##.OBSERVE FREQUENCY= 200.1313
##.OBSERVE NUCLEUS= ^1H
##.ACQUISITION MODE= SIMULTANEOUS
##.ACQUISITION SCHEME= undefined
##.AVERAGES= 8
##.DIGITISER RES= 18
##SPECTROMETER/DATA SYSTEM= spect
##.PULSE SEQUENCE= zg30
##.SOLVENT NAME= CDCl3
##.SHIFT REFERENCE= (INTERNAL, CDCl3, 0, 15.499)
##AUDIT TRAIL= $$ (NUMBER, WHEN, WHO, WHERE, WHAT)
$$ ##TITLE= Audit trail, XWIN-NMR		Version 3.5
$$ ##JCAMPDX= 5.01
$$ ##ORIGIN= Bruker BioSpin GmbH
$$ ##OWNER= Yarkov
$$ C:/Bruker/XWIN-NMR/data/yarkov2/nmr/H-C/1/pdata/1/auditp.txt
$$ ##AUDIT TRAIL=  $$ (NUMBER, WHEN, WHO, WHERE, WHAT)
(   1,<2025-12-04 10:07:53.60 +0400>,<Yarkov>,<DPX200>,
      <created by zg, POWCHK disabled, PULCHK disabled
       configuration hash MD5:
       00 E9 B6 7A A2 85 ED C7 34 08 36 98 17 FE 4E 26
       data hash MD5: 16K
       2E E9 30 DA 12 66 32 16 29 A6 4E 2D 33 31 70 83>)
(   2,<2025-12-04 10:07:58.68 +0400>,<Yarkov>,<DPX200>,
      <Start of raw data processing
       efp BC_mod = 2 LB = 0.25 FT_mod = 6 PKNL = 1 PHC0 = -5307.264 PHC1 = 27.62191 SI = 16K 
       data hash MD5: 16K
       B6 B4 0F 41 C2 E6 C0 35 6D 43 74 34 1B CB DE 68>)
(   3,<2025-12-04 10:08:17.64 +0400>,<Yarkov>,<DPX200>,
      <pk PHC0 = -7.03379 PHC1 = 3.4 
       data hash MD5: 16K
       0A 97 3B 41 A8 C9 F4 C8 7B E9 87 16 E2 80 70 55>)
(   4,<2025-12-04 10:08:20.71 +0400>,<Yarkov>,<DPX200>,
      <abs ABSG = 5 
       data hash MD5: 16K
       F9 76 F0 76 12 C7 18 99 A5 A3 D4 9B 7A 65 C0 B0>)
$$ ##END=
$$ 
$$ hash MD5
$$ 96 E6 F9 A3 F0 A7 AA 22 27 7F 40 D4 96 77 90 0C
##$RELAX= 
##$RELAX= 
##$RELAX= 
##$RELAX= 
##$RELAX= 
##$RELAX= 
$$ Bruker specific parameters
$$ --------------------------
##$DU= <C:/Bruker/XWIN-NMR>
##$EXPNO= 1
##$NAME= <H-C>
##$PROCNO= 1
##$TYPE= <nmr>
##$USER= <yarkov2>
##$AMP= (0..31)
100 100 100 100 100 100 100 100 100 100 100 100 100 100 100 100 100 100 
100 100 100 100 100 100 100 100 100 100 100 100 100 100 
##$AQSEQ= 0
##$AQ_mod= 1
##$AUNM= <au_zg>
##$AUTOPOS= <>
##$BF1= 200.13
##$BF2= 200.13
##$BF3= 200.13
##$BF4= 200.13
##$BF5= 200.13
##$BF6= 200.13
##$BF7= 200.13
##$BF8= 200.13
##$BYTORDA= 1
##$CFDGTYP= 0
##$CFRGTYP= 5
##$CHEMSTR= <none>
##$CNST= (0..31)
1 1 145 1 1 1 1 1 1 1 1 1 1 1 1 1 1 1 1 1 1 1 1 1 1 1 1 1 1 1 1 1 
##$CPDPRG= <>
##$CPDPRG1= <>
##$CPDPRG2= <>
##$CPDPRG3= <>
##$CPDPRG4= <mlev>
##$CPDPRG5= <mlev>
##$CPDPRG6= <mlev>
##$CPDPRG7= <mlev>
##$CPDPRG8= <mlev>
##$CPDPRGB= <>
##$CPDPRGT= <>
##$D= (0..31)
0 0.7 0 0 0 0 0 0 0 0 0 0.03 0 0 0 0 0 0 0 0 0 0 0 0 0 0 0 0 0 0 0 0 
##$DATE= 1764828473
##$DBL= (0..7)
120 120 120 120 120 120 120 120 
##$DBP= (0..7)
150 150 150 150 150 150 150 150 
##$DBP07= 0
##$DBPNAM0= <>
##$DBPNAM1= <>
##$DBPNAM2= <>
$$ [...]
##$SUBNAM3= <"">
##$SUBNAM4= <"">
##$SUBNAM5= <"">
##$SUBNAM6= <"">
##$SUBNAM7= <"">
##$SUBNAM8= <"">
##$SUBNAM9= <"">
##$SW= 18.0517328524113
##$SWIBOX= (0..15)
0 0 2 0 0 0 0 0 0 0 0 0 0 0 0 0 
##$SW_h= 3612.71676300578
##$TD= 16384
##$TD0= 1
##$TE= 0
##$TE2= 300
##$TE3= 300
##$TEG= 300
##$TL= (0..7)
0 120 120 120 120 120 120 120 
##$TP= (0..7)
150 150 150 150 150 150 150 150 
##$TP07= 0
##$TPNAME0= <>
##$TPNAME1= <>
##$TPNAME2= <>
##$TPNAME3= <>
##$TPNAME4= <>
##$TPNAME5= <>
##$TPNAME6= <>
##$TPNAME7= <>
##$TPOAL= (0..7)
0.5 0.5 0.5 0.5 0.5 0.5 0.5 0.5 
##$TPOFFS= (0..7)
0 0 0 0 0 0 0 0 
##$TUNHIN= 0
##$TUNHOUT= 0
##$TUNXOUT= 0
##$USERA1= <user>
##$USERA2= <user>
##$USERA3= <user>
##$USERA4= <user>
##$USERA5= <user>
##$V9= 5
##$VALIST= <valist>
##$VCLIST= <CCCCCCCCCCCCCCC>
##$VD= 0
##$VDLIST= <DDDDDDDDDDDDDDD>
##$VPLIST= <PPPPPPPPPPPPPPP>
##$VTLIST= <TTTTTTTTTTTTTTT>
##$WBST= 1024
##$WBSW= 4
##$XGAIN= (0..3)
0 0 0 0 
##$XL= 0
##$YL= 0
##$YMAX_a= 345315
##$YMIN_a= -281717
##$ZGOPTNS= <>
##$ZL1= 120
##$ZL2= 120
##$ZL3= 120
##$ZL4= 120
##$ABSF1= 15.65104
##$ABSF2= -2.400813
##$ABSG= 5
##$ABSL= 3
##$ALPHA= 0
##$AQORDER= 0
##$ASSFAC= 0
##$ASSFACI= 0
##$ASSFACX= 0
##$ASSWID= 0
##$AUNMP= <proc_1d>
##$AZFE= 0.1
##$AZFW= 0.1
##$BCFW= 0
##$BC_mod= 2
##$BYTORDP= 0
##$COROFFS= 0
##$CY= -3
##$DATMOD= 1
##$DC= 0
##$DFILT= <>
##$DTYPP= 0
##$F1P= 0
##$F2P= 0
##$FCOR= 1
##$FTSIZE= 16384
##$FT_mod= 6
##$GAMMA= 0
##$GB= 0
##$INTBC= 1
##$INTSCL= 3.241238e-09
##$ISEN= 128
##$LB= 0.25
##$LEV0= 0
##$LPBIN= 0
##$MAXI= 10000
##$MC2= 0
##$MEAN= 0
##$ME_mod= 0
##$MI= 1.114404
##$NCOEF= 0
##$NC_proc= -6
##$NLEV= 6
##$NOISF1= 3.799351
##$NOISF2= 2.8
##$NSP= 0
##$NTH_PI= 0
##$NZP= 0
##$OFFSET= 15.49899
##$PC= 1
##$PHC0= -5314.298
##$PHC1= 31.02191
##$PH_mod= 1
##$PKNL= yes
##$PPARMOD= 0
##$PSCAL= 0
##$PSIGN= 0
##$REVERSE= no
##$SF= 200.130004546559
##$SI= 16384
##$SIGF1= 3
##$SIGF2= 2
##$SINO= 0.751879
##$SIOLD= 32768
##$SREGLST= <19F.Aceton>
##$SSB= 0
##$STSI= 16384
##$STSR= 0
##$SW_p= 3612.71676300578
##$SYMM= 0
##$S_DEV= 0
##$TDeff= 16384
##$TDoff= 0
##$TI= <>
##$TILT= no
##$TM1= 0
##$TM2= 0
##$TOPLEV= 0
##$USERP1= <user>
##$USERP2= <user>
##$USERP3= <user>
##$USERP4= <user>
##$USERP5= <user>
##$WDW= 1
##$XDIM= 16384
##$YMAX_p= 385002099
##$YMIN_p= -481062
$$ End of Bruker specific parameters
$$ ---------------------------------
##NTUPLES= NMR SPECTRUM
##VAR_NAME=  FREQUENCY,     SPECTRUM/REAL,   SPECTRUM/IMAG
##SYMBOL=    X,             R,               I
##VAR_TYPE=  INDEPENDENT,   DEPENDENT,       DEPENDENT
##VAR_FORM=  AFFN,          ASDF,            ASDF
##VAR_DIM=   16384,         16384,           16384
##UNITS=     HZ,            ARBITRARY UNITS, ARBITRARY UNITS
##FACTOR=    0.220516191357247, 1,           1
##FIRST=     3101.81295095451, 0,            0
##LAST=      -510.903812051266, 0,           0
##MIN=       -510.903812051266, -481062,     0
##MAX=       3101.81295095451, 385002099,    0
$$ Real data points
##PAGE= N=1
##DATA TABLE= (X++(R..R)), XYDATA
$$ [...]
$$ plain form
7792 -243544 -264015 -228998 -235343 -312089 -229504 -235133 -240401 -256074 -289453 -234790 -181258 -197365
7780 -197365 -193259 -161740 -179288 -231964 -211368 -140251 -108833 -102087 -137515 -160800 -274767 -231232
7768 -231232 -214516 -225187 -239337 -186004 -156979 -169766 -183096 -229724 -227299 -212811 -210480 -189971
7756 -189971 -212745 -249037 -207015 -163997 -178529 -217849 -178438 -228144 -237802 -203950 -208839 -202467
7744 -202467 -243999 -275468 -284845 -285023 -222480 -155925 -201245 -244890 -227132 -192958 -156801 -92084
7732 -92084 -94246 -175050 -146591 -92981 -185626 -202810 -219327 -275379 -273700 -284566 -204553 -178129
7720 -178129 -242690 -259758 -208149 -205416 -230732 -218147 -178316 -140378 -148543 -170215 -201737 -169321
7708 -169321 -148057 -76904 -86525 -61049 -83957 -51578 -33391 -84256 -64852 -102568 -162997 -131275
$$ packed form
7792b43544k0471L5017o345p6746Q2585n629n268j5673l3379N4663N3532j6107
7780a97365M106L1519j7548n2676K0596P1117L1418O746l5428k3285j13967M3535
7768b31232J6716j0671j4150N3333K9025j2787j3330m6628K425J4488K331K0509
7756a89971k2774l6292M2022M3018j4532l9320L9411m9706r658L3852m889O372
7744b02467m1532l1469r377j78O2543O6555m5320m3645J7758L4174L6157O4717
7732i2084k162q0804K8459N3610r2645j7184j6517n6052J679j0866Q0013K6424
7720a78129o4561j7068N1609K733k5316J2585L9831L7938q165k1672l1522L2416
7708a69321K1264P1153r621K5476k2908L2379J8187n0865J9404l7716o0429L1722
$$ plain form
7696 -131275 -26041 -19994 -42460 -73181 -47075 -111225 -112720 -121943 -114624 -78140 -97589 -79406
7684 -79406 -139394 -158109 -152503 -125985 -202473 -244998 -231196 -210913 -230008 -230142 -182128 -171680
7672 -171680 -203571 -177547 -175270 -206687 -164226 -203331 -189680 -179038 -200392 -228823 -226018 -205548
7660 -205548 -178812 -195915 -288696 -211102 -181804 -254243 -239252 -233562 -200002 -171973 -165097 -219350
7648 -219350 -231014 -254111 -285794 -238048 -198857 -216043 -248116 -216242 -178597 -153283 -94215 -89211
7636 -89211 -151739 -165518 -183082 -169076 -180851 -147792 -148540 -155399 -207621 -236825 -213781 -238784
7624 -238784 -222730 -215756 -186059 -170475 -158983 -202144 -168920 -168246 -250455 -278189 -244724 -244277 -198818
7611 -198818 -226422 -195717 -206580 -232668 -203947 -199122 -128694 -146153 -152616 -100978 -94175 -152952
$$ packed form
7696a31275J05234O047k2466l0721K6106o4150j495r223P319L6484j9449J8183
7684g9406n9988j8715N606K6518p6488m2525J3802K0283j9095j34M8014J0448
7672a71680l1891K6024K277l1417M2461l9105J3651J0642k1354k8431K805K0470
7660b05548K6736j7103r2781P7594K9298p2439J4991N690L3560K8029O876n4253
7648b19350j1664k3097l1683M7746L9191j7186l2073L1874L7645K5314N9068N004
7636h9211o2528j3779j7564J4006j1775L3059p48o859n2222k9204K3044k5003
7624b38784J6054O974K9697J5584J1492m3161L3224O74q2209k7734L3465M47M5459
7611a98818k7604L0705j0863k6088K8721M825P0428j7459o463N1638O803n8777
$$ plain form
7599 -152952 -235505 -220246 -247067 -226809 -246580 -222859 -168886 -158874 -167929 -105562 -131957 -183376
7587 -183376 -133321 -115712 -132885 -227441 -242455 -180457 -187519 -228385 -184322 -152270 -194582 -193503
7575 -193503 -180045 -180967 -203698 -149107 -167244 -144860 -163008 -234833 -215995 -219362 -205478 -193474
7563 -193474 -225951 -264760 -237074 -209089 -256977 -223409 -150034 -180769 -122221 -156857 -113959 -194400
7551 -194400 -212873 -223268 -180171 -157337 -178251 -129268 -185000 -201039 -164454 -167827 -140035 -78589
7539 -78589 -127632 -178893 -205823 -167782 -150393 -149868 -147973 -135578 -112301 -112569 -165580 -150987 -149551
7526 -149551 -132251 -66455 -86054 -130393 -161478 -134164 -213796 -264418 -254346 -195685 -163497 -110577
7514 -110577 -102782 -65715 -89708 -93656 -123249 -206600 -154816 -91023 -122475 -108999 -76606 -106584
$$ packed form
7599a52952q2553J5259k6821K0258j9771K3721N3973J0012r055O2367k6395n1419
7587a83376N0055J7609j7173r4556j5014O1998p062m0866M4063L2052m2312J079
7575a93503J3458r22k2731N4591j8137K2384j8148p1825J8838l367J3884J2004
7563a93474l2477l8809K7686K7985m7888L3568P3375l0735N8548l4636M2898q0441
7551a94400j8473j0395M3097K2834k0914M8983n5732j6039L6585l373K7792O1446
7539g8589m9043n1261k6930L8041J7389N25J895J2395K3277k68n3011J4593J436
7526a49551J7300O5796j9599m4339l1085K7314p9632n0622J0072N8661L2188N2920
7514a10577P795L7067k3993l948k9593q3351N1784O3793l1452J3476L2393k9978
$$ plain form
7502 -106584 -198033 -182474 -158889 -111010 -100265 -112527 -201424 -152233 -96535 -116666 -137219 -192918
7490 -192918 -124313 -75641 -63316 -108806 -135504 -98594 -117956 -116121 -25508 -7761 -59228 -156862
7478 -156862 -67884 -27911 -64071 -108868 -38011 -72862 -110751 -44307 -35431 -45390 23958 -32800
7466 -32800 -38278 -8317 -8023 -64569 -50758 39486 1240 46046 9295 40510 17729 11960 15469
7453 15469 -18337 25699 -15680 28172 58253 25191 38222 15934 2333 -7646 39163 73148
7441 73148 49120 77956 72979 102259 103506 75749 114488 106781 125958 159457 103878 119228
7429 119228 123750 96543 116928 110987 112777 189328 165692 98182 94505 89978 128256 140927 180868
7416 180868 182452 178029 163794 176749 245970 333915 389043 368571 359222 369662 359284 350358
$$ packed form
7502a06584r1449J5559K3585M7879J0745j2262q8897M9191N5698k0131k0553n5699
7490a92918O8605M8672J2325m5490k6698L6910j9362J835R0613J7747n1467r7634
7478a56862Q8978L9973l6160m4797P0857l4851l7889O6444Q876r959O9348n6758
7466c2800n478K9961K94n6546J3811R0244l8246M4806l6751L1215k2781n769L509
7453A5469l3806M4036m1379M3852L0081l3062J3031k2288j3601r979M6809L3985
7441G3148k4028K8836m977K9280J247k7757L8739p707J9177L3499n5579J5350
7429A19228M522k7207K0385n941J790P6551k3636o7510l677m527L8278J2671L9941
7416A80868J584m423j4235J2955O9221Q7945N5128k0472r349J0440j0378q926
$$ plain form
7404 350358 448410 453371 436669 371361 372290 424869 448733 539998 494574 502882 554621 549186 665671
7391 665671 641144 611604 629591 636124 672222 747733 831738 882937 935779 942370 927091 1000100
7379 1000100 1087301 1119435 1174528 1171677 1179285 1317644 1341549 1382711 1403270 1407861 1510371 1570061
7367 1570061 1694710 1722589 1737460 1829272 1797787 1789417 1812181 1904618 1950664 1958367 1958114 1895407
7355 1895407 1961909 1981825 2057038 1999306 1909605 1909386 1872349 1879786 1760470 1823441 1873800 1887009
7343 1887009 1906023 1901500 1867299 1865267 1835551 1843729 1766931 1746429 1832260 1825142 1838153 1784458
7331 1784458 1798958 1831603 1821551 1828988 1789726 1767143 1800584 1737188 1835655 1842940 1755287 1771259
7319 1771259 1790794 1729562 1807902 1803881 1799528 1820489 1788748 1762453 1759524 1724792 1634358 1651002
$$ packed form
7404C50358R8052M961j6702o5308R29N2579K3864R1265m5424Q308N1739n435J16485
7391F65671k4527k9540J7987O533L6098P5511Q4005N1199N2842O591j5279P3009
7379A000100Q7201L2134N5093k851P608J38359K3905M1162K0559M591J02510N9690
7367A570061J24649K7879J4871R1812l1485q370K2764R2437M6046P703k53o2707
7355A895407O6502J9916P5213n7732q9701k19l7037P437j19316O2971N0359J3209
7343A887009J9014m523l4201k032k9716Q178p6798k0502Q5831p118J3011n3695
7331A784458J4500L2645j0052P437l9262k2583L3441o3396R8467P285q7653J5972
7319A771259J9535o1232P8340m021m353K0961l1741k6295k929l4732r0434J6644
$$ plain form
7307 1651002 1648971 1586953 1548088 1505067 1457931 1340195 1389565 1343918 1245602 1209038 1211680 1117922
7295 1117922 1056050 1016538 963744 943705 888153 876662 854583 850243 853528 784645 709418 662145
7283 662145 649523 600268 666221 636275 579931 515140 493290 481135 477744 466601 435026 457400
7271 457400 413578 411141 398642 389951 355869 377068 407603 397473 331611 304105 318988 276913
7259 276913 245850 283557 254254 264431 270192 261455 240677 193866 212993 213597 163531 84291
7247 84291 161606 174683 132273 175993 139545 152860 173963 118036 24150 76497 76304 77753
7235 77753 113803 75927 54220 69736 57921 30651 -91386 -126552 -115097 -47269 3541 -21581
7223 -21581 -73541 -60953 -35173 -27919 37970 28467 13858 47478 25807 29087 -13511 41717
$$ packed form
7307A651002k031o2018l8865m3021m7136j17736M9370m5647r8316l6564K642r3758
7295A117922o1872l9512n2794k0039n5552j1491k2079m340L285o8883p5227m7273
7283F62145j2622m9255O5953k9946n6344o4791k1850j2155l391j1143l1575K2374
7271D57400m3822k437j2499q691l4082K1199L0535j0130o5862k7506J4883m2075
7259B76913l1063L7707k9303J0177N761q737k0778m6811J9127O04n0066p9240
7247H4291P7315J3077m2410M3720l6448J3315K1103n5927r3886N2347j93J449
7235G7753L6050l7876k1707J5516j1815k7270j22037l5166J1455O7828N0810k5122
7223b1581n1960J2588K5780P254O5889r503j4609L3620k1671L280m2598N5228
$$ plain form
7211 41717 31876 -204 -75255 -72161 -47661 -85079 -84850 -30433 -65960 -67375 -39800 -95660 -38655
7198 -38655 -13887 -27385 -31354 -68185 7264 -16637 -69641 -58985 -68940 -78830 -54938 -90537
7186 -90537 -136297 -121027 -113347 -107352 -88973 -113393 -173165 -136888 -101072 -72241 14596 -13868
7174 -13868 -13983 -85422 -178855 -165487 -138521 -51854 -54326 -121383 -153495 -111968 -54176 -22631
7162 -22631 -82162 -105088 -22650 56787 -11456 -118363 -166261 -93532 -112489 -118373 -61641 -50821
7150 -50821 -79821 -80165 -12060 -12028 -19817 -24258 51155 96643 -7563 -71738 -68743 -53880 -80473
7137 -80473 -45479 -70780 -31376 -45642 -19337 -35119 -77637 -39693 36701 -3744 -13287 -14394
7125 -14394 -765 -72177 -67066 -32591 -50471 -50522 -28321 15087 14237 6182 19127 37051 39115
$$ packed form
7211D1717r841l2080p5051L094K4500l7418K29N4417l5527j415K7575n5860N7005
7198c8655K4768j3498l969l6831P5449k3901n3004J0656r955r890K3892l5599
7186i0537m5760J5270P680N995J8379k4420n9772L6277L5816K8831Q6837k8464
7174a3868j15p1439r3433J3368K6966Q6667k472o7057l2112M1527N7792L1545
7162b2631n9531k2926Q2438P9437o8243j06907m7898P2729j8957n884N6732J0820
7150e0821k9000l44O8105L2p789m441P5413M5488j04206o4175K995J4863k6593
7137h0473L4994k5301L9404j4266K6305j5782m2518L7944P6394m0445r543j107
7125a4394J3629p1412N111L4475j7880n1K2201M3408q50q055J2945J7924K064
$$ plain form
7112 39115 90391 42980 60765 144430 174241 223721 419040 586462 560805 576134 683891
7101 683891 698182 749307 777257 753033 811592 812181 690396 531368 392386 335030 205280
7090 205280 94414 98712 74438 61740 63724 68359 -13573 -17143 6287 63261 106030 62982
7078 62982 -9267 44739 128080 157088 159491 185936 222023 270809 248090 260590 247791 258221
7066 258221 307536 209757 252297 185208 142595 157485 94142 101288 127999 158128 196246 216608
7054 216608 271238 375976 387884 338063 349327 325406 365931 383037 395848 421043 421717 449256
7042 449256 463430 437133 416979 381062 389142 296879 261116 195886 137473 127224 91541 57643
7030 57643 18006 57489 90162 54451 -29367 -39165 26021 -36626 -31923 -70966 -71274 -36819 -70535
$$ packed form
7112C9115N1276m7411J7785Q3665K9811M9480J95319J67422k5657J5329J07757
7101F83891J4291N1125K7950k4224N8559N89j21785j59028j38982n7356j29750
7090B05280j10866M298k4274j2698J984M635q1932l570K3430N6974M2769m3048
7078F2982p2249N4006Q3341K9008K403K6445L6087M8786k2719J2500j2799J0430
7066B58221M9315r7779M2540o7089m2613J4890o3343P146K6711L0129L8118K0362
7054B16608N4630J04738J1908m9821J1264k3921M0525J7106J2811K5195O74K7539
7042D49256J4174k6297k0154l5917Q080r2263l5763o5230n8413j0249l5683l3898
7030E7643l9637L9483L2673l5711q3818r798O5186o2647M703l9043l08L4455l3716
$$ plain form
7017 -70535 -67713 -59892 -14860 -50135 -60012 -106138 -102070 -9000 -30034 -93457 -65905 -31488 -29555
7004 -29555 42145 60830 138592 138826 142176 85946 39600 102975 118151 145648 131733 173014
6992 173014 195753 116386 74770 19503 -55021 -75049 -53654 -71297 -131314 -137558 -129225 -149043
6980 -149043 -118542 -83486 -36358 -2259 29311 -14816 -65603 -52257 -32615 6230 8389 -22675
6968 -22675 -49443 16908 -58646 -203055 -155510 -20065 -24027 39976 8104 -33851 -66015 -29574
6956 -29574 18140 1957 69148 38906 -58991 -11196 12020 -9412 7901 27235 31483 23090
6944 23090 81396 54956 -68586 -62549 -49391 -71190 -87668 -184898 -141299 -116586 -177781 -179826
6932 -179826 -142009 -194075 -213363 -125209 -154915 -173918 -145474 -101563 -135005 -148557 -117668 -100220
$$ packed form
7017g0535K822P821M5032l5275r877m6126M068R3070k1034o3423K7552L4417J933
7004b9555P1700J8685P7762K34L350n6230m6346O3375J5176K7497j3915M1281
6992A73014K2739p9367m1616n5267p4524k0028K1395j7643o0017o244Q333j9818
6980a49043L0501L5056M7128L4099L1570m4127n0787J3346J9642L8845K159l1064
6968b2675k6768O6351p5554j44409M7545J35445l962O4003l1872m1955l2164L6441
6956b9574M7714j6183O7191l0242r7897M7795K3216k1432J7313J9334M248q393
6944B3090N8306k6440j23542O037J3158k1799j6478r7230M3599K4713o1195k045
6932a79826L7817n2066j9288Q8154k9706j9003K8444M3911l3442j3552L0889J7448
$$ plain form
6920 -100220 -67099 -74215 -111467 -143959 -86834 -79052 -126581 -142046 -126228 -111629 -115494 -91024
6908 -91024 -134176 -55593 -73799 -139731 -122297 -125419 -74752 -108392 -126648 -98291 -97123 -125571
6896 -125571 -74307 -44655 -24496 -36495 -3789 -33279 -60671 -61718 -86800 -35923 -46153 -62134
6884 -62134 -65445 695 -27134 -37121 -13579 -12913 45614 -3836 -63778 -149582 -211769 -145934 -121662
6871 -121662 -77351 -104092 -191479 -164625 -112590 -126681 -200567 -178390 -132550 -100594 -94594 -153278
6859 -153278 -160927 -175732 -193252 -178289 -158821 -145170 -51034 -94047 -224994 -217014 -200491 -156411
6847 -156411 -154168 -131800 -41282 -59681 -61278 -136283 -113498 -111266 -151518 -143121 -149290 -190438 -166988
6834 -166988 -134882 -111984 -100736 -90869 -120106 -191024 -158607 -120731 -128321 -138258 -82419 -147425
$$ packed form
6920a00220L3121p116l7252l2492N7125P782m7529j5465J5818J4599l865K4470
6908i1024m3152P8583j8206o5932J7434l122N0667l3640j8256K8357J168k8448
6896a25571N1264K9652K0159j1999L2706k9490k7392j047k5082N0877j0230j5981
6884f2134l311O6140k7829r987K3542O66N8527m9450n9942q5804o2187O5835K4272
6871a21662M4311k6741q7387K6854N2035j4091p3886K2177M5840L1956O000n8684
6859a53278p649j4805j7520J4963J9468J3651R4136m3013j30947P980J6523M4080
6847a56411K243K2368R0518j8399j597p5005K2785K232m0252Q397o169m1148K3450
6834a66988L2106K2898J1248R867k9237p0918L2417L7876p590r937N5839o5006
$$ plain form
6822 -147425 -205535 -217909 -186958 -140675 -127102 -142536 -106725 -92375 -140647 -120796 -130775 -115228
6810 -115228 -108100 -134411 -92302 -107939 -52204 -77979 -85588 -119617 -122008 -89157 -154257 -208930
6798 -208930 -122075 -139899 -135619 -124865 -147661 -131767 -117945 -79187 -53567 -63656 -66080 -62844
6786 -62844 -84144 -100261 -122207 -123255 -98323 -71806 -161612 -187116 -108550 -84593 -92060 -31029
6774 -31029 -57468 -94165 -76647 -75146 15733 19876 5045 53721 146226 132993 94980 99109
6762 99109 127846 108391 75834 111461 80624 94814 74053 3940 -51898 -31235 1281 19027
6750 19027 -56279 -76811 -114464 -64310 382 -56797 -35174 -86614 -139384 -83456 -111376 -55404
6738 -55404 -50993 -82848 -36289 -73354 -132596 -111003 -88596 -143627 -150691 -81840 -99352 -35097
$$ packed form
6822a47425n8110j2374L0951M6283J3573j5434L5811J4350m8272J9851r979J5547
6810a15228P128k6311M2109j5637N5735k5775p609l4029k391L2851o5100n4673
6798b08930Q6855j7824M280J0754k2796J5894J3822L8758K5620j0089k424L236
6786f2844k1300j6117k1946j048K4932K6517q9806k5504P8566K3957p467O1031
6774c1029k6439l6697J7518J501R0879M143j4831M8676R2505j3233l8013M129
6762I9109K8737j9455l2557L5627l0837J4190k0761p0113n5838K0663L2516J7746
6750A9027p5306k0532l7653N0154O4692n7179K1623n1440n2770N5928k7920N5972
6738e5404M411l1855M6559l7065n9242K1593K2407n5031p064O8851j7512O4255
$$ plain form
6726 -35097 15696 17532 177533 195094 191321 202283 154081 143289 158502 188251 159487 103760
6714 103760 43166 -20359 4577 22996 68128 62224 13800 35996 23214 11550 3098 16780
6702 16780 123838 93753 32620 47801 87449 220100 168762 80482 127893 97121 102909 131550
6690 131550 1816 30748 -6626 -23212 56979 28354 42057 14284 6651 9751 -9755 66594
6678 66594 49410 67274 77992 80037 31970 82356 148732 110796 90122 139571 176677 88365
6666 88365 88348 52590 85480 64926 109172 115753 105852 87936 15082 11893 4574 30381 24539
6653 24539 -19864 11786 101325 95658 19557 12479 -14264 15889 -31419 -55025 -2995 17171
6641 17171 125168 218135 216717 161006 103241 170470 245450 254839 328549 262641 192677 207960
$$ packed form
6726c5097N0793J836J60001J7561l773J0962m8202j0792J5213K9749k8764n5727
6714A03760o0594o3525K4936J8419M5132n904m8424K2196j2782j1664q452J3682
6702A6780J07058l0085o1133J5181L9648J32651n1338q8280M7411l0772N788K8641
6690A31550j29734K8932l7374j6586Q0191k8625J3703k7773p633L100j9506P6349
6678F6594j7184J7864J0718K045m8067N0386O6376l7936k0674M9449L7106q8312
6666H8365j7l5758L2890k0554M4246O581r901j7916p2854l189p319K5807n842
6653B4539m4403L1650Q9539n667p6101p078k6743L0153m7308k3606N2030K0166
6641A7171J07997R2967j418n5711n7765O7229P4980R389P3710o5908o9964J5283
$$ plain form
6629 207960 254144 280513 266200 285480 275974 287388 240473 210979 169108 160721 156253 223534
6617 223534 234310 215062 202914 223700 312783 322109 316384 301396 353091 298636 260020 267534
6605 267534 249806 268419 334283 300784 347907 386739 330234 328174 329293 315299 302762 277954
6593 277954 313000 324453 381107 311346 265579 287715 290570 344004 333698 303006 304828 323580
6581 323580 254614 215348 256999 247196 250068 332344 345903 350533 300093 264620 202704 225411
6569 225411 258882 217341 170524 217582 194082 197189 189396 219041 143067 144437 224200 149524
6557 149524 172280 218481 282751 250105 280706 257263 210389 231164 190581 105311 132915 102368
6545 102368 85835 120265 143824 159784 197748 249310 277872 236255 199062 203583 202384 173374
$$ packed form
6629B07960M6184K6369j4313J9280r506J1414m6915k9494m1871q387m468O7281
6617B23534J0776j9248j2148K0786Q9083R326n725j4988N1695n4455l8616P514
6605B67534j7728J8613O5864l3499M7123L8832n6505k060J119j3994j2537k4808
6593B77954L5046J1453N6654o9761m5767K2136K855N3434j0306l0692J822J8752
6581C23580o8966l9266M1651r803K872Q2276J3559M630n0440l5473o1916K2707
6569B25411L3471m1541m6817M7058k3500L107p793K9645p5974J370P9763p4676
6557A49524K2756M6201O4270l2646L0601k3443m6874K0775m0583q5270K7604l0547
6545A02368j6533L4430K3559J5960L7964N1562K8562m1617l7193M521j199k9010
$$ plain form
6533 173374 181178 221236 271254 293281 225405 262965 350370 354000 376799 400688 383442 376948
6521 376948 366330 486231 480026 483952 576812 599912 633355 633207 683108 731753 790590 781594
6509 781594 797325 798515 773487 765188 798119 809780 728535 711239 728414 678491 628396 638984
6497 638984 589007 520969 473046 459811 499176 504889 518117 497873 395374 407861 444439 424441
6485 424441 407097 472877 486361 456376 442309 478569 456249 445346 500892 539663 535469 494199
6473 494199 472513 516854 592329 567617 492292 434495 414470 433597 440129 432890 423541 449444
6461 449444 409426 385809 483137 463953 456780 502120 509549 531647 437477 379362 447444 427533
6449 427533 426697 449445 477951 531601 474358 420006 462671 451896 391474 467381 440997 486922
$$ packed form
6533A73374P804M0058N0018K2027o7876L7560Q7405L630K2799K3889j7246o494
6521C76948j0618J19901o205L926R2860K3100L3443j48M9901M8645N8837q996
6509G81594J5731J190k5028q299L2931J1661q1245j7296J7175m9923n0095J0588
6497F38984m9977o8038m7923j3235L9365N713J3228k0244j02499J2487L6578j9998
6485D24441j7344O5780J3484k9985j4067L6260k2320j0903N5546L8771m194m1270
6473D94199k1686M4341P5475k4712p5325n7797k0025J9127O532p239r349K5903
6461D49444m0018k3617R7328j9184p173M5340P429K2098r4170n8115O8082j9911
6449D27533q36K2748K8506N3650n7243n4352M2665j0775o0422P5907k6384M5925
$$ plain form
6437 486922 545924 495172 517491 507023 471248 454003 500519 500252 436374 475747 517360 504739
6425 504739 562377 503954 554253 578331 566939 560459 553686 563187 579905 638813 680136 624367
6413 624367 697719 651755 625725 722692 734286 703229 646584 653333 691838 658753 658772 766165
6401 766165 698524 733978 749272 787031 734290 859381 919816 841884 890532 881219 877525 840675
6389 840675 862548 923673 941111 943310 968032 982348 1020503 1063869 1018488 986505 1052310 1156796
6377 1156796 1156821 1161645 1237426 1262572 1211100 1275585 1320764 1325616 1280068 1301852 1392024 1435525
6365 1435525 1421648 1384362 1415502 1420905 1479065 1567915 1602190 1650809 1751026 1791780 1844123
6354 1844123 1823387 1823536 1837864 1839684 1956421 2062139 2044210 2032069 2113407 2205831 2288163 2380958
$$ packed form
6437D86922N9002n0752K2319j0468l5775j7245M6516k67o3878L9373M1613j2621
6425E04739N7638n8423N0299K4078j1392o480o773R501J6718N8908M1323n5769
6413F24367P3352m5964k6030R6967J1594l1057n6645O749L8505l3085J9J07393
6401G66165o7641L5454J5294L7759n2741J25091O0435p7932M8648r313l694l6850
6389H40675K1873O1125J7438K199K4722J4316L8155M3366m5381l1983O5805J04486
6377A156796K5M824P5781K5146n1472O4485M5179M852m5548K1784R0172M3501
6365A435525j3877l7286L1140N403N8160Q8850L4275M8619J00217M0754N2343
6354A844123k0736J49J4328J820J16737J05718j7929j2141Q1338R2424Q2332R2795
$$ plain form
6342 2380958 2347607 2401008 2504181 2629301 2670157 2717350 2809333 2906192 3018409 3209096 3338885
6331 3338885 3413628 3605327 3864091 4092075 4329492 4545769 4830765 5091437 5396308 5656583
6321 5656583 6001984 6406340 6895251 7362128 7992253 8687994 9531146 10498866 11766633
6312 11766633 13387226 15562082 18442632 22053499 24368631 24368641 24108722 24248393 25092847
6303 25092847 26436592 27834346 28872879 30027019 31397035 32448270 33128471 33851030
6295 33851030 34877864 35963994 36197439 36570686 37352568 38386427 38054331 36330827 34520711
6286 34520711 32874812 31769438 31006335 30534909 30239327 30098288 30308083 30779932 31577326
6277 31577326 32660137 34098212 35889159 38156462 40990400 44108771 47090768 49302871
$$ packed form
6342B380958l3351N3401J03173J25120M0856M7193R1983R6859J12217J90687J29789
6331C338885P4743J91699K58764K27984K37417K16277K84996K60672L04871K60275
6321E656583L45401M04356M88911M66877O30125O95741Q43152R67720J267767
6312A1766633J620593K174856K880550L610867K315132J0k59919J39671Q44454
6303B5092847J343745J397754J038533J154140J370016J051235O80201P22559
6295C3851030J026834J086130K33445L73247P81882J033859l32096j723504j810116
6286C4520711j645899j105374p63103m71426k95582j41039K09795M71849P97394
6277C1577326J082811J438075J790947K267303K833938L118371K981997K212103
$$ plain form
6269 49302871 50731564 51440479 51920065 52528468 53383573 54241984 54996705 55517185 55918024
6260 55918024 56237804 56516871 56839539 57276880 57703392 58002833 58235962 58098699 57591319
6251 57591319 57022621 56884016 57115382 57344713 57302685 57177649 57194803 57172018 57285709 57419196
6241 57419196 57325943 56928618 56117663 55101445 53677344 51681979 49206474 46625500 43873021
6232 43873021 41037723 38291692 35740885 33702733 32301428 31647399 31614037 32295834 33774025
6223 33774025 35816080 38075229 40386146 42520625 44550681 46412429 48072046 49412873
6215 49412873 50436704 51395826 52293971 53239387 54171026 55003880 55770882 56428657 56991565
6206 56991565 57429161 57839027 58396064 58976997 59554869 59887873 59828595 59088955 57581315
$$ packed form
6269D9302871J428693P08915M79586O08403Q55105Q58411P54721N20480M00839
6260E5918024L19780K79067L22668M37341M26512K99441K33129j37263n07380
6251E7591319n68698j38605K31366K29331m2028j25036J7154k2785J13691J33487
6241E7419196r3253l97325q10955j016218j424101j995365k475505k580974k752479
6232D3873021k835298k746031k550807k038152j401305o54029l3362O81797J478191
6223C3774025K042055K259149K310917K134479K030056J861748J659617J340827
6215D9412873J023831R59122Q98145R45416R31639Q32854P67002O57775N62908
6206E6991565M37596M09866N57037N80933N77872L33004n9278p39640j507640
$$ plain form
6197 57581315 55489620 53283692 51399063 49992738 49084672 48455914 48124471 47920476 47849403
6188 47849403 47787945 47570094 47271077 46891162 46300924 45526608 44523128 43294270 41568935
6179 41568935 39511475 37257080 34890280 32637876 30619103 28778078 27195296 25911894
6171 25911894 24943777 24163592 23593340 23043207 22396501 21653095 20777017 19929098 19153045
6162 19153045 18488053 17831684 17190340 16609555 16021080 15321797 14442459 13649757 12908776
6153 12908776 12162091 11457204 10738985 10152664 9567432 8852147 8150323 7463255 6802991
6144 6802991 6234549 5807992 5399933 4996206 4669438 4482459 4224023 4085360 3965624 3837781
6134 3837781 3753281 3628700 3588166 3554728 3519742 3497364 3425803 3319291 3343022 3287274 3223452
$$ packed form
6197E7581315k091695k205928j884629j406325r08066o28758l31443k03995p1073
6188D7849403o1458k17851k99017l79915n90238p74316j003480j228858j725335
6179D1568935k057460k254395k366800k252404k018773j841025j582782j283402
6171B5911894r68117p80185n70252n50133o46706p43406q76078q47919p76053
6162A9153045o64992o56369o41344n80785n88475o99283q79338p92702p40981
6153A2908776p46685p04887p18219n86321n85232p15285p01824o87068o60264
6144F802991n68442m26557m08059m03727l26768j86979k58436j38663j19736j27843
6134C837781q4500j24581m0534l3438l4986k2378p1561j06512K3731n5748o3822
$$ plain form
6123 3223452 3239001 3242240 3287713 3241257 3200221 3229391 3176640 3132698 3151865 3170632 3109731 3194395
6111 3194395 3142545 3025158 3066242 3089643 2993668 2937619 2869075 2779029 2719851 2676229 2520440
6100 2520440 2358109 2244881 2144908 1953936 1751323 1659958 1550722 1423824 1359873 1308153
6090 1308153 1273713 1232450 1184886 1129279 1099160 969605 961205 967954 946282 853844 816590 859274
6078 859274 849723 841340 741154 796640 741486 713803 684511 655533 711722 690309 690344 749919
6066 749919 796858 765683 745117 754871 749168 755713 705420 688330 688734 690942 684718 686918 698603
6053 698603 681029 683397 687666 667686 621484 583906 550918 518207 438887 459561 445448 521095
6041 521095 503742 421886 442748 453643 476565 475539 403104 415400 411663 426598 485223 419754
$$ packed form
6123C223452J5549L239M5473m6456m1036K9170n2751m3942J9167J8767o0901Q4664
6111C194395n1850j17387M1084K3401r5975n6049o8544r0046n9178m3622j55789
6100B520440j62331j13228r9973j90972k02613r1365j09236j26898o3951n1720
6090A308153l4440m1263m7564n5607l0119j29555q400O749k1672r2438l7254M2684
6078H59274r551q383j00186N5486n5154k7683k9292k8978N6189k1413L5N9575
6066G49919M6939l1175k0566R754n703O545n0293j7090M04K208o224K200J1685
6053F98603j7574K368M269j9980m6202l7578l2988l2711p9320K0674j4113P5647
6041E21095j7353q1856K0862J0895K2922j026p2435J2296l737J4935N8625o5469
$$ plain form
6029 419754 451064 451948 360925 424207 372659 431793 486266 486524 418556 398793 447095 454603 486866
6016 486866 463857 412474 386096 458863 540366 631065 671925 741409 806900 773349 807218 906224
6004 906224 1033619 1061812 1012961 1111724 1108044 1032638 942483 940833 864180 872563 856995 827189
5992 827189 745030 691245 658676 653894 608250 617233 623397 645840 654923 646387 642351 720069 841243
5979 841243 995887 1080740 1182953 1280369 1316928 1411078 1469578 1478924 1442537 1518723 1558376
5968 1558376 1526533 1498660 1393216 1308231 1264960 1217133 1066858 955773 876808 800484 753789
5957 753789 666705 661228 705104 723069 750093 707359 729088 841434 948710 1065555 1154717
5946 1154717 1254019 1373999 1533249 1700461 1731729 1822348 1879060 1888963 1937405 1978554 2025215
$$ packed form
6029D19754L1310Q84r1023O3282n1548N9134N4473K58o7968j9763M8302P508L2263
6016D86866k3009n1383k6378P2767Q1503R0699M0860O9484O5491l3551L3869R9006
6004I06224J27395K8193m8851R8763l680p5406r0155j650p6653Q383j5568k9806
5992H27189q2159n3785l2569m782m5644Q983O164K2443R083q536m036P7718J21174
5979H41243J54644Q4853J02213R7416L6559R4150N8500R346l6387P6186L9653
5968A558376l1843k7873j05444q4985m3271m7827j50275j11085p8965p6324m6695
5957G53789q7084n477M3876J7965K7024m2734K1729J12346J07276J16845Q9162
5946A154717R9302J19980J59250J67212L1268R0619N6712R903M8442M1149M6661
$$ plain form
5935 2025215 1996617 2023479 1873960 1744564 1574888 1429560 1357239 1180901 1023499 943715
5925 943715 844289 774293 768987 773303 788498 806912 743110 794508 764268 743013 730245 759874
5913 759874 908947 1009613 1035782 999990 997207 897947 932701 979946 1027535 1062065 1010320
5902 1010320 1062606 975903 917019 956051 958650 885821 832760 758865 782463 835023 798356 772181
5890 772181 856621 841373 859987 856362 853817 897340 930058 1000638 1016190 1043052 1105911 1195218
5878 1195218 1164647 1130988 1109953 1153368 1195198 1234771 1172825 1157214 1187561 1163575 1088097
5867 1088097 1086985 987106 911527 947844 866204 853437 767392 734887 708514 591877 513026
5856 513026 459577 411010 403994 438941 432155 475416 446657 342337 315557 327479 356465 355641
$$ packed form
5935B025215k8598K6862j49519j29396j69676j45328p2321j76338j57402p9784
5925I43715r9426o9996n306M316J5195J8414o3802N1398l0240k1255j2768K9629
5913G59874J49073J00666K6169l5792k783r9260L4754M7245M7589L4530n1745
5902A010320N2286q6703n8884L9032K599p2829n3061p3895K3598N2560l6667k6175
5890G72181Q4440j5248J8614l625k545M3523L2718P0580J5552K6862O2859Q9307
5878A195218l0571l3659k1035M3415M1830L9573o1946j5611L0347k3986p5478
5867A088097j112r9879p5579L6317q1640j2767q6045l2505k6373j16637p8851
5856E13026n3449m8567p016L4947o786M3261k8759j04320k6780J1922K8986q24
$$ plain form
5844 355641 355693 290030 280630 262256 294721 353707 327780 346457 302161 299648 292937 271418 275742
5831 275742 241325 263916 309965 329890 254906 255082 294254 306216 343293 271487 223913 260367
5819 260367 304546 219737 209567 310814 327872 292443 285508 346538 349283 336144 395431 424741
5807 424741 411393 422457 432542 423502 405571 456960 471702 408176 358817 358246 317694 328153
5795 328153 310607 321486 379491 402059 458813 375717 298623 385994 405890 424760 466084 457862
5783 457862 441310 397482 488297 540779 542286 585931 670343 571144 590334 536000 504130 489388
5771 489388 492974 485540 469250 536757 573557 548258 516331 492992 445311 464298 531150 518537
5759 518537 471705 510906 523240 492427 489111 484739 526073 556533 585924 624058 528190 521114
$$ packed form
5844C55641N2o5663r400j8374L2465N8986k5927J8677m4296k513o711k1519M324
5831B75742l4417K2591M6049J9925p4984J76L9172J1962L7077p1806m7574L6454
5819B60367M4179q4809j0170J01247J7058l5429o935O1030K745j3139N9287K9310
5807D24741j3348J1064J0085r040j7931N1389J4742o3526m9359n71m0552J0459
5795C28153j7546J0879N8005K2568N6754q3096p7094Q7371J9896J8870M1324q222
5783D57862j6552m3828R0815N2482J507M3645Q4412r9199J9190n4334l1870j4742
5771D89388L586p434j6290O7507L6800k5299l1927k3339m7681J8987O6852j2613
5759E18537m6832L9201J2334l0813l316m372M1334L0460K9391L8134r5868p076
$$ plain form
5747 521114 465547 464352 434785 467339 449891 429399 430531 468677 510075 536739 449288 429497
5735 429497 508796 488775 501407 472150 512640 542806 597533 594618 567291 563327 533950 543359
5723 543359 499365 485847 500877 540788 597271 493139 466198 525754 577014 449703 400714
5712 400714 525020 566575 546532 495753 520807 540931 583636 624488 680959 707672 759931
5701 759931 807957 772979 759464 694610 749969 819950 867222 974975 1005641 963295 948494
5690 948494 986168 933068 927568 997202 1064817 1052379 1050088 1059654 1126091 1198847 1208132 1220879
5678 1220879 1291499 1316188 1336709 1381940 1403117 1446276 1541611 1601758 1557048 1576998 1615944
5667 1615944 1627670 1720227 1764702 1803797 1828491 1930856 2011260 2060190 2094225 2093434 2118448 2119697
$$ packed form
5747E21114n5567j195k9567L2554j7448k0492J132L8146M1398K6664q7451j9791
5735D29497P9299k0021J2632k9257M0490L0166N4727k915k7327l964k9377R409
5723E43359m3994j3518J5030L9911N6483j04132k6941N9556N1260j27311m8989
5712D00714J24306M1555k0043n0779K5054K0124M2705M0852N6471K6713N2259
5701G59931M8026l4978j3515o4854N5359O9981M7272J07753L0666m2346j4801
5690I48494L7674n3100n500O9634O7615j2438k291R566O6437P2756R285J2747
5678A220879P0620K4689K0521M5231K1177M3159R5335O0147m4710J9950L8946
5667A615944J1726R2557M4475L9095K4694J02365Q0404M8930L4035p91K5014J249
$$ plain form
5655 2119697 2123552 2123574 2200381 2250923 2251492 2292356 2430556 2535073 2553389 2543297 2646654 2787348
5643 2787348 2885887 2985905 3125760 3312174 3468910 3602190 3711723 3842887 4022412 4158830
5633 4158830 4228717 4370944 4599383 4799636 4889964 5060616 5295463 5372306 5584463 5802901
5623 5802901 5975700 6091201 6267644 6465982 6601807 6749109 6903982 7156700 7338871 7585190
5613 7585190 7966616 8346277 8766558 9162080 9758326 10407613 11161217 11980391 12696349 13343585
5603 13343585 14129049 15008407 16024167 17152185 18363881 19684234 21109078 22569843
5595 22569843 24106918 25875687 27699713 29624174 31740855 34190792 36878640 39814519
5587 39814519 43219864 47300256 51995926 57389962 63731551 70962755 79118768 88338341
$$ packed form
5655B119697L855K2P6807N0542N69M0864J38200J04517J8316j0092J03357J40694
5643B787348R8539J00018J39855J86414J56736J33280J09533J31164J79525J36418
5633D158830O9887J42227K28439K00253R0328J70652K34847P6843K12157K18438
5623E802901J72799J15501J76443J98338J35825J47302J54873K52718J82171K46319
5613G585190L81426L79661M20281L95522N96246O49287P53604Q19174P15958O47236
5603A3343585P85464Q79358J015760J128018J211696J320353J424844J460765
5595B2569843J537075J768769J824026J924461K116681K449937K687848K935879
5587C9814519L405345M080392M695670N394036O341589P231204Q156013R219573
$$ plain form
5579 88338341 98600957 109804183 121375288 132684890 142978373 152098235 159933140
5572 159933140 166409115 171407063 174753165 176123774 174859771 171052251 165203436 158063798
5564 158063798 150107500 141576527 132825587 123747364 114371209 104868383 95366360 86054160
5556 86054160 77149511 68844073 61349430 54488609 48582095 43356313 38827694 34950511
5548 34950511 31475519 28556411 25974565 23869929 22257003 20908051 19762388 18763117
5540 18763117 17809973 16918229 16080946 15309747 14560684 13859596 13206826 12447953 11563148
5531 11563148 10782648 10101468 9467193 8901056 8466517 7996795 7611229 7222522 6910660
5522 6910660 6668504 6435421 6179086 5958286 5791393 5658270 5592142 5530225 5508251 5409450
$$ packed form
5579H8338341J0262616J1203226J1571105J1309602J0293483R119862P834905
5572A59933140O475975M997948L346102J370609j264003l807520n848815p139638
5564A58063798p956298q530973q750940r078223r376155r502826r502023r312200
5556H6054160q904649q305438p494643o860821n906514n225782m528619l877183
5548C4950511l474992k919108k581846k104636j612926j348952j145663r99271
5540A8763117r53144q91744q37283p71199p49063p01088o52770p58873q84805
5531A1563148p80500o81180o34275n66137m34539m69722l85566l88707l11862
5522F910660k42156k33083k56335k20800j66893j33123o6128o1917k1974r8801
$$ plain form
5512 5409450 5308645 5235526 5192884 5135249 4966847 4856619 4753968 4684937 4594929 4540325 4451072
5501 4451072 4409458 4433354 4426043 4377765 4298618 4295752 4246399 4282584 4234849 4185611 4115649 4057005
5489 4057005 3966180 3781075 3676279 3580794 3467468 3338922 3248746 3086489 2957927 2831935
5479 2831935 2717262 2584458 2431349 2332240 2212570 2156008 2044424 1987052 1988462 1930037 1843770
5468 1843770 1795777 1765039 1734010 1752417 1837646 1841509 1833045 1850230 1796424 1757253 1786721 1776037
5456 1776037 1792832 1759007 1695837 1683545 1649995 1634380 1580048 1478901 1457982 1437947 1427283
5445 1427283 1369665 1339771 1315143 1260251 1310213 1300271 1319209 1285264 1262788 1252038 1208674 1281287
5433 1281287 1259184 1220994 1282045 1219427 1181504 1191033 1199229 1231913 1209845 1205696 1188052 1158508
$$ packed form
5512E409450j00805p3119m2642n7635j68402j10228j02651o9031r0008n4604q9253
5501D451072m1614K3896p311m8278p9147k866m9353L6185m7735m9238o9962n8644
5489D057005r0825j85105j04796r5485j13326j28546r0176j62257j28562j25992
5479B831935j14673j32804j53109r9109j19670n6562j11584n7372J410n8425q6267
5468A843770m7993l0738l1029J8407Q5229L863q464J7185n3806l9171K9468j0684
5456A776037J6795l3825o3170j2292l3550j5615n4332j01147k0919k0035j0664
5445A427283n7618k9894k4628n4892M9962r942J8938l3945k2476j0750m3364P2613
5433A281287k2103l8190O1051o2618l7923R529Q196L2684k2068m149j7644k9544
$$ plain form
5421 1158508 1173018 1161417 1140522 1044068 1061781 1063903 1031658 1014432 930911 854108 898647 953305
5409 953305 920507 887472 958796 987428 922523 858882 917963 880722 884375 975834 981225 927455
5397 927455 942315 927092 927128 951012 913084 911609 951919 1073811 1018476 1043251 980194 962433
5385 962433 977958 927088 818352 895055 937120 895841 900416 933943 921987 822713 834573 873638
5373 873638 790906 685391 730134 723618 774766 759009 741909 749394 812342 814843 804704 835156
5361 835156 858622 866959 840003 793852 863184 946356 999498 1032207 1071414 1095188 1102341 1149773
5349 1149773 1194121 1251006 1324632 1421707 1632941 1700786 1621832 1654442 1636589 1642585 1673841
5338 1673841 1638720 1664771 1712512 1741677 1726262 1717493 1748811 1731811 1809123 1779463 1713555 1724690
$$ packed form
5421A158508J4510j1601k0895r6454J7713K122l2245j7226q3521p6803M4539N4658
5409I53305l2798l3035P1324K8632o4905o3641N9081l7241L653R1459N391n3770
5397I27455J4860j5223L6K3884l7928j475M0310J21892n5335K4775o3057j7761
5385I62433J5525n0870j08736P6703M2065m1279M575L3527j1956r9274J1860L9065
5373H73638q2732j05515M4743o516N1148j5757j7100P485O2948K501j0139L0452
5361H35156K3466Q337k6956m6151O9332Q3172N3142L2709L9207K3774P153M7432
5349A149773M4348N6885P3626R7075K11234O7845p8954L2610j7853N996L1256
5338A673841l5121K6051M7741K9165j5415q769L1318j7000P7312k9660o5908J1135
$$ plain form
5326 1724690 1682985 1605993 1463976 1339960 1188525 1110607 1094150 980060 1001810 943299 872149
5315 872149 826946 839480 825237 815091 745289 820543 768081 754330 790979 766228 785523 828796
5303 828796 914565 891386 908611 838392 776349 783615 809745 855818 882967 855311 846750 893270
5291 893270 930713 945287 983347 987616 960651 927019 900329 914945 948060 1015618 991390 991446
5279 991446 1041011 1072285 1068086 1105768 1113744 1167032 1217038 1294805 1385140 1420362 1396095 1516613
5267 1516613 1582015 1615124 1635969 1559217 1675678 1722445 1636089 1614529 1583505 1556834 1481347
5256 1481347 1449545 1513789 1408198 1352755 1300652 1291860 1203247 1159228 1152664 1052274 1022010
5245 1022010 1070704 1073407 1057733 1109568 1052072 981729 975222 950574 942757 859334 855164 929302
$$ packed form
5326A724690m1705p6992j42017j24016j51435p7918j6457j14090K1750n8511p1150
5315H72149m5203J2534j4243j0146o9802P5254n2462j3751L6649k4751J9295M3273
5303H28796Q5769k3179J7225p0219o2043P266K6130M6073K7149k7656q561M6520
5291H93270L7443J4574L8060M269k6965l3632k6690J4616L3115O7558k4228N6
5279I91446M9565L1274m199L7682P976N3288N0006P7767R0335L5222k4267J20518
5267A516613O5402L3109K0845p6752J16461M6767q6356k1560l1024k6671p5487
5256A481347l1802O4244j05591n5443n2103q792q8613m4019o564j00390l0264
5245A022010M8694K703j5674N1835n7496p0343o507k4648p817q3423m170P4138
$$ plain form
5233 929302 939901 924232 921971 899375 971063 923610 930053 936144 975633 939426 988536 1007857
5221 1007857 1040782 1076851 1037018 1013782 1031606 1092113 1151049 1120817 1110510 1081459 1049419
5210 1049419 1078720 1056831 1052091 1126478 1181064 1186279 1203790 1183824 1141819 1219899 1216249 1232187
5198 1232187 1260453 1275245 1314006 1311868 1358681 1397364 1361247 1355621 1380026 1403686 1463340 1468424
5186 1468424 1414522 1408966 1425711 1439122 1460350 1498570 1494296 1468843 1440024 1476659 1528766 1438445
5174 1438445 1495286 1532340 1550144 1543760 1567451 1575538 1653121 1653188 1651941 1719794 1813677 1842536 1869498
5161 1869498 1940911 1998904 2054578 2141859 2259291 2284488 2281417 2328577 2345406 2378783 2468161
5150 2468161 2559922 2618261 2642717 2714475 2748102 2757863 2805086 2854942 2936332 2984201 2914069 2913960
$$ packed form
5233I29302J0599j5669k261k2596P1688m7453O443O091L9489l6207M9110J9321
5221A007857L2925L6069l9833k3236J7824O0507N8936l0232j0307k9051l2040
5210A049419K9301k1889m740P4387N4586N215J7511j9966m2005P8080l650J5938
5198A232187K8266J4792L8761k138M6813L8683l6117n626K4405K3660N9654N084
5186A468424n3902n556J6745J3411K1228L8220m274k5453k8819L6635N2107r0321
5174A438445N6841L7054J7804o384K3691Q087P7583O7j247O7853R3883K8859K6962
5161A869498P1413N7993N5674Q7281J17432K5197l071M7160J6829L3377Q9378
5150B468161R1761N8339K4456P1758L3627R761M7223M9856Q1390M7869p0132j09
$$ plain form
5138 2913960 2955999 2921227 2887408 2825394 2796523 2765231 2756114 2784133 2827198 2794976 2807502 2863948
5126 2863948 2866426 2780623 2793967 2820375 2833708 2915376 3033383 3143416 3273581 3391253 3595349
5115 3595349 3740087 3844706 3956758 4159968 4331881 4473708 4674473 4850186 4996450 5228787
5105 5228787 5399029 5618375 5893959 6025059 6149191 6261822 6223444 6219270 6258729 6326416
5095 6326416 6358938 6442303 6585102 6711092 6897755 7098209 7387860 7714766 8073413 8463733
5085 8463733 9023085 9640592 10324377 11268008 12431664 14115679 16493927 19949375 24888727
5076 24888727 31084911 34362871 33286200 32256017 32714405 34320487 35765920 37098810
5068 37098810 38636396 38630170 37656410 37198591 37077601 35707129 34217254 33797938 31139406
$$ packed form
5138B913960M2039l4772l3819o2014k8871l1292r117K8019M3065l2222J2526N6446
5126B863948K478q5803J3344K6408J3333Q1668J18007J10033J30165J17672K04096
5115C595349J44738J04619J12052K03210J71913J41827K00765J75713J46264K32337
5105E228787J70242K19346K75584J31100J24132J12631l8378m174L9459O7687
5095F326416L2522Q3365J42799J25990J86663K00454K89651L26906L58647L90320
5085H463733N59352O17507O83785R43631J163656J684015K378248L455448M939352
5076B4888727O196184L277960j076671j030183M58388J606082J445433J332890
5068C7098810J537586o226r73760m57819j20990j370472j489875m19316k658532
$$ plain form
5059 31139406 26226977 21379769 17083247 13756445 11284387 9333852 7907265 6671178
5051 6671178 5711772 5105345 4696456 4460857 4224977 3937318 3691018 3529563 3369823 3187861
5041 3187861 3081789 2908271 2785038 2669057 2598437 2465341 2417416 2321508 2280914 2259348
5031 2259348 2147518 2104322 2045708 2014096 1971875 1917127 1889670 1820256 1857572 1819533 1848570
5020 1848570 1833135 1885339 1998551 1996987 1964527 1982162 1945926 1949244 2041157 2049538 2014638 2145235
5008 2145235 2138873 2111604 2148093 2154462 2211893 2222948 2279309 2369202 2452552 2405176 2401419 2547929
4996 2547929 2602838 2661478 2677423 2711207 2784263 2869261 2979753 3115694 3140442 3214186 3365605
4985 3365605 3468101 3718278 3931141 4208539 4596177 5206016 5843017 6071768 5940389 5928230
$$ packed form
5059C1139406m912429m847208m296522l326802k472058j950535j426587j236087
5051F671178r59406o06427m08889k35599k35880k87659k46300j61455j59740j81962
5041C187861j06072j73518j23233j15981p0620j33096m7925r5908m0594k1566
5031B259348j11830m3196n8614l1612m2221n4748k7457o9414L7316l8039K9037
5020A848570j5435N2204J13212j564l2460J7635l6236L318R1913Q381l4900J30597
5008B145235o362k7269L6489O369N7431J1055N6361Q9893Q3350m7376l757J46510
4996B547929N4909N8640J5945L3784P3056Q4998J10492J35941K4748P3744J51419
4985C365605J02496K50177K12863K77398L87638O09839O37001K28751j31379j2159
$$ plain form
4975 5928230 6040345 6293869 6483005 6616628 6827882 7000305 6980954 7080289 7097256 7002895
4965 7002895 6892192 6851952 6824288 6609420 6387995 6115966 5870173 5791689 5666613 5619494
4955 5619494 5648790 5592443 5616258 5564326 5519981 5539012 5577896 5645869 5643571 5618906 5703986 5836940
4943 5836940 6020540 6195724 6382562 6611121 6853199 7125855 7390853 7635002 7889437 8136930
4933 8136930 8503771 8920328 9229486 9639971 10017846 10378936 10752373 11205714 11553708 11941660
4923 11941660 12313988 12598780 12957872 13407049 13909868 14271891 14743190 15399644 16070128
4914 16070128 16839227 17650421 18595037 19612380 20894458 22452832 24081702 25905452 28015542
4905 28015542 30356869 33054283 36066197 39576641 43574698 48293673 53851991 60394199
$$ packed form
4975E928230J12115K53524J89136J33623K11254J72423j9351R9335J6967r4361
4965G002895j10703m0240k7664k14868k21425k72029k45793p8484j25076m7119
4955E619494K9296n6347K3815n1932m4345J9031L8884O7973k298k4665Q5080J32954
4943E836940J83600J75184J86838K28559K42078K72656K64998K44149K54435K47493
4933H136930L66841M16557L09158M10485L77875L61090L73437M53341L47994L87952
4923A1941660L72328K84792L59092M49177N02819L62023M71299O56454O70484
4914A6070128P69099Q11194R44616J017343J282078J558374J628870J823750K110090
4905B8015542K341327K697414L011914L510444L998057M718975N558318O542208
$$ plain form
4897 60394199 67954715 76787582 87132647 99100597 112892154 128587430 146087935
4890 146087935 165085251 184546155 202707703 218294214 231151078 241758545 249909957
4883 249909957 254981115 256403378 253957875 247652770 237540542 223718158 207087253 188476274
4875 188476274 169062965 149769495 131370233 114284593 99047322 85772865 74345359
4868 74345359 64832853 56907155 50462883 45080732 40642392 36968765 34050938 31662068
4860 31662068 29677877 28071377 26757777 25682704 24843918 24086491 23454084 22975773 22628754
4851 22628754 22321698 22005040 21714171 21538411 21415442 21253168 21050977 20925914 20911231 20739236
4841 20739236 20571468 20436650 20299115 20182211 20047390 19877976 19826412 19805600 19844144 19863864
$$ packed form
4897F0394199P560516Q832867J0345065J1967950J3791557J5695276J7500505
4890A46087935J8997316J9460904J8161548J5586511J2856864J0607467Q151412
4883B49909957N071158J422263k445503o305105j0112228j3822384j6630905j8610979
4875A88476274j9413309j9293470j8399262j7085640j5237271j3274457j1427506
4868G4345359r512506p925698o444272n382151m438340l673627k917827k388870
4860C1662068j984191j606500j313600j075073q38786p57427o32407m78311l47019
4851B2628754l07056l16658k90869j75760j22969j62274k02191j25063j4683j71995
4841B0739236j67768j34818j37535j16904j34821j69414n1564k0812L8544J9720
$$ plain form
4831 19863864 19943667 20132850 20258567 20444673 20729391 20954401 21243795 21545036 21829459 22120444
4821 22120444 22434603 22777037 23150439 23474106 23879838 24343769 24925351 25680378 26496115
4812 26496115 27531533 28734602 30159266 31822096 33664276 35673414 37606680 39333698
4804 39333698 40696878 41629698 42261571 42762202 43178479 43451745 43480802 43281004 42833551
4795 42833551 42194210 41319797 40269417 39083694 37837893 36690486 35853682 35344366 35097666
4786 35097666 35177682 35537926 35899939 36362519 36860340 37407222 37714857 37929924 38008026 38013671
4776 38013671 37840881 37442432 36756967 35857635 34687017 33325499 31843415 30289860 28756434
4767 28756434 27224577 25899353 24753874 23806868 23132795 22663765 22403258 22407846 22538327
$$ packed form
4831A9863864P9803J89183J25717J86106K84718K25010K89394L01241K84423K90985
4821B2120444L14159L42434L73402L23667M05732M63931N81582P55027Q15737
4812B6496115J035418J203069J424664J662830J842180K009138J933266J727018
4804C9333698J363180R32820O31873N00631M16277K73266K9057j99798m47453
4795D2833551o39341q74413j050380j185723j245801j147407q36804n09316k46700
4786C5097666Q0016L60244L62013M62580M97821N46882L07635K15067P8102N645
4776C8013671j72790l98449o85465q99332j170618j361518j482084j553555j533426
4767B8756434j531857j325224j145479r47006o74073m69030k60507M588J30481
$$ plain form
4758 22538327 22778390 23247623 23749316 24334558 25028713 25851121 26674398 27421973 28175371
4749 28175371 28973954 29747718 30489146 31208657 31793858 32423256 33036744 33659281 34245523
4740 34245523 34866722 35428616 35955565 36444645 36805405 37104852 37328430 37555068 37717932
4731 37717932 37832203 37873685 37769379 37647296 37308127 36931638 36537049 36180312 35871852 35611802
4721 35611802 35368324 35271389 35114023 34882680 34830053 34736573 34579003 34403922 34249782 34069087
4711 34069087 33797175 33502793 33155626 32940166 32583521 32151170 31563271 30974201 30336886
4702 30336886 29641863 29027104 28463185 27988628 27592758 27217190 26893407 26661766 26532462
4693 26532462 26426404 26394717 26335873 26462257 26518356 26725264 27135671 27728700 28493399 29607802
$$ packed form
4758B2538327K40063M69233N01693N85242O94155Q22408Q23277P47575P53398
4749B8175371P98583P73764P41428P19511N85201O29398O13488O22537N86242
4740C4245523O21199N61894N26949M89080L60760K99447K23578K26638J62864
4731C7717932J14271M1482j04306j22083l39169l76489l94589l56737l08460k60050
4721C5611802k43478r6935j57366k31343n2627r3480j57570j75081j54140j80695
4711C4069087k71912k94382l47167k15460l56645m32351n87899n89070o37315
4702C0336886o95023o14759n63919m74557l95870l75568l23783k31641j29304
4693B6532462j06058l1687n8844J26384N6099K06908M10407N93029P64699J114403
$$ plain form
4683 29607802 30813778 32243475 33830475 35611235 37571640 39865600 42588158 45890457
4675 45890457 49798245 54403156 59709862 65980494 73607268 83683807 97124136 116061879
4667 116061879 143776292 181059170 213522715 223281506 226032459 238046766 255486928
4660 255486928 277536215 302931251 326817686 358200963 385002099 378695704 361492863
4653 361492863 352597618 338681541 318060501 303863705 287139719 266568358 252843458
4646 252843458 247905513 237720007 225071793 220306412 201564839 175964598 153400244
4639 153400244 135054368 122953954 115409632 111962816 111873280 114716160 121329639 132262157
4631 132262157 147764097 168429847 192945837 216932745 236335814 251548780 264738402
$$ packed form
4683B9607802J205976J429697J587000J780760J960405K293960K722558L302299
4675D5890457L907788M604911N306706O270632P626774J0076539J3440329J8937743
4667A16061879K7714413L7282878L2463545R758791K750953J2014307J7440162
4660B55486928K2049287K5395036K3886435L1383277K6801136o306395j7202841
4653C61492863q895245j3916077k0621040j4196796j6723986k0571361j3724900
4646B52843458m937945j0185506j2648214m765381j8741573k5600241k2564354
4639A53400244j8345876j2100414p544322l446816q9536K842880O613479J0932518
4631A32262157J5501940K0665750K4515990K3986908J9403069J5212966J3189622
$$ plain form
4624 264738402 274886676 279982944 280235715 276354816 266899316 251665795 234275274 219534787
4616 219534787 209593586 203143228 197402321 192163514 188537850 186202191 183652500 179511972
4608 179511972 173862127 166550581 156379232 143027189 127892996 112907314 99244735
4601 99244735 87555313 77774742 69638346 62797089 57007662 52060352 47710556 44009377
4593 44009377 40824187 38057251 35659107 33641355 31904771 30487163 29228492 28158248
4585 28158248 27055333 26135636 25248156 24410372 23593690 22917291 22200897 21458123 20740000
4576 20740000 20006719 19277380 18684019 18085521 17469857 16875952 16487340 16022514 15637290
4567 15637290 15206766 14828813 14470638 14139996 13759187 13500148 13342188 13086361 12895550
$$ packed form
4624B64738402J0148274N096268K52771l880899r455500j5233521j7390521j4740487
4616B19534787r941201o450358n740907n238807l625664k335659k549691m140528
4608A79511972n649845p311546j0171349j3352043j5134193j4985682j3662579
4601I9244735j1689422r780571q136396o841257n789427m947310m349796l701179
4593D4009377l185190k766936k398144k017752j736584j417608j258671j070244
4585B8158248j102915r19697q87480q37784q16682o76399p16394p42774p18123
4576B0740000p33281p29339n93361n98498o15664n93905l88612m64826l85224
4567A5637290m30524l77953l58175l30642l80809k59039j57960k55827j90811
$$ plain form
4558 12895550 12804352 12786858 12763341 12767271 12844519 12965557 13104699 13287001 13434793 13577454
4548 13577454 13700441 13771090 13677877 13600625 13443728 13187299 12912145 12464761 12000660 11566618
4538 11566618 11153843 10669927 10276903 9955440 9696769 9578867 9451342 9286141 9176138
4529 9176138 9120207 9075748 9069486 9004646 9059835 9224061 9407138 9643406 9784172 10043993 10328836
4518 10328836 10636653 10917615 11249928 11501810 11775317 12088623 12221972 12327570 12315508 12297047
4508 12297047 12177008 11966937 11671256 11439764 11156190 10859683 10545105 10202084 9948063
4499 9948063 9647141 9357043 9154803 8992713 8898716 8835376 8735385 8841063 8883602 8994816
4489 8994816 9169394 9449756 9794291 10240484 10773260 11492768 12324721 13391924 14615869
$$ packed form
4558A2895550r1198j7494k3517L930P7248J21038J39142J82302J47792J42661
4548A3577454J22987P0649r3213p7252j56897k56429k75154m47384m64101m34042
4538A1566618m12775m83916l93024l21463k58671j17902j27525j65201j10003
4529I176138n5931m4459o262o4840N5189J64226J83077K36268J40766K59821K84843
4518A0328836L07817K80962L32313K51882K73507L13306J33349J05598j2062j8461
4508A2297047j20039k10071k95681k31492k83574k96507l14578l43021k54021
4499I948063l00922k90098k02240j62090r3997o3340r9991J05678M2539J11214
4489H994816J74578K80362L44535M46193N32776P19508Q31953J067203J223945
$$ plain form
4480 14615869 15941979 17412786 18970979 20867097 23256110 26351251 30367546 34818661
4472 34818661 38298328 40115248 41227384 42401715 43693796 44412521 44120105 43216026 42066866
4463 42066866 40167809 37221699 33201865 28762681 24462610 20710823 17638686 15102042
4455 15102042 13127388 11478379 10213039 9257891 8533257 7911189 7437299 7092036 6808720
4446 6808720 6492931 6365046 6176510 6022713 5875884 5755764 5714517 5699977 5607215 5511938
4436 5511938 5530323 5490987 5406551 5396188 5476003 5503747 5634625 5785858 5902768 6078764 6175282
4425 6175282 6260587 6326704 6360688 6447992 6591052 6583832 6632214 6572395 6530465 6512182 6420227
4414 6420227 6289731 6200724 6060438 5968885 5873021 5749293 5540160 5439323 5422585 5378833
$$ packed form
4480A4615869J326110J470807J558193J896118K389013L095141M016295M451115
4472C4818661L479667J816920J112136J174331J292081P18725k92416r04079j149160
4463D2066866j899057k946110m019834m439184m300071l751787l072137k536644
4455A5102042j974654j649009j265340r55148p24634o22068m73890l45263k83316
4446F808720l15789j27885j88536j53797j46829j20120m1247j4540r2762r5277
4436E511938J8385l9336q4436j0363P9815K7744J30878J51233J16910J75996R6518
4425F175282Q5305O6117L3984Q7304J43060p220M8382n9819m1930j8283r1955
4414F420227j30496q9007j40286r1553r5864j23728k09133j00837j6738m3752
$$ plain form
4404 5378833 5393073 5361096 5325398 5293968 5153774 5043127 4902880 4737655 4523074 4412846
4394 4412846 4246850 4070878 3963242 3883991 3888020 3963530 4140763 4274451 4368963 4449041 4480005
4383 4480005 4500955 4530309 4516991 4510305 4494697 4464325 4466499 4427253 4366534 4299847 4202651 4052580
4371 4052580 3910497 3878876 3807416 3773925 3735419 3732828 3758725 3697933 3775582 3793461 3838822
4360 3838822 3900477 3818883 3803481 3776995 3712293 3561912 3439557 3342106 3256804 3187344 3113284
4349 3113284 3181869 3347119 3434288 3497263 3562615 3630025 3790907 3937505 4056242 4132363 4088868
4338 4088868 4057927 4100554 4004226 3999361 3899016 3806295 3705841 3569700 3476629 3374999 3296197
4327 3296197 3235542 3235427 3225966 3191187 3216288 3279114 3267436 3230481 3263083 3290800 3301268 3346660
$$ packed form
4404E378833J4240l1977l5698l1430j40194j10647j40247j65225k14581j10228
4394D412846j65996j75972j07636p9251M029P5510J77233J33688R4512Q0078L0964
4383D480005K0950K9354j3318o686j5608l0372K174l9246o0719o6687r7196j50071
4371D052580j42083l1621p1460l3491l8506k591K5897o0792P7649J7879M5361
4360C838822O1655q1594j5402k6486o4702j50381j22355r7451q5302o9460p4060
4349C113284O8585J65250Q7169O2975O5352O7410J60882J46598J18737P6121m3495
4338D088868l0941M2627r6328m865j00345r2721j00454j36141r3071j01630p8802
4327C296197o0655j15r461l4779K5101O2826j1678l6955L2602K7717J0468M5392
$$ plain form
4315 3346660 3236405 3195698 3181891 3280874 3357851 3444644 3528352 3726289 3871906 4022183 4163110
4304 4163110 4336080 4390100 4407655 4445225 4366840 4144845 4005312 3763388 3492331 3177961
4294 3177961 2932092 2705317 2485887 2356505 2276035 2112475 2014638 1909754 1819745 1807690
4284 1807690 1776583 1730307 1723929 1774117 1742000 1609849 1527429 1590706 1600574 1513069 1474680 1413700
4272 1413700 1486713 1494425 1469040 1513388 1468007 1500519 1458177 1443290 1413755 1415412 1377840 1309850
4260 1309850 1353780 1321228 1376555 1389959 1337227 1337951 1352014 1343805 1302159 1320601 1319636 1256889
4248 1256889 1266175 1375245 1357721 1381018 1369201 1315263 1256945 1223898 1248482 1278878 1250236
4237 1250236 1287249 1235829 1229322 1280758 1202986 1144606 1136572 1160993 1207458 1144324 1099959 1054973
$$ packed form
4315C346660j10255m0707j3807R8983P6977Q6793Q3708J97937J45617J50277J40927
4304D163110J72970N4020J7555L7570p8385k21995j39533k41924k71057l14370
4294C177961k45869k26775k19430j29382q0470j63560r7837j04884r0009j2055
4284A807690l1107m6276o378N0188l2117j32151q2420O3277R868q7505l8389o0980
4272A413700P3013P712k5385M4348m5381L2512m2342j4887k9535J657l7572o7990
4260A309850M3930l2552N5327J3404n2732P24J4063q209m1646J8442r65o2747
4248A256889R286J09070j7524K3297j1817n3938n8318l3047K4584L0396k8642
4237A250236L7013n1420o507N1436p7772n8380q034K4421M6465o3134m4365m4986
$$ plain form
4225 1054973 1085275 1143738 1135606 1120354 1131736 1098021 1167103 1148676 1169504 1222091 1202647 1108383
4213 1108383 1058727 1097370 1093193 1129513 1142460 1159686 1188406 1185659 1189705 1171320 1183075 1242270
4201 1242270 1220969 1231504 1275510 1241806 1292003 1344201 1401330 1485752 1479544 1437167 1498246 1514437
4189 1514437 1470785 1424516 1418373 1376414 1389557 1394675 1321767 1334504 1313649 1251070 1228962 1191746
4177 1191746 1174329 1235402 1249495 1247541 1235017 1227530 1235287 1244971 1307831 1300211 1287735 1418844
4165 1418844 1457635 1427945 1462859 1448972 1504269 1533039 1566509 1616749 1639792 1778247 1847547
4154 1847547 1944476 2021133 2125071 2310782 2375843 2468886 2539493 2581360 2654512 2673945 2637581
4143 2637581 2611962 2582772 2441588 2309528 2243748 2148811 1994680 1852060 1800270 1738363 1694043
$$ packed form
4225A054973L0302N8463q132j5252J1382l3715O9082j8427K0828N2587j9444r4264
4213A108383m9656L8643m177L6320J2947J7226K8720k747M046j8385J1755N9195
4201A242270k1301J0535M4006l3704N0197N2198N7129Q4422o208m2377O1079J6191
4189A514437m3652m6269o143m1959J3143N118p2908J2737k0855o2579k2108l7216
4177A191746j7417O1073J4093j954j2524p487P757R684O2860p620j2476J31109
4165A418844L8791k9690L4914j3887N5297K8770L3470N0240K3043J38455O9300
4154A847547R6929P6657J03938J85711O5061R3043P0607M1867P3152J9433l6364
4143B637581k5619k9190j41184j32060o5780r4937j54131j42620n1790o1907m4320
$$ plain form
4132 1694043 1738643 1895145 1915698 1972782 2132867 2295123 2423560 2607989 2872546 3133764
4122 3133764 3351324 3493372 3620412 3852723 4049047 4102855 4180683 4245304 4219566 4140255
4112 4140255 4077837 3935415 3808560 3637977 3430948 3163092 2984093 2792755 2646172 2533801
4102 2533801 2566675 2544308 2532407 2544612 2649762 2744027 2862295 2937081 2884995 2908133 2969438
4091 2969438 3141409 3252021 3325411 3438373 3436777 3437431 3466081 3450621 3409580 3352651 3331175
4080 3331175 3283212 3232012 3186378 3112347 3014538 2940067 2902858 2801666 2707117 2686230 2626341
4069 2626341 2585036 2624375 2590932 2619745 2707626 2766252 2852545 2934840 2960215 2979620 2971095 2966064
4057 2966064 2911513 2932828 2825066 2648194 2538781 2404298 2354707 2213686 2138590 2008824
$$ packed form
4132A694043M4600J56502K0553N7084J60085J62256J28437J84429K64557K61218
4122C133764K17560J42048J27040K32311J96324N3808P7828O4621k5738p9311
4112D140255o2418j42422j26855j70583k07029k67856j78999j91338j46583j12371
4102B533801L2874k2367j1901J2205J05150R4265J18268P4786n2086K3138O1305
4091B969438J71971J10612P3390J12962j596O54K8650j5460m1041n6929k1476
4080C331175m7963n1200m5634p4031r7809p4471l7209j01192r4549k0887n9889
4069B626341m1305L9339l3443K8813Q7881N8626Q6293Q2295K5375J9405q525n031
4057B966064n4551K1315j07762j76872j09413j34483m9591j41021p5096j29766
$$ plain form
4047 2008824 1875844 1812748 1636770 1475606 1378514 1399014 1421145 1352217 1295048 1265550 1196238
4036 1196238 1148672 1230693 1282640 1359363 1418633 1449071 1538826 1622808 1634754 1644471 1685433 1739846
4024 1739846 1722024 1722026 1779072 1751786 1755295 1776979 1756504 1698102 1608555 1555941 1424334 1310596
4012 1310596 1232769 1185826 1153233 1104989 1006852 956907 932434 915243 953214 904926 923645
4001 923645 867734 823723 820027 761690 774440 785465 799332 794060 799897 765988 690369 645396
3989 645396 663131 699173 727656 721496 742256 690828 662444 671265 660050 671802 685476 649283
3977 649283 705693 701605 605455 589489 608348 658365 627076 613208 608036 617399 736239 771821
3965 771821 730160 717853 708909 590952 624396 638810 562038 614224 639158 574010 540508 611843
$$ packed form
4047B008824j32980o3096j75978j61164r7092K0500K2131o8928n7169k9498o9312
4036A196238m7566Q2021N1947P6723N9270L0438Q9755Q3982J1946R717M0962N4413
4024A739846j7822KN7046k7286L509K1684k0475n8402q9547n2614j31607j13738
4012A310596p7827m6943l2593m8244r8137m9945k4473j7191L7971m8288J8719
4001I23645n5911m4011l696n8337J2750J1025J3867n272N837l3909p5619m4973
3989F45396J7735L6042K8483o160K0760n1428k8384Q821j1215J1752J3674l6193
3977F49283N6410m088r6150j5966J8859N0017l1289j3868n172R363J18840L5582
3965G71821m1661j2307q944j17957L3444J4414p6772N2186K4934o5148l3502P1335
$$ plain form
3953 611843 616803 634908 575616 585331 624636 617635 688285 660759 643634 636011 667365 636390
3941 636390 586214 656688 629684 652631 614100 600379 629215 642429 657103 632740 583013 542513
3929 542513 550991 574642 591060 536992 529127 588332 618246 622391 561962 511581 612618 577132
3917 577132 544110 568874 589470 595349 544560 543781 554174 561212 564481 611053 605299 539163 626538
3904 626538 570302 555576 636142 620780 612066 594430 621023 619527 603308 643380 655939 631075
3892 631075 617580 605707 571250 562535 571818 624700 669289 651339 591639 603745 619611 608433
3880 608433 588330 502594 490924 518731 660270 629541 550229 551199 567391 575141 477968 509686
3868 509686 558682 541532 559139 611075 626744 515252 510120 506907 535735 502040 531829 501443
$$ packed form
3953F11843M960J8105n9292R715L9305p001P0650k7526j7125p623L1354l0975
3941F36390n0176P0474k7004K2947l8531j3721K8836J3214J4674k4363m9727m0500
3929E42513Q478K3651J6418n4068p865N9205K9914M145o0429n0381J01037l5486
3917E77132l3022K4764K0596N879n0789p79J0393P038L269M6572n754o6136Q7375
3904F26538n6236j4726Q0566j5362q714j7636K6593j496j6219M0072J2559k4864
3892F31075j3495j1873l4457q715R283N2882M4589j7950n9700J2106J5866j1178
3880F08433k0103q5736j1670K7807J41539l0729p9312R70J6192P750r7173L1718
3868E09686M8996j7150J7607N1936J5669j11492n132l213K8828l3695K9789l0386
$$ plain form
3856 501443 502773 538058 528543 570929 546239 558376 608402 648490 622581 618600 645184 660702
3844 660702 685971 691029 649522 663508 671028 692812 657772 722397 792179 817760 779826 754385
3832 754385 757208 775130 795337 799109 855631 841014 879099 843482 855699 865368 944388 875039
3820 875039 759696 763868 779365 808388 869716 808028 827681 874775 860647 839113 809584 802420
3808 802420 706368 705216 701116 654539 667153 626875 660449 664911 634280 677804 719055 724872
3796 724872 662245 657777 617999 609116 590156 622556 646396 638347 671201 674700 633616 603926
3784 603926 646057 709216 672720 624162 566508 571202 601573 569160 507231 526236 506432 535916
3772 535916 526356 502360 536914 542176 583837 501798 461359 557524 609514 593954 604639 611821
$$ packed form
3856E01443J330L5285r515M2386k4690J2137N0026M0088k5909l981K6584J5518
3844F60702K5269N058m1507J3986P520K1784l5040O4625O9782K5581l7934k5441
3832G54385K823J7922K0207L772N6522j4617L8085l5617J2217R669P9020o9349
3820H75039j15343M172J5497K9023O1328o1688J9653M7094j4128k1534k9529p164
3808H02420r6052j152m100m6577J2614m0278L3574M462l0631M3524M1251N817
3796G24872o2627m468l9778q883j8960L2400K3840q049L2854L499m1084k9690
3784F03926M2131O3159l6496m8558n7654M694L0371l2413o1929J9005j9804K9484
3772E35916r560k3996L4554N262M1661q2039m0439R6165N1990j5560J0685P182
$$ plain form
3760 611821 618836 622273 612876 651658 705985 669266 582679 507885 498651 564912 615783 635345
3748 635345 559657 562757 519466 517438 495572 485143 501108 507706 511106 536753 637212 612207
3736 612207 600527 573024 580017 609941 603836 614007 550734 486210 497563 509903 545399 539188
3724 539188 530321 564359 537205 491168 502706 459547 472992 539022 555596 513910 450096 481180
3712 481180 515437 518111 487174 474145 489802 456207 496866 515973 490797 511559 531529 565239
3700 565239 594033 567730 545844 589960 525164 583363 643203 624324 603542 560444 620501 702752
3688 702752 648035 695862 757780 700661 726605 797612 792303 750886 782954 818831 820527 826479
3676 826479 716985 813350 883874 849237 873563 812188 741762 757566 791592 756427 734362
$$ packed form
3760F11821P015L437r397L8782N4327l6719q6587p4794r234O6261N0871J9562
3748F35345p5688L100m3291k028k1866j0429J5965O598L400K5647J00459k5005
3736F12207j1680k7503O993K9924o105J0171o3273o4524J1353J2340L5496o211
3724E39188q867L4038k7154m6037J1538m3159J3445O6030J6574m1686o3814L1084
3712D81180L4257K674l0937j3029J5657l3595M0659J9107k5176K0762J9970L3710
3700E65239K8794k6303k1886M4116o4796N8199N9840j8879k0782m3098O0057Q2251
3688G02752n4717M7827O1918n7119K5944P1007n309m1417L2068L5877J696N952
3676H26479j09494R6365P0524l4637K4326o1375p0426J5804L4026l5165k2065
$$ plain form
3665 734362 733659 786920 706125 743136 677119 597678 660848 685829 698979 763188 757090 745322
3653 745322 794719 767091 733935 757905 711423 703446 666190 632818 679783 699890 755947 755274
3641 755274 705510 680762 809216 733792 704787 640359 570224 577238 591008 600047 589266 581354
3629 581354 563575 608487 483363 478398 443316 492420 539769 509369 379788 407101 399156 442529
3617 442529 464514 415736 348373 332361 357569 320060 363572 411903 398057 401391 427022 455786
3605 455786 454503 414723 390856 379148 380239 329450 340340 394027 395720 417496 433187 410633
3593 410633 429377 386824 392357 361572 325630 299988 325125 334413 335039 351281 382099 419106
3581 419106 322625 367908 419759 325369 385249 405638 352265 354986 389684 418455 391277 397666
$$ packed form
3665G34362p03N3261q0795L7011o6017p9441O3170K4981J3150O4209o098j1768
3653G45322M9397k7628l3156K3970m6482p977l7256l3372M6965K0107N6057o73
3641G55274m9764k4748J28454p5424k9005o4428p0135P014J3770R039j0781p912
3629E81354j7779M4912j25124m965l5082M9104M7349l0400j29581K7313p945M3373
3617D42529K1985m8778o7363j6012K5208l7509M3512M8331j3846L334K5631K8764
3605D55786j283l9780k3867j1708J091n0789J0890N3687J693K1776J5691k2554
3593D10633J8744m2553N533l0785l5942k5642K5137R288O26J6242L0818L7007
3581D19106r6481M5283N1851r4390N9880K0389n3373K721L4698K8771k7178O389
$$ plain form
3569 397666 449958 451791 529233 537350 435814 355761 406023 388430 378752 391511 353966 360571
3557 360571 403927 425285 355884 370687 401545 463903 451431 416145 446463 376415 391943 417350
3545 417350 409578 398066 412805 409123 427874 487897 486146 441979 474219 447143 418181 484613
3533 484613 501669 523779 570958 574406 507828 499434 519884 525690 556161 588102 577871 523018
3521 523018 555526 600806 577057 591654 613921 571502 534332 607223 665321 614685 633657 660362
3509 660362 739283 755763 758305 867989 968669 1047469 1068475 1131739 1207444 1294157 1491790
3498 1491790 1662604 1704926 1745521 1810397 1904721 2019451 2007405 1943088 1983029 1894375 1736493
3487 1736493 1590705 1494691 1411618 1303624 1225158 1227726 1246140 1219386 1204262 1330360 1350224
$$ packed form
3569C97666N2292J833P7442Q117j01536q0053N0262j7593r678J2759l7545O605
3557C60571M3356K1358o9401J4803L0858O2358j2472l5286L0318p0048J5528K5407
3545D17350p772j1512J4739l682J8751O0023j751m4167L2240k7076k8962O6432
3533D84613J7056K2110M7179L448o6578q394K0450N806L0471L1941j0231n4853
3521E23018L2508M5280k3749J4597K2267m2419l7170P2891N8098n0636J8972K6705
3509F60362P8921J6480K542J09684J00680P8800K1006O3264P5705Q6713J97633
3498A491790J70814M2322M0595O4876R4324J14730j2046o4317L9941q8654j57882
3487A736493j45788r6014q3073j07994p8466K568J8414k6754j5124J26098J9864
$$ plain form
3476 1350224 1356250 1436537 1515545 1630182 1713792 1866722 2157536 2402270 2697220 3049178
3466 3049178 3314409 3553322 3768280 3983486 4187030 4458368 4516607 4519549 4577006 4551359
3456 4551359 4341522 4002591 3700408 3293834 2926516 2602618 2326546 2075950 1916093 1755760
3446 1755760 1671160 1673115 1565297 1490980 1527615 1596772 1547138 1576404 1650016 1587179 1616388
3435 1616388 1728090 1865212 1982564 2012073 2057374 2053755 2105565 2110445 2106101 2106300 2031345 1949907
3423 1949907 1926980 1787178 1612920 1477856 1412776 1384445 1248564 1182816 1139113 1145548 1236938
3412 1236938 1211386 1168386 1192845 1238685 1334421 1419817 1601056 1903740 2170200 2491339 2671137
3401 2671137 2684621 2689338 2756358 2910432 3035369 3137637 3213131 3201777 3165155 3165770 3065533
$$ packed form
3476A350224O026Q0287P9008J14637Q3610J52930K90814K44734K94950L51958
3466C049178K65231K38913K14958K15206K03544K71338N8239K942N7457k5647
3456D551359k09837l38931l02183m06574l67318l23898k76072k50596j59857j60333
3446A755760q4600J955j07818p4317L6635O9157m9634K9266P3612o2837K9209
3435A616388J11702J37122J17352K9509M5301l619N1810M880m344J99p4955q1438
3423A949907k2927j39802j74258j35064o5080k8331j35881o5748m3703O435R1390
3412A236938k5552m3000K4459M5840R5736Q5396J81239L02684K66460L21139J79798
3401B671137J3484M717O7020J54074J24937J02268P5494j1354l6622O15j00237
$$ plain form
3390 3065533 2974896 2873720 2658244 2379646 2077021 1920349 1770600 1653162 1635739 1568788
3380 1568788 1609913 1626995 1717535 1846633 1954708 2157451 2617097 3190331 3866965 4427516
3370 4427516 4605146 4570836 4648367 4813503 5009251 5202024 5345198 5381164 5347920 5343858 5320475
3359 5320475 5165378 4931498 4530301 3891604 3332009 2834862 2426082 2147966 1877521 1731566
3349 1731566 1647897 1623118 1630582 1500363 1479712 1578860 1764779 1911522 2193674 2522074 2652396
3338 2652396 2689391 2671290 2704870 2766735 2829341 3010135 3046897 3016485 2941735 2933994 2866948
3327 2866948 2724232 2583448 2400147 2094320 1819346 1577254 1334737 1214026 1140976 1028107
3317 1028107 879498 779609 810514 799325 726570 711542 736588 770667 730198 746841 813604
$$ packed form
3390C065533r0637j01176k15476k78598l02625j56672j49749j17438j7423o6951
3380A568788M1125J7082R0540J29098J08075K02743M59646N73234O76634N60551
3370D427516J77630l4310P7531J65136J95748J92773J43174L5966l3244m062k3383
3359E320475j55097k33880m01197o38697n59595m97147m08780k78116k70445j45955
3349A731566q3669k4779P464j30219k0651R9148J85919J46743K82152L28400J30322
3338B652396L6995j8101L3580O1865O2606J80794L6762l0412p4750p741o7046
3327B866948j42716j40784j83301l05827k74974k42092k42517j20711p3050j12869
3317A028107j48609r9889L0905j1189p2755j5028K5046L4079m0469J6643O6763
$$ plain form
3306 813604 761682 723794 666432 661404 711446 665992 671060 602517 552193 539871 577349 598649
3294 598649 560760 478509 536498 513598 483199 494687 484580 510492 514359 509287 532212 472250
3282 472250 391550 427215 465334 428267 495682 486156 537721 556759 531955 465789 449613 447379
3270 447379 495127 452096 469181 522331 430877 461081 456886 503001 495075 609715 579814 553412
3258 553412 598468 614897 705801 766007 828744 983269 1090686 1201907 1293629 1306742 1377506
3247 1377506 1440117 1563135 1603290 1529534 1493580 1387697 1354794 1226755 1040776 994349 966205
3236 966205 885021 747201 675510 728665 760441 680049 740946 783753 758582 794500 898440
3225 898440 982618 1085778 1198010 1212653 1319596 1411186 1462381 1492260 1478951 1434487 1427153
$$ packed form
3306H13604n1922l7888n7362n028N0042m5454N068o8543n0324j2322L7478K1300
3294E98649l7889q2251N7989k2900l0399J1488j0107K5912L867n072K2925n9962
3282D72250q0700L5665L8119l7067O7415r526N1565J9038k4804o6166j6176k234
3270D47379M7748m3031J7085N3150r1454L0204m195M6115p926J14640k9901k6402
3258E53412M5056J6429R0904O0206O2737J54525J07417J11221R1722J3113P0764
3247A377506O2611J23018M0155p3756l5954j05883l2903j28039j85979m6427k8144
3236I66205q1184j37820p1691N3155L1776q0392O0897M2807k5171L5918J03940
3225H98440Q4178J03160J12232J4643J06943R1590N1195K9879j3309m4464p334
$$ plain form
3214 1427153 1397175 1331094 1166216 1043133 967004 907199 798148 729547 650805 657745 613622
3203 613622 561823 585879 516196 483357 510095 493518 471641 442373 394864 423992 420420 426043
3191 426043 418946 411052 353938 401655 392732 330063 365378 459314 419229 333275 294202 318216
3179 318216 330881 332706 349383 341168 380883 382001 344995 305520 356463 346120 304689 310936
3167 310936 298511 331168 354688 269043 287113 289946 296115 261014 289535 319410 346379 409782
3155 409782 383078 365433 443116 430721 428025 485733 474151 463209 499326 457202 444200 435117
3143 435117 450784 415905 372290 435680 419754 438503 457681 553119 544427 515419 495946 459483
3131 459483 399471 406100 406215 457269 470048 484032 466032 450110 464836 491777 495351 495992 560140
$$ packed form
3214A427153k9978o6081j64878j23083p6129n9805j09051o8601p8742O940m4123
3203F13622n1799K4056o9683l2839K6738j6577k1877k9268m7509K9128l572N623
3191D26043p097p894n7114M7717q923o2669L5315R3936m0085q5954l9073K4014
3179C18216J2665J825J6677q215L9715J118l7006l9475N0943j0343m1431O247
3167C10936j2425L2657K3520q5645J8070K833O169l5101K8521K9875K6969O3403
3155D09782k6704j7645P7683j2395k696N7708j1582j0942L6117m2124j3002r083
3143D35117J5667l4879m3615O3390j5926J8749J9178R5438q692k9008j9473l6463
3131D59483o0012O629J15N1054J2779J3984j8000j5922J4726K6941L574O41O4148
$$ plain form
3118 560140 610163 643649 672932 632986 608051 649347 577946 591054 626318 569195 602409 539073
3106 539073 550977 519648 482935 508974 468134 530225 560357 598937 616643 629342 588677 600408
3094 600408 750597 741528 837214 872810 851594 863515 893940 809690 749630 772194 796812 766617
3082 766617 740753 689187 611316 633089 601408 614026 626378 592281 534433 539086 568161 561610
3070 561610 504142 523846 533758 561545 585355 590100 630646 641873 621110 631585 604480 551118
3058 551118 625225 666287 600303 535846 545591 562686 495936 490193 447992 349042 325371 345562
3046 345562 350411 387562 385083 286601 320195 328810 293884 231721 214850 317280 328405 323576
3034 323576 284506 222038 238381 288420 252525 190664 220211 280506 300564 282832 199423 262956
$$ packed form
3118E60140N0023L3486K9283l9946k4935M1296p1401J3108L5264n7123L3214o3336
3106E39073J1904l1329l6713K6039m0840O2091L0132L8580J7706J2699m0665J1731
3094F00408J50189r069R5686L5596k1216J1921L0425q4250o0060K2564K4618l0195
3082G66617k5864n1566p7871K1773l1681J2618J2352l4097n7848M653K9075o551
3070E61610n7468J9704R912K7787K3810M745M0546J1227k0763J0475k7105n3362
3058E51118P4107M1062o5984o4457R745J7095o6750n743m2201r8950k3671K0191
3046C45562M849L7151k479r8482L3594Q615l4926o2163j6871J02430J1125m829
3034C23576l9070o2468J6343N0039l5895o1861K9547O0295K0058j7732q3409O3533
$$ plain form
3022 262956 211483 210906 190243 120577 120019 158597 171851 179166 246297 224483 197826 217773 212831
3009 212831 200125 194118 145479 53164 111148 145614 160814 147151 157233 198442 175901 180885
2997 180885 139710 73266 86068 79948 106065 145429 66971 115558 139000 192559 206385 174669
2985 174669 197044 169864 210251 192212 148228 150644 143864 169930 222455 211314 188119 219748
2973 219748 292660 250949 214003 185945 182579 105157 105062 106882 101190 65111 38178 120272 96127
2960 96127 100763 74279 120471 109549 144999 132665 176341 149359 152721 83695 31368 87031
2948 87031 70009 63313 72221 93806 108871 130663 107616 144718 155398 172111 154945 140361
2936 140361 158469 132518 158233 177594 97201 55456 78055 182373 209943 201325 156016 142430
$$ packed form
3022B62956n1473n77k0663o9666n58L8578J3254P315O7131k1814k6657J9947m942
3009B12831j2706o007m8639r2315N7984L4466J5200j3663J0082M1209k2541M984
2997A80885m1175o6444J2802o120K6117L9364p8458M8587K3442N3559J3826l1716
2985A74669K2375k7180M0387j8039m3984K416o780K6066N2525j1141k3195L1629
2973B19748P2912m1711l6946k8058l366p7422r5J820n692l6079k6933Q2094k4145
2960I6127M636k6484M6192j0922L5450j2334M3676k6982L362o9026n2327N5663
2948H7031j7022o696Q908K1585J5065K1792k3047L7102J0680J6713j7166j4584
2936A40361J8108k5951K5715J9361q0393m1745K2599J04318K7570q618m5309j3586
$$ plain form
2924 142430 92738 112922 164291 145254 204093 107978 101643 84732 125958 93397 33591 46515
2912 46515 86326 78090 29172 115050 153595 97410 111436 137292 149681 150470 80387 101964
2900 101964 109832 58956 87258 56529 54163 98767 139498 113723 121089 166766 78399 63252
2888 63252 57053 30258 58009 47609 3161 55652 120857 36504 29188 63123 80353 69764
2876 69764 55987 46412 53741 107056 63100 -21926 63968 46107 84592 80376 120656 100598
2864 100598 94292 108712 55299 80070 66804 52885 36643 87171 49527 65688 79473 117176
2852 117176 145497 145310 104587 34386 37301 85425 74696 89379 117616 127943 131926 80152
2840 80152 118711 114434 83222 99534 66719 81324 76902 86496 75726 95569 83296 103942
$$ packed form
2924A42430m9692K0184N1369j9037N8839r6115o335j6911M1226l2561n9806J2924
2912D6515L9811q236m8918Q5878L8545n6185J4026K5856J2389P89p0083K1577
2900A01964P868n0876K8302l0729k366M4604M0731k5775P366M5677q8367j5147
2888F3252o199k6795K7751j0400m4448N2491O5205q4353p316L3935J7230j0589
2876F9764j3777r575P329N3315m3956q5026Q5894j7861L8485m216M0280k0058
2864A00598o306J4420n3413K4771j3266j3919j6242N0528l7644J6161J3785L7703
2852A17176K8321j87m0723p0201K915M8124j0729J4683K8237J0327L983n1774
2840H0152L8559m277l1212J6312l2815J4605m422R594j0770J9843j2273K0646
$$ plain form
2828 103942 54475 9679 32852 55223 66677 88349 146563 119543 77813 70842 91087 116255
2816 116255 111919 149817 163705 139497 123995 38732 -3083 18208 39788 58406 41580 61617
2804 61617 113105 93687 106857 78986 97676 88212 71250 64731 3763 -1895 9532 52489
2792 52489 69460 -36250 -16499 45212 14 -31845 -26197 24958 63978 135922 24215 14109
2780 14109 58886 98788 35610 40736 62470 130315 130702 107004 36071 53694 127041 130439 37237
2767 37237 46663 63860 73384 75097 39005 63336 106323 80518 -21534 42506 -11875 -43329
2755 -43329 32993 120896 68965 23085 31046 46004 51378 95161 123793 134077 94740 60811
2743 60811 99232 67883 52603 58231 3821 30544 49608 40730 -17564 -4752 -29318 -19990
$$ packed form
2828A03942m9467m4796K3173K2371J1454K1672N8214k7020m1730o971K0245K5168
2816A16255m336L7898J3888k4208j5502q5263m1815K1291K1580J8618j6826K0037
2804F1617N1488j9418J3170k7871J8690r464j6962o519o0968n658J1427M2957
2792E2489J6971j05710J9751O1711m5198l1859N648N1155L9020P1944j11707j0106
2780A4109M4777L9902o3178N126K1734O7845L87k3698p0933J7623P3347L398r3202
2767C7237R426J7197R524J713l6092K4331M2987k5805j02052O4040n4381l1454
2755d3329P6322Q7903n1931m5880P961J4958N374M3783K8632J0284l9337l3929
2743F0811L8421l1349j5280N628n4410K6723J9064q878n8294J2812k4566R328
$$ plain form
2731 -19990 -21878 -37588 -11255 -11405 45832 -14698 2446 47079 17667 56111 -2425 -70672
2719 -70672 -5718 9706 23393 25918 41519 7620 70708 93068 56246 69266 55054 66473
2707 66473 37306 57668 33554 102530 47739 28750 10843 -4463 12802 -61760 4604 43601
2695 43601 19699 25342 5032 41812 38329 12392 36921 7780 -31035 40287 94018 68211
2683 68211 20686 -6021 -24745 4509 51286 -2605 -63561 -35458 16719 36657 71500 67426
2671 67426 47572 19222 -98785 -96260 -17178 49920 4925 -7496 8756 29083 28562 8682
2659 8682 30703 27447 36873 115456 25679 -26782 -27658 6917 21616 29356 17751 15540 63816
2646 63816 44212 -14190 -16046 20242 63987 45503 -9109 3391 7544 13508 13274 -1960 36909
$$ packed form
2731a9990j888j5710K6333j50N7237o0530J7144M4633k9412L8444n8536o8247
2719g0672O4954J5424J3687K525J5601l3899O3088K2360l6822J3020j4212J1419
2707F6473k9167K0362k4114O8976n4791j8989j7907j5306J7265p4562O6364L8997
2695D3601k3902N643k0310L6780l483k5937K4529k9141l8815P1322N3731k5807
2683F8211m7525k6707j8724K9254M6777n3891o0956K8103N2177J9938L4843m074
2671F7426j9854k8350j18007K525P9082O7098m4995j2421J6252K0327n21j9880
2659H682K2021l256R426P8583q9777n2461q76L4575J4699P740j1605k211M8276
2646F3816j9604n8402j856L6288M3745j8484n4612J2500M153N964k34j5234L8869
$$ plain form
2633 36909 28047 -1633 -19023 -11110 21017 48561 71923 35736 37408 13670 9506 -50049 -3122
2620 -3122 -18240 -37379 50640 29241 84372 91783 -21828 -314 -6808 -41290 12790 26305
2608 26305 3175 59519 8225 -30449 33402 89790 25225 8026 16291 15157 32740 46900
2596 46900 40543 77280 11938 6053 -5539 -19837 36830 93548 34966 90892 159398 226503
2584 226503 194691 125440 141191 115756 90644 66404 70893 69861 42378 18806 11108 25434
2572 25434 38780 37868 33689 18297 -43775 -47573 6800 -48451 -52722 -8073 61554 18523 -19882
2559 -19882 -30959 -40794 -64035 -14715 -2781 -17782 8487 -45108 -90541 -39163 29258 10893
2547 10893 -46088 -30107 2630 -16575 -9343 -10122 -8569 -20299 13582 -58039 -84334 -79074 -7762
$$ packed form
2633C6909q862k9680j7390P913L2127K7544K3362l6187J672k3738m164n9555M6927
2620c122j5118j9139Q8019k1399N5131P411j13611K1514o494l4482N4080J3515
2608B6305k3130N6344n1294l8674O3851N6388o4565j7199Q265j134J7583J4160
2596D6900o357L6737o5342n885j1592j4298N6667N6718n8582N5926O8506O7105
2584B26503l1812o9251J5751k5435k5112k4240M489j032k7483k3572p698J4326
2572B5434J3346r12m179j5392o2072l798N4373n5251m271M4649O9627m3031l8405
2559a9882j1077r835k3241M9320J1934j5001K6269n3595m5433N1378O8421j8365
2547A0893n6981J5981L2737j9205P232p79J553j1730L3881p1621k6295N260P1312
$$ plain form
2534 -7762 -12817 8005 2684 16518 10535 27698 54298 31145 94566 41516 -1797 19548 -10480
2521 -10480 19781 47430 15944 59733 4315 19376 -1562 -26427 -24807 -7983 -45312 -72191
2509 -72191 2678 10328 40671 46606 -20184 -33448 -56834 -21990 23633 -1299 -93023 -120632
2497 -120632 -55638 -109137 -44851 -99089 -94279 -48690 -35786 -30091 -80033 -44043 -16782 -26540
2485 -26540 -43736 -13950 -24279 -6037 -42829 -27790 -96767 -33301 -10103 -62943 -110500 -59259
2473 -59259 -97041 -112627 -36668 52602 17162 -40856 -50890 -33704 -20676 -21160 -61771 -10609
2461 -10609 -79025 -103493 -97453 -138961 -126533 -57448 -61105 -54961 -83679 -17829 24428 32269 6033
2448 6033 -103500 -57455 -36204 -108709 -106467 -46616 3953 60619 94575 27370 -16714 -31038
$$ packed form
2534g762n055K0822n321J3834n983J7163K6600k3153O3421n3050m3313K1345l0028
2521a0480L0261K7649l1486M3789n5418J5061k0938k4865J620J6824l7329k6879
2509g2191P4869P650L0343N935o6790j3264k3386L4844M5623k4932r1724k7609
2497a20632O4994n3499O4286n4238M810M5589J2904N695m9942L5990K7261r758
2485b6540j7196K9786j0329J8242l6792J5039o8977O3466K3198n2840m7557N1241
2473e9259l7782j5586P5959Q9270l5440n8018j0034J7186J3028m84m0611N1162
2461a0609o8416k4468O040m1508J2428O9085l657O144k8718O5850M2257P841k6236
2448F033j09533M6045K1251p2505K242N9851N0569N6666L3956o7205m4084j4324
$$ plain form
2436 -31038 -9828 27486 -25079 -23371 10661 48799 -23351 -7290 -6103 -1279 -10153 -78589 -64227
2423 -64227 41826 56265 -14928 -56622 -28660 15796 35241 -19903 27153 53583 105 -8668
2411 -8668 16934 11015 28423 1500 2730 -4694 43366 41086 923 -18805 13658 68540 50424
2398 50424 7462 -43617 -26126 5705 17372 28887 69365 12189 -75142 -52438 -6167 41835
2386 41835 -28307 -69825 -11389 66097 30853 -21484 63883 79913 45810 25394 -15716 59095
2374 59095 97996 114521 79878 117857 134311 238374 221599 170951 121264 104609 96549 114239
2362 114239 153803 212523 240871 251822 277036 259843 270801 280442 301494 234524 180495 215973
2350 215973 191741 144636 197978 243058 295714 313191 343118 425151 492217 513221 561618 758642
$$ packed form
2436c1038K1210L7314n2565J708L4032L8138p2150J6061J187M824q874o8436J4362
2423f4227J06053J4439p1193m1694K7962M4456J9445n5144M7056K6430n3478q773
2411h668K5602n919J7408k6923J230p424M8060k280m0163j9728L2463N4882j8116
2398E0424m2962n1079J7491L1831J1667J1515M0478n7176q7331K2704M6271M8002
2386D1835p0142m1518N8436P7486l5244n2337Q5367J6030l4103k0416m1110P4811
2374E9095L8901J6525l4643L7979J6454J04063j6775n0648m9687j6655q060J7690
2362A14239L9564N8720K8348J0951K5214j7193J0958R641K1052o6970n4029L5478
2350B15973k4232m7105N3342M5080N2656J7477K9927Q2033O7066K1004M8397J97024
$$ plain form
2338 758642 889986 1090954 1375236 1725114 1961471 2124530 2332028 2629183 2736973 2961871
2328 2961871 3339901 3906767 4598165 5595312 7088140 9738529 15067461 22247127 28979346
2319 28979346 33012788 32885027 32168318 29218263 22122393 15932628 11473626 8571913
2311 8571913 6582439 5243619 4237603 3561418 3180526 3097956 3119210 3002720 2876254
2302 2876254 2711569 2535321 2339710 2039406 1868840 1672575 1629972 1600233 1540052 1436734
2292 1436734 1336692 1281458 1342794 1261761 1219181 1188686 1130630 1146263 1066954 941219 888241
2281 888241 781236 741651 737058 695377 700373 660359 689169 679831 664215 634400 646182 604819
2269 604819 466075 474986 503981 540466 563492 574784 590761 600336 579958 598876 595708 564753
$$ packed form
2338G58642J31344K00968K84282L49878K36357J63059K07498K97155J07790K24898
2328B961871L78030N66866O91398R97147J492828K650389N328932P179666O732219
2319B8979346M033442j27761p16709k950055p095870o189765m459002k901713
2311H571913j989474j338820j006016o76185l80892q2570K1254j16490j26466
2302B876254j64685j76248j95611l00304j70566j96265m2603k9739o0181j03318
2292A436734j00042n5234O1336q1033m2580l0495n8056J5633p9309j25735n2978
2281H88241j07005l9585m593m1681M996m0014K8810r338j5616k9815J1782m1363
2269F04819j38744Q911K8995L6485K3026J1292J5977R575k0378J8918l168l0955
$$ plain form
2257 564753 495027 494202 513572 570467 535223 413913 431030 380385 293272 301796 306221 390667
2245 390667 421653 321264 371974 338066 348940 362898 383646 368990 282267 286160 322666 285020
2233 285020 372556 300309 228576 258090 245627 247476 195086 95702 123665 157444 163840 143578
2221 143578 147210 180611 234105 200315 174528 190551 235921 255920 245656 230213 164856 139443
2209 139443 164283 200361 185839 180598 223985 201761 186521 212055 218953 163145 135973 131589
2197 131589 187618 191105 160310 140523 112649 74303 80403 95569 131220 137831 82964 73859
2185 73859 109780 133632 88061 139990 194398 129385 143191 198290 192295 145534 101472 113688
2173 113688 72386 119004 201591 197735 155108 117237 181829 126456 88754 114196 163142 76628
$$ packed form
2257E64753o9726q25J9370N6895l5244j21310J7117n0645q7113Q524M425Q4446
2245C90667L0986j00389N0710l3908J0874J3958K0748j4656q6723L893L6506l7646
2233B85020Q7536p2247p1733K9514j2463J849n2390r9384K7963L3779O396k0262
2221A43578L632L3401N3494l3790k5787J6023M5370J9999j0264j5443o5357k5413
2209A39443K4840L6078j4522n241M3387k2224j5240K5534O898n5808k7172m384
2197A31589N6029L487l0795j9787k7874l8346O100J5166L5651O611n4867r105
2185G3859L5921K3852m5571N1929N4408o5013J3806N5099n995m6761m4062J2216
2173A13688m1302M6618Q2587l856m2627l7871O4592n5373l7702K5442M8946q6514
$$ plain form
2161 76628 94663 139939 21901 -240 29467 78781 84964 116374 74010 25245 39835 67947
2149 67947 68483 89719 57830 100375 104968 113421 152187 68925 87842 76750 84421 43755 -16580
2136 -16580 58820 4276 -9073 36631 44892 63201 77166 93876 3914 -6469 58407 6020
2124 6020 -38299 12478 16120 34100 -26022 -14770 24568 114870 104990 70724 20683 80818
2112 80818 131560 105169 66457 67768 41678 -6837 25944 -9758 19637 74322 45580 34072
2100 34072 65455 26225 77008 93611 95586 31931 -21848 -42911 -14191 -18437 43071 31571
2088 31571 42214 32322 57505 13931 30717 43893 34871 34533 25240 30538 100471 79127 38559
2075 38559 40566 65583 58702 1453 -37811 15655 73743 44954 13328 23044 25 2656 6248
$$ packed form
2161G6628J8035M5276j18038k2141K9707M9314O183L1410m2364m8765J4590K8112
2149F7947N36K1236l1889M2545M593Q453L8766q3262J8917j1092P671m0666o0335
2136a6580P5400n4544j3349M5704Q261J8309J3965J6710q9962j0383O4876n2387
2124F020m4319N0777L642J7980o0122J1252L9338R0302r880l4266n0041O0135
2112H0818N0742k6391l8712J311k6090m8515L2781l5702K9395N4685k8742j1508
2100C4072L1383l9230N0783J6603J975o3655n3779k1063K8720m246O1508j1500
2088C1571J0643r892K5183m3574J6786J3176r022l38r293N298O9933k1344m0568
2075C8559K007K5017o881n7249l9264N3466N8088k8789l1626R716k3019K631L592
$$ plain form
2062 6248 -17935 78705 130040 137247 49400 -44780 10484 24125 67962 142500 166554 160092
2050 160092 185846 126323 124986 196146 170402 105893 80329 34323 -12605 54609 24858 -9375
2038 -9375 18534 20393 -38014 -51906 -33350 57237 78154 11027 23355 7661 -28447 -38617
2026 -38617 -26064 -21887 17528 -30166 -76232 -61571 -47243 -87701 -23802 29729 29072 101615
2014 101615 40114 12091 -14888 -28704 -24614 22614 -5832 -37417 -30873 -42981 -12044 -13396
2002 -13396 -43292 -40250 11926 14376 -20339 34458 18109 15408 5339 36320 -12849 24339
1990 24339 -2109 -27197 -1091 19383 34619 13900 -8170 21922 37375 -21530 7674 40353
1978 40353 -56598 -79890 -86918 -43920 -38730 -83131 -10229 -5283 7130 35446 -34358 -25354 -14898
$$ packed form
2062F248k4183R6640N1335P207q7847r4180N5264J3641M3837P4538K4054o462
2050A60092K5754n9523j337P1160k5744o4509k5564m6006m6928O7214k9751l4233
2038i375K7909J859n8407j3892J8556R0587K0917o7127J2328j5694l6108j0170
2026c8617J2553M177L9415m7694m6066J4661J4328m0458O3899N3531o57P2543
2014A01615o1501k8023k6979j3816M090M7228k8446l1585O544j2108L0937j352
2002a3396k9896L042N2176K450l4715N4797j6349k701j0069L0981m9169L7188
1990B4339k6448k5088K6106K0474J5236k0719k2070L0092J5453n8905K9204L2679
1978D0353r6951k3292p028M2998N190m4401P2902M946J2413K8316o9804R004J0456
$$ plain form
1965 -14898 -9932 17691 38704 -15886 15273 13087 -22644 -6074 -19491 -44556 -64400 -11046
1953 -11046 41629 -26282 -57435 -77677 -33379 -44152 -14858 49838 26887 67733 66418 3640
1941 3640 -125024 -139018 -81387 -21976 -17385 -79085 -73416 -61795 -45013 -31320 -94707 -89421
1929 -89421 -79213 -118240 -107884 -50506 -47329 8329 21840 -25557 -19344 -12945 -60781 -28381
1917 -28381 -2948 -23358 -51240 39573 64502 66559 5074 19340 39537 13050 29469 13853
1905 13853 -2500 -13351 -65077 -62099 -88021 -14134 3529 69001 21170 27236 74398 53849
1893 53849 -3876 -19080 -24028 -7419 -3042 12915 14376 3865 -1592 25366 22696 -13120 -42012
1880 -42012 7619 14198 21078 41555 16254 7034 36105 21371 -35542 -48933 -43362 -19682 -80428
$$ packed form
1965a4898M966K7623K1013n4590L1159k186l5731J6570j3417k5065j9844N3354
1953a1046N2675o7911l1153k0242M4298j0773K9294O4696k2951M0846j315o2778
1941C640j28664j3994N7631N9411M591o1700N669J1621J6782J3693o3387N286
1929h9421J0208l9027J0356N7378L177N5658J3511m7397O213O399m7836L2400
1917b8381K5433k0410k7882R0813K4929K057o1485J4266K0197k6487J6419j5616
1905A3853j6353j0851n1726K978k5922P3887J7663O5472m7831O066M7162k0549
1893E3849n7725j5204m948J6609M377J5957J461j0511n457K6958k670l5816k8892
1880d2012M9631O579O880K0477k5301r220K9071j4734n6913j3391N571K3680o0746
$$ plain form
1867 -80428 6163 -57439 -50728 -45857 -54262 -60520 -5782 22669 26522 68055 70012 35533 -14941
1854 -14941 4179 52613 -85492 -72549 13592 3191 -15676 -39694 -71515 6389 -62605 -96387
1842 -96387 -76160 -79365 -59105 -11835 28516 -44692 -93189 -32227 -59719 -79951 -27669 -30429
1830 -30429 -11763 18604 24375 36150 3630 -44439 -70813 -55025 -67626 -82457 -61068 6952
1818 6952 115228 43205 23395 -12957 -55761 -30309 -11240 50611 -23749 11755 36990 -53917
1806 -53917 -46029 33814 -6923 -52247 -86295 -87397 -103344 -17586 -17342 -49465 -1731 -37938 -16881
1793 -16881 -27137 -65950 -102157 -53521 -24370 -40435 -112203 -107870 -71649 24956 10871 40505
1781 40505 -2773 -23909 9459 -39408 -37390 -33364 -61020 -100193 -123490 -136526 -112622 -77039
$$ packed form
1867h0428Q6591o3602O711M871q405o258N4738K8451L853M1533J957l4479n0474
1854a4941J9120M8434j38105J2943Q6141j0401j8867k4018l1821P7904o8994l3782
1842i6387K0227l205K0260M7270M0351p3208m8497O0962k7492k0232N2282k760
1830c0429J8666L0367N771J1775l2520m8069k6374J5788j2601j4831K1389O8020
1818F952J08276p2023j9810l6352m2804K5452J9069O1851p4360L5504K5235r0907
1806e3917P888P9843m0737m5324l4048j102j5947Q5758K44l2123M7734l6207K1057
1793a6881j0256l8813l6207M8636K9151j6065p1768M333L6221R6605j4085K9634
1781D0505m3278k1136L3368m8867K018M026k7656l9173k3297j3036K3904L5583
$$ plain form
1769 -77039 -45071 -65043 -120801 -111047 -99926 -27194 -11356 -28022 -7104 -21637 -60125 5703
1757 5703 10295 -6242 -82769 -83014 -11778 -6401 -51317 -91989 -129041 -56595 1919 -35220 -48866
1744 -48866 20063 15931 9445 16321 -22173 -14434 -78582 -62342 -92451 -115969 -86612 -39178 -54723
1731 -54723 -47390 -82096 -4197 15659 -17847 -67169 -84540 -46328 -45840 -74584 -9673 18639
1719 18639 -6980 11418 -28912 -33296 -46036 -57420 -114532 -97041 30549 -2848 -23947 4953
1707 4953 -55679 -52377 -65283 -15663 -49192 -40319 -38897 -49768 -51329 -87726 -80169 -33918 -55999
1694 -55999 -3781 47342 42547 22123 -8490 5262 -49407 -78751 27973 20070 -42160 -26560
1682 -26560 -89380 -77038 -28708 -4559 -35642 -722 -74382 -56354 31647 -22437 -103313 -36209
$$ packed form
1769g7039L1968j9972n5758R754J1121P2732J5838j6666K0918j4533l8488O5828
1757E703M592j6537p6527k45P1236N377m4916m0672l7052P2446N8514l7139j3646
1744d8866O8929m132o486O876l8494P739o4148J6240l0109k3518K9357M7434j5545
1731e4723P333l4706P7899J9856l3506m9322j7371L8212M88k8744O4911K8312
1719A8639k5619J8398m0330m384j2740j1384n7112J7491J27590l3397k1099K8900
1707D953o0632L302j2906M9620l3529Q873J422j0871j561l6397P557M6251k2081
1694e5999N2218N1123m795k0424l0613J3752n4669k9344J06724p903o2230J5600
1682b6560o2820J2342M8330K4149l1083L4920p3660J8028Q8001n4084q0876O7104
$$ plain form
1670 -36209 46835 -7749 -18081 -11335 9662 -28497 -45156 -50456 -51147 -17567 -9402 -16892 42841
1657 42841 35518 -35282 -86992 -67957 -105275 -179968 -109919 -100090 -70608 -30447 -5461 -8320
1645 -8320 60512 7783 90119 63299 -7277 -17653 -13729 -53295 -55104 -137179 -93736 -3951
1633 -3951 -1952 10566 27078 -197 -45508 -65508 -34523 13342 -7592 -60364 -127893 -88175
1621 -88175 -49324 -27321 -19995 -12693 -22379 -991 -44772 -43396 -63068 -87815 -94514 -12735 -20064
1608 -20064 -66785 -84618 -63396 -43482 -71498 -68864 4554 -10159 -26955 -89857 -21587 44528
1596 44528 24854 -19312 -8109 6902 11312 -86867 -62625 -51397 -67112 -58423 -39605 -26224
1584 -26224 -82602 -56976 -12631 -83079 -60894 -61574 -70207 -797 -63703 -76776 -37961 -81696
$$ packed form
1670c6209Q3044n4584j0332O746K0997l8159j6659n300o91L3580Q165p490N9733
1657D2841p323p0800n1710J9035l7318p4693P0049R829K9482M0161K4986k859
1645h320O8832n2729Q2336k6820p0576j0376L924l9566j809q2075M3443Q9785
1633c951J999J2518J6512k7275m5311k0000L0985M7865k0934n2772o7529L9718
1621h8175L8851K2003P326P302r686K1388m3781J376j9672k4747o699Q1779p329
1608b0064m6721j7833K1222J9914k8016K634P3418j4713j6796o2902O8270O6115
1596D4528j9674m4166J1203J5011M410r8179K4242J1228j5715Q689J8818J3381
1584b6224n6378K5626M4345p0448K2185o80q633O9410o2906j3073L8815m3735
$$ plain form
1572 -81696 -140327 -87384 -47912 -49734 -21737 -44391 -47104 -5196 -62914 -68417 -87393 -39681
1560 -39681 -6126 -23141 -63029 -49388 -55051 -65169 -45441 -30350 -47048 -13148 23493 40906
1548 40906 12903 -11235 -34290 -35196 -31411 -58676 -40117 -4360 -17440 -42655 -102614 -113616
1536 -113616 -48039 5976 2335 -39774 -38371 -22667 -21252 27048 42405 35672 12373 5686 47885
1523 47885 -17389 -58388 -32170 -81570 -83056 12065 18527 10810 15752 -3147 4152 23824 26951
1510 26951 -1297 -26111 -86384 -64082 -56580 -126201 -69516 -61626 -66313 -42767 -84003 -98658
1498 -98658 -15450 10130 -12356 -61147 -76837 -35901 -30272 -11839 -52805 -73072 -20810 -48047
1486 -48047 -61728 -98270 -109281 -99144 -70938 -58887 -94466 -95724 -33602 6015 -13449 -55786
$$ packed form
1572h1696n8631N2943L9472j822K7997k2654k713M1908n7718n503j8976M7712
1560c9681L3555j7015l9888J3641n663j0118J9728J5091j6698L3900L6641J7413
1548D0906k8003k4138k3055r06L785k7265J8559L5757j3080k5215n9959j1002
1536a13616O5577N4015l641m2109J403J5704J415M8300J5357o733k3299o687M2199
1523D7885o5274m0999K6218m9400j486R5121O462p717M942j8899P299J9672L127
1510B6951k8248k4814o0273K2302P502o9621N6685P890m687K3546m1236j4655
1498i8658Q3208K5580k2486m8791j5690M0936N629J8433m0966k0267N2262k7237
1486d8047j3681l6542j1011J0137K8206J2051l5579j258O2122L9617j9464m2337
$$ plain form
1474 -55786 -99431 -108857 -37025 -31292 -61465 -48893 -99837 -107813 -66859 -75592 -71160 -73495 -76062
1461 -76062 -46288 -91172 -102615 -84813 -73201 6562 22232 -15363 3015 7500 -30789 -41912
1449 -41912 -67489 -65133 -33836 -36088 -63519 -111090 -12061 -11042 -11372 -24475 -19775 -38771 -76739
1436 -76739 -36772 -28255 -93924 -98009 -111644 -51524 -4694 -29454 13505 21006 -43861 -115779
1424 -115779 -69332 -32583 -11184 -18287 -64401 -111230 -83581 -20629 22012 24783 50085 -10654
1412 -10654 -16092 35861 39133 10635 -41416 -39559 -72661 11228 18077 -15545 -37987 -68881 -40438
1399 -40438 -13530 17147 -6690 -18988 -81245 -80646 -22402 -50014 -25028 -74028 -93066 -85948
1387 -85948 -76046 -55367 -44033 -70201 -55735 -5819 -38636 -23663 -34809 19165 20834 -30824
$$ packed form
1474e5786m3645r426P1832N733l0173J2572n0944p976M0954q733M432k335k567
1461g6062K9774m4884j1443J7802J1612P9763J5670l7595J8378M485l8289j1123
1449d1912k5577K356L1297k252k7431m7571R9029J019l30j3103M700j8996l7968
1436g6739L9967Q517o5669m085j3635O0120M6830k4760M2959P501o4867p1918
1424a15779M6447L6749K1399p103m6114m6829K7649O2952M2641K771K5302o0739
1412a0654n438N1953L272k8498n2051J857l3102Q3889O849l3622k2442l0894K8443
1399d0438K6908L0677k3837j2298o2257N99N8244k7612K4986m9000j9038P118
1387h5948R902K0679J1334k6168J4466M9916l2817J4973j1146N3974J669n1658
$$ plain form
1375 -30824 -40036 -40548 -78153 -74954 -91803 -75444 -30058 -43380 -18142 35360 19385 -5157 -40337
$$ packed form
1375c0824r212n12l7605L199j6849J6359M5386j3322K5238N3502j5975k4542l5180
$$ [...]
##END NTUPLES=NMR SPECTRUM
##END=
