##TITLE=1H_DE-80H_X3
 200.13MHz, d2o
 8 sc
 
 19ns.26.2.2025
##JCAMPDX= 6.0         $$ Bruker NMR JCAMP-DX V2.0
##DATA TYPE= NMR SPECTRUM
##DATA CLASS= NTUPLES
##ORIGIN= UXNMR, Bruker Analytische Messtechnik GmbH
##OWNER= pz
$$ XWIN-NMR		Version 3.5
$$ Fri Dec  5 11:26:13 2025 Russian Standard Time (UT+4h)  Yarkov@DPX200
##.OBSERVE FREQUENCY= 200.1313
##.OBSERVE NUCLEUS= ^1H
##.ACQUISITION MODE= SIMULTANEOUS
##.ACQUISITION SCHEME= undefined
##.AVERAGES= 8
##.DIGITISER RES= 18
##SPECTROMETER/DATA SYSTEM= spect
##.PULSE SEQUENCE= zg30
##.SOLVENT NAME= CDCl3
##.SHIFT REFERENCE= (INTERNAL, CDCl3, 0, 15.4902)
##AUDIT TRAIL= $$ (NUMBER, WHEN, WHO, WHERE, WHAT)
$$ ##TITLE= Audit trail, XWIN-NMR		Version 3.5
$$ ##JCAMPDX= 5.01
$$ ##ORIGIN= Bruker BioSpin GmbH
$$ ##OWNER= Yarkov
$$ C:/Bruker/XWIN-NMR/data/yarkov2/nmr/H-C/1/pdata/1/auditp.txt
$$ ##AUDIT TRAIL=  $$ (NUMBER, WHEN, WHO, WHERE, WHAT)
(   1,<2025-12-05 11:25:31.04 +0400>,<Yarkov>,<DPX200>,
      <created by zg, POWCHK disabled, PULCHK disabled
       configuration hash MD5:
       00 E9 B6 7A A2 85 ED C7 34 08 36 98 17 FE 4E 26
       data hash MD5: 16K
       1A 9F B0 D6 64 50 77 D4 E1 01 F7 D9 AF 0A 47 08>)
(   2,<2025-12-05 11:25:35.87 +0400>,<Yarkov>,<DPX200>,
      <Start of raw data processing
       efp BC_mod = 2 LB = 0.25 FT_mod = 6 PKNL = 1 PHC0 = -5312.553 PHC1 = 20.22191 SI = 16K 
       data hash MD5: 16K
       36 5A 7C 38 A1 78 13 87 7F 0C 04 44 35 F4 81 30>)
$$ ##END=
$$ 
$$ hash MD5
$$ F6 BC 29 03 6C D6 58 A7 49 DD 51 EF 2F 25 00 B8
##$RELAX= 
##$RELAX= 
##$RELAX= 
##$RELAX= 
##$RELAX= 
##$RELAX= 
$$ Bruker specific parameters
$$ --------------------------
##$DU= <C:/Bruker/XWIN-NMR>
##$EXPNO= 1
##$NAME= <H-C>
##$PROCNO= 1
##$TYPE= <nmr>
##$USER= <yarkov2>
##$AMP= (0..31)
100 100 100 100 100 100 100 100 100 100 100 100 100 100 100 100 100 100 
100 100 100 100 100 100 100 100 100 100 100 100 100 100 
##$AQSEQ= 0
##$AQ_mod= 1
##$AUNM= <au_zg>
##$AUTOPOS= <>
##$BF1= 200.13
##$BF2= 200.13
##$BF3= 200.13
##$BF4= 200.13
##$BF5= 200.13
##$BF6= 200.13
##$BF7= 200.13
##$BF8= 200.13
##$BYTORDA= 1
##$CFDGTYP= 0
##$CFRGTYP= 5
##$CHEMSTR= <none>
##$CNST= (0..31)
1 1 145 1 1 1 1 1 1 1 1 1 1 1 1 1 1 1 1 1 1 1 1 1 1 1 1 1 1 1 1 1 
##$CPDPRG= <>
##$CPDPRG1= <>
##$CPDPRG2= <>
##$CPDPRG3= <>
##$CPDPRG4= <mlev>
##$CPDPRG5= <mlev>
##$CPDPRG6= <mlev>
##$CPDPRG7= <mlev>
##$CPDPRG8= <mlev>
##$CPDPRGB= <>
##$CPDPRGT= <>
##$D= (0..31)
0 0.7 0 0 0 0 0 0 0 0 0 0.03 0 0 0 0 0 0 0 0 0 0 0 0 0 0 0 0 0 0 0 0 
##$DATE= 1764919530
##$DBL= (0..7)
120 120 120 120 120 120 120 120 
##$DBP= (0..7)
150 150 150 150 150 150 150 150 
##$DBP07= 0
##$DBPNAM0= <>
##$DBPNAM1= <>
##$DBPNAM2= <>
##$DBPNAM3= <>
##$DBPNAM4= <>
##$DBPNAM5= <>
##$DBPNAM6= <>
##$DBPNAM7= <>
##$DBPOAL= (0..7)
0.5 0.5 0.5 0.5 0.5 0.5 0.5 0.5 
##$DBPOFFS= (0..7)
0 0 0 0 0 0 0 0 
##$DE= 6
##$DECBNUC= <off>
##$DECIM= 32
##$DECNUC= <off>
##$DECSTAT= 4
##$DIGMOD= 1
##$DIGTYP= 9
##$DL= (0..7)
0 120 120 120 120 120 120 120 
##$DP= (0..7)
$$ [...]
##$SUBNAM2= <"">
##$SUBNAM3= <"">
##$SUBNAM4= <"">
##$SUBNAM5= <"">
##$SUBNAM6= <"">
##$SUBNAM7= <"">
##$SUBNAM8= <"">
##$SUBNAM9= <"">
##$SW= 18.0517328524113
##$SWIBOX= (0..15)
0 0 2 0 0 0 0 0 0 0 0 0 0 0 0 0 
##$SW_h= 3612.71676300578
##$TD= 16384
##$TD0= 1
##$TE= 0
##$TE2= 300
##$TE3= 300
##$TEG= 300
##$TL= (0..7)
0 120 120 120 120 120 120 120 
##$TP= (0..7)
150 150 150 150 150 150 150 150 
##$TP07= 0
##$TPNAME0= <>
##$TPNAME1= <>
##$TPNAME2= <>
##$TPNAME3= <>
##$TPNAME4= <>
##$TPNAME5= <>
##$TPNAME6= <>
##$TPNAME7= <>
##$TPOAL= (0..7)
0.5 0.5 0.5 0.5 0.5 0.5 0.5 0.5 
##$TPOFFS= (0..7)
0 0 0 0 0 0 0 0 
##$TUNHIN= 0
##$TUNHOUT= 0
##$TUNXOUT= 0
##$USERA1= <user>
##$USERA2= <user>
##$USERA3= <user>
##$USERA4= <user>
##$USERA5= <user>
##$V9= 5
##$VALIST= <valist>
##$VCLIST= <CCCCCCCCCCCCCCC>
##$VD= 0
##$VDLIST= <DDDDDDDDDDDDDDD>
##$VPLIST= <PPPPPPPPPPPPPPP>
##$VTLIST= <TTTTTTTTTTTTTTT>
##$WBST= 1024
##$WBSW= 4
##$XGAIN= (0..3)
0 0 0 0 
##$XL= 0
##$YL= 0
##$YMAX_a= 166527
##$YMIN_a= -131567
##$ZGOPTNS= <>
##$ZL1= 120
##$ZL2= 120
##$ZL3= 120
##$ZL4= 120
##$ABSF1= 0
##$ABSF2= 0
##$ABSG= 0
##$ABSL= 0
##$ALPHA= 0
##$AQORDER= 0
##$ASSFAC= 0
##$ASSFACI= 0
##$ASSFACX= 0
##$ASSWID= 0
##$AUNMP= <proc_1d>
##$AZFE= 0.1
##$AZFW= 0.1
##$BCFW= 0
##$BC_mod= 2
##$BYTORDP= 0
##$COROFFS= 0
##$CY= -3
##$DATMOD= 1
##$DC= 0
##$DFILT= <>
##$DTYPP= 0
##$F1P= 0
##$F2P= 0
##$FCOR= 1
##$FTSIZE= 16384
##$FT_mod= 6
##$GAMMA= 0
##$GB= 0
##$INTBC= 1
##$INTSCL= 3.241238e-09
##$ISEN= 128
##$LB= 0.25
##$LEV0= 0
##$LPBIN= 0
##$MAXI= 10000
##$MC2= 0
##$MEAN= 0
##$ME_mod= 0
##$MI= 1.114404
##$NCOEF= 0
##$NC_proc= -7
##$NLEV= 6
##$NOISF1= 3.799351
##$NOISF2= 2.8
##$NSP= 0
##$NTH_PI= 0
##$NZP= 0
##$OFFSET= 15.49017
##$PC= 1
##$PHC0= -5312.553
##$PHC1= 20.22191
##$PH_mod= 1
##$PKNL= yes
##$PPARMOD= 0
##$PSCAL= 0
##$PSIGN= 0
##$REVERSE= no
##$SF= 200.130006309422
##$SI= 16384
##$SIGF1= 3
##$SIGF2= 2
##$SINO= 0.751879
##$SIOLD= 32768
##$SREGLST= <19F.Aceton>
##$SSB= 0
##$STSI= 16384
##$STSR= 0
##$SW_p= 3612.71676300578
##$SYMM= 0
##$S_DEV= 0
##$TDeff= 16384
##$TDoff= 0
##$TI= <>
##$TILT= no
##$TM1= 0
##$TM2= 0
##$TOPLEV= 0
##$USERP1= <user>
##$USERP2= <user>
##$USERP3= <user>
##$USERP4= <user>
##$USERP5= <user>
##$WDW= 1
##$XDIM= 16384
##$YMAX_p= 488859554
##$YMIN_p= -780734
$$ End of Bruker specific parameters
$$ ---------------------------------
##NTUPLES= NMR SPECTRUM
##VAR_NAME=  FREQUENCY,     SPECTRUM/REAL,   SPECTRUM/IMAG
##SYMBOL=    X,             R,               I
##VAR_TYPE=  INDEPENDENT,   DEPENDENT,       DEPENDENT
##VAR_FORM=  AFFN,          ASDF,            ASDF
##VAR_DIM=   16384,         16384,           16384
##UNITS=     HZ,            ARBITRARY UNITS, ARBITRARY UNITS
##FACTOR=    0.220516191357247, 1,           1
##FIRST=     3100.04772480158, 0,            0
##LAST=      -512.669038204198, 0,           0
##MIN=       -512.669038204198, -780734,     0
##MAX=       3100.04772480158, 488859554,    0
$$ Real data points
##PAGE= N=1
##DATA TABLE= (X++(R..R)), XYDATA
$$ [...]
7559H73379j1219q1770p7281m2262j92272N7575J33779O6348L4145n4732O2p3192
$$ 873379 862160 780390 703109 660847 468575 526150 659929 726277 760422 705690 705752 632560
7547F32560k1116K9896M1848j13496o5722M1225J2369K16952J27579o8703j43045
$$ 632560 611444 641340 683188 569692 503970 545195 557564 774516 902095 833392 690347
7536F90347j18020J06949j3814l9463o9486l8000j04610r373J15674J53240M9982
$$ 690347 572327 679276 665462 625999 556513 518513 413903 404530 520204 673444 723426
7525G23426j35626o9312j17427J81828m4480J98177j85633j38965j26988L53600
$$ 723426 587800 518488 401061 582889 538409 736586 550953 411988 285000 638600
7515F38600k9885J29216j80801O2113k34461J20177N75J29887o691M9003k79263
$$ 638600 608715 737931 557130 619243 384782 504959 505534 635421 628730 677733 398470
7504C98470O7265J31935N3781K2047j97191j26328J17193J32945j5635l2583l0844
$$ 398470 465735 597670 651451 673498 476307 349979 467172 600117 584482 551899 521055
7493E21055m1087J7876N4269j1069j5419j09482N5999p636J22706J16900J09627
$$ 521055 479968 497844 552113 541044 525625 416143 472142 464506 587212 704112 813739
7482H13739j92175j34295j60470Q4152p7066J62483R9172M4243P2455Q7636j20142
$$ 813739 621564 487269 326799 410951 333885 496368 595540 639783 712238 799874 679732
7471F79732Q6600j75568m4092j4912N015Q8176o5364j12339j63919K55862q6167
$$ 679732 766332 590764 546672 531760 536775 624951 559587 447248 283329 539191 453024
7460D53024J56928o9349o7966j57215K6561p3563J23396J30885j8576J6116j85656
$$ 453024 609952 540603 472637 315422 341983 268420 391816 522701 504125 520241 334585
7449C34585K76789P5242Q5450l20995j4485n6383j5538J12628J88904k39805k6111
$$ 334585 611374 686616 772066 451071 436586 380203 364665 477293 666197 426392 400281
7438D00281M4481J26122j04607P3383k0033n1610k00981J09217J82447K56101
$$ 400281 444762 570884 466277 539660 519627 468017 267036 376253 558700 814801
7428H14801j29397n7368j96482P725J94698K18230j60122k9497k19918n2212J96815
$$ 814801 685404 628036 431554 439279 633977 852207 692085 662588 442670 390458 587273
7417E87273K239J82953j22018l6796j19892m3570M4290K64579k0890j31979m7809
$$ 587273 589512 772465 650447 613651 493759 450189 494479 759058 738168 606189 558380
7406E58380j2240J3010K38930n7728M7855j86153L4554K88144O2115q1667J56217
$$ 558380 546140 559150 798080 740352 788207 602054 636608 924752 986867 905200 1061417
7395A061417m8430K84290K37751k2055l7334j57075Q9946k71008r4347j64838
$$ 1061417 1012987 1297277 1535028 1512973 1475639 1318564 1408510 1137502 1043155 878317
7385H78317r098j00630N9674j77394j8455J12252L0870k01193m7153J44966J5478
$$ 878317 869219 768589 828263 650869 632414 744666 775536 574343 527190 672156 687634
7374F87634J46401j1114j04139J7663M355j0886J68486o5621k48845r8698R8070
$$ 687634 834035 822921 718782 736445 740800 729914 898400 832779 583934 485236 583306
7363E83306J07166O4344r7989k6555Q3857J36516p4635R6922K43597M241l59062
$$ 583306 690472 754816 656827 630272 714129 850645 776010 872932 1116529 1120770 761708
7352G61708j14354q1176J45609O7928J1203l06256o8143K27382J52583K3772l1543
$$ 761708 647354 566178 711787 779715 790918 484662 416519 643901 796484 820256 788713
7341G88713n371j27775J8882Q6858l6644l9884o1803j44533j10473L08992J49105
$$ 788713 783342 655567 674449 761307 724663 684779 622976 478443 367970 676962 826067
7330H26067J84071j03826j89361q4215O7465J62101k37369M5204Q3610l4856l3907
$$ 826067 1010138 906312 716951 632736 700201 862302 624933 670137 753747 718891 684984
7319F84984n850Q9116o3238N274m5118N7371O0108K9098k37801K5969O3529J11815
$$ 684984 679134 768250 705012 710286 665168 722539 782647 811745 573944 599913 663442 775257
7307G75257J02935M629q2051j74208j1062L500L19443P4240K8489k67986j11543
$$ 775257 878192 882821 800770 626562 615500 619000 938443 1012683 1041172 773186 661643
7296F61643o2449K45111K73761j50951j86641q3070J3028K17362J35776J3741
$$ 661643 599194 844305 1118066 967115 780474 697404 710432 927794 1063570 1077311
7286A077311k41984n8114r36R3214J00121J89616k12652k19857O5470J29173P1149
$$ 1077311 835327 777213 776277 869491 969612 1159228 946576 726719 792189 921362 992511
7275I92511p5812o4772j15764K19080l1647l3885k318P0912j22063K49594P00
$$ 992511 916699 851927 736163 955243 923596 889711 887393 958305 836242 1085836 1086536
7264A086536J9251j9733o5567p8887L2418J27003o4707o2494J7866j40080R0575
$$ 1086536 1105787 1086054 1020487 941600 974018 1101021 1036314 973820 991686 851606 942181
7253I42181O5428K58033q6539J6420k54329J26029J56324J52144o2680j79106
$$ 942181 1007609 1265642 1179103 1195523 941194 1067223 1223547 1375691 1313011 1133905
7243A133905M3422K93940J80681j80001R9674P749q304j29079K31879o13J56600
$$ 1133905 1177327 1471267 1651948 1471947 1571621 1579370 1571066 1441987 1673866 1673253 1829853
7232A829853j22148k02948j48357j37886M4104J37007M6205j60593p6957R0085
$$ 1829853 1707705 1504757 1356400 1218514 1262618 1399625 1445830 1285237 1208280 1298365
7222A298365K61635J85195j38179j33850j20933K5637J51754l5384J06959J75279
$$ 1298365 1560000 1745195 1607016 1473166 1352233 1377870 1529624 1494240 1601199 1776478
7212A776478j40400j4607j0029K8852l4224J38899Q1713l2711j365K05999Q1644
$$ 1776478 1636078 1621471 1611442 1640294 1606070 1744969 1826682 1793971 1792606 1998605 2080249
7201B080249j4419J25616l8438k5769L07910K2754p8283N9562J84388P1388J64396
$$ 2080249 2065830 2191446 2153008 2127239 2435149 2457903 2379620 2439182 2623570 2694958 2859354
7190B859354l1568Q8379q3804J58370J23175K66672K2424N3480L5323L05390J99795
$$ 2859354 2827786 2916165 2832361 2990731 3113906 3380578 3403002 3456482 3491805 3797195 3996990
7179C996990M20078J31262L79045m0340J08568J83722N10903L50045J95263J11321
$$ 3996990 4417068 4548330 4927375 4887035 4995603 5179325 5690228 6040273 6235536 6346857
7169F346857L14164M23753N69585N93157N18167L60739K21067L86932M93738O58861
$$ 6346857 6661021 7084774 7654359 8247516 8765683 9126422 9347489 9734421 10228159 10887020
7159A0887020N80895K54320J29795Q6270J32670J16316j87497k49496m01947l48411
$$ 10887020 11467915 11722235 11852030 11938300 12070970 12187286 11999789 11750293 11348346 10999935
7149A0999935n04220l72009n22867m70688o98501n54188m71950l03269n00770
$$ 10999935 10495715 10123706 9600839 9130151 8431650 7877462 7405512 7102243 6601473
7140F601473m85790n71344j70802k17183q7715k77465k00994k33762j36659k90478
$$ 6601473 6115683 5544339 5373537 5156354 5068639 4791174 4590180 4356418 4219759 3929281
7130C929281j65284k59966k01007l76432j79886k37288K97251r5202j29858k41689
$$ 3929281 3763997 3504031 3303024 2926592 2746706 2509418 2806669 2711467 2581609 2339920
7120B339920j67667r3680J36324j5116n4380l60464n4237N0421J15807N2033N0653
$$ 2339920 2172253 2078573 2214897 2199781 2145401 1784937 1730700 1781121 1896928 1948961 1999614
7109A999614j61609j01507n0498o1204J83263P2517j27944j74142K4353K45487
$$ 1999614 1838005 1736498 1686000 1624796 1808059 1880576 1752632 1578490 1602843 1848330
7099A848330L61445P3654o2236j58535J01934r5273j84132P2365k07666r5108
$$ 1848330 2209775 2283429 2221193 2062658 2164592 2069319 1885187 1957552 1749886 1654778
7089A654778k43077j79992n3137M4619j03920j26195J9093p1666N1535J50927
$$ 1654778 1411701 1231709 1178572 1223191 1119271 993076 1012169 940503 992038 1142965
7079A142965k0990k20493j06915J11028J07490R093p9575k3304l6771J01780j1671
$$ 1142965 1121975 901482 794567 905595 1013085 1022178 942603 919299 882528 984308 972637
7068I72637q579m3754M4349j60310m2762J14622m6978M4065j06661J09372j47407
$$ 972637 964058 920304 964653 804343 761581 876203 829225 873290 766629 876001 728594
7057G28594J89931m492R7346k79007p875j86884K59702O0001K5444j19630k04519
$$ 728594 918525 914033 1011379 732372 724497 537613 797315 857316 882760 763130 558611
7046E58611J1712R1149L2110R9239k7724j4364k62714P2865J75607P3050R814
$$ 558611 570323 661472 693582 792821 765097 750733 488019 560884 736491 809541 819355
7035H19355Q599k56043l596K49781J95914J32382j46806j32248j29215L23155
$$ 819355 827954 571911 568315 818096 1014010 1146392 999586 867338 738123 1061278
7025A061278k9488P6564k59621n157j57726k075J48118M5746j28073o1368R4733
$$ 1061278 1031790 1108354 848733 843576 685850 683775 831893 877639 749566 688198 782931
7014G82931j03948K26021R4104N5076r7287j4896K6707J56706m5166j86846M5702
$$ 782931 678983 905004 999108 1054184 956897 942001 968708 1125414 1080248 893402 939104
7003I39104j35318k01089P1482j25147J02180k0007J55501k12925J64516n2192
$$ 939104 803786 602697 674179 549032 651212 631205 786706 573781 738297 686105
6993F86105J09732l9954J54391q1528J4141J1571m4927j4685q9316K6276J28775
$$ 686105 795837 755883 910274 828746 842887 854458 809531 794846 705530 731806 860581
6982H60581O8164j35290j29493n2208Q997J64074J36444p7980j43228j32857J444
$$ 860581 928745 793455 663962 611754 620751 784825 921269 843289 700061 567204 568648
6971E68648M3310J10519J1558l3319k05535J19862m2464K55728n9922N6283k05896
$$ 568648 611958 722477 734035 700716 495181 615043 572579 828307 768385 824668 618772
6960F18772m4740P8690J68170l3967L3173r7692j87583J80185K02836K5735q9075
$$ 618772 574032 652722 820892 786925 820098 722406 534823 715008 917844 943579 854504
6949H54504n312j30674j40199R4459n1626J29988N8730j41605p0174J35542p580
$$ 854504 849192 718518 578319 672778 621152 751140 809870 668265 598091 733633 726053
6938G26053R2044o549k4869j49536M5459J43374q6496j9399k5719p5321J04371
$$ 726053 818097 811548 786679 637143 682602 825976 739480 720081 694362 619041 723412
6927G23412P1504J20082j41618l162j22313M9709j8997J24297p4358j77182L4377
$$ 723412 794916 914998 773380 770218 647905 697614 678617 802914 728556 551374 585751
6916E85751M8229Q7929j17470M9052q827J00284j76332K3173m2711J58309J87000
$$ 585751 633980 721909 604439 653491 644664 744948 568616 591789 549078 707387 894387
6905H94387J1109n0183q6024J38636p8001L2920m9265J4806J24419m3313K6928
$$ 894387 905496 855313 769289 907925 829924 862844 813579 828385 952804 909491 936419
6894I36419j56648J4683O7450L9784p3465J17657K7859j26446j28966k6410J29731
$$ 936419 779771 794454 861904 901688 828223 945880 973739 847293 718327 691917 821648
6883H21648J163Q5872k53225J92742l4710J32710j93841J7363p8727m8552J33211
$$ 821648 822811 908683 655458 848200 813490 946200 752359 769722 690995 642443 775654
6872G75654K2676O5468l01253J71425M7997J19558k4746M5099j34891k6897n7163
$$ 775654 798330 863798 562545 733970 781967 901525 876779 921878 786987 760090 702927
6861G02927P2263J39199L0098J8130j61305r4710L3729P2435J12056j32397J7726
$$ 702927 775190 914389 944487 962617 801312 706602 740331 812766 924822 792425 810151
6850H10151r9744K55306k9386L1851j33755M7192j89023N840M706P6981K23339
$$ 810151 710407 965713 936327 968178 834423 881615 692592 698432 703138 780119 1003458
6839A003458J0012j22596q5091K51578n2027R7214k64946O4641j02084L2875r5146
$$ 1003458 1013470 890874 805783 1057361 1005334 1102548 837602 902243 800159 833034 737888
6828G37888J17742M1246J00135j19344K8900M972n6203m5553m540q2412Q9925
$$ 737888 855630 896876 997011 877667 906567 911539 855336 809783 805243 722831 812756
6817H12756O600J08787R2053L9725q7485k06784p617r7536K01342K6106q8511
$$ 812756 819356 928143 1020196 1059921 972436 765652 758035 660499 861841 887947 799436
6806G99436M265P1777q4453J54252M3103N7812q7250j36915J16831k0150o8386
$$ 799436 803701 875478 791025 945277 988380 1046192 958942 822027 938858 918708 850322
6795H50322Q4247O7961J14156l9276J00719j49389J79443q8271k9128L4993n9644
$$ 850322 934569 1002530 1116686 1077410 1178129 1028740 1208183 1119912 1090784 1125777 1066133
6784A066133r1003k3038J95205r5083k3971j53418M3252n5671J45799r4728K941
$$ 1066133 975130 952092 1147297 1052214 1028243 874825 918077 862406 1008205 913477 916418
6773I16418J07291L229r9436r7487N2224O7203J04766j40895j54925p6206J61810
$$ 916418 1023709 1026938 927502 830015 882239 949442 1054208 913313 758388 682182 843992
6762H43992P6244Q4968r8925P4478o5345J01250n4991N9508j5912n8004j55596
$$ 843992 920236 1005204 906279 980757 915412 1016662 961671 1021179 1005267 947263 791667
6751G91667J21214j63633K99651l8905R2216k06937L1596p5285Q2888M1518J18154
$$ 791667 912881 749248 1048899 1009994 1102210 895273 926869 851584 934472 975990 1094144
6740A094144J17263k39738J28649l4156L9285k4642J58035K8899j24105l03035
$$ 1094144 1211407 971669 1100318 1066162 1105447 1080805 1238840 1267739 1143634 840599
6730H40599J890M0254J73068o5640K2r635J72132j01128K34476j8944O9270j54660
$$ 840599 842489 882743 1055811 990171 990193 980558 1152690 1051562 1286038 1267094 1336364 1181704
6718A181704j39720j246j10973P6543J39313j67115j66091Q1934K19707O7113
$$ 1181704 1041984 1040738 929765 1006308 1145621 978506 812415 894349 1114056 1181169
6708A181169j57642L5714k7136K1895K7379l9102J61926L0138j32878k3671J95923
$$ 1181169 1023527 1059241 1032105 1054000 1081379 1042277 1204203 1234341 1101463 1077792 1273715
6697A273715K53529O9012k7049m9221m5542j18584j8981n4093l9797N216m7073
$$ 1273715 1527244 1596256 1569207 1519986 1474444 1355860 1336879 1282786 1242989 1248205 1201132
6686A201132k7877M1073J28066j06854o6933j57637J35374q3033K55715J8194
$$ 1201132 1173255 1214328 1342394 1235540 1168607 1010970 1146344 1063311 1319026 1337220
6676A337220J19105k9454J30067p3591N6512K03161O4809N9217O4454k25613j60431
$$ 1337220 1456325 1426871 1556938 1483347 1539859 1743020 1807829 1867046 1931500 1705887 1545456
6665A545456J58733l0679q5753j62449o8681P0260j91833Q4733p5633j0532J95684
$$ 1545456 1704189 1673510 1587757 1425308 1356627 1426887 1235054 1319787 1244154 1233622 1429306
6654A429306K7336k3044J6324J57988o6011K5212p6525O2056m5549Q368J51351
$$ 1429306 1456642 1433598 1449922 1607910 1541899 1567111 1490586 1552642 1507093 1515461 1666812
6643A666812m2106q4863J75795o4779k19429q2997r5321L6733L2552M4442N3897
$$ 1666812 1624706 1539843 1715638 1650859 1431430 1348433 1253112 1289845 1322397 1366839 1420736
6632A420736P7914j298J05923j45924q4000K3859J03055O1345o7356J76762r0912
$$ 1420736 1498650 1497352 1603275 1457351 1373351 1397210 1500265 1561610 1494254 1671016 1580104
6621A580104p0616L8213l7227j0662j1224K04366q8076m74k6308j3926R3166M4211
$$ 1580104 1509488 1547701 1510474 1499812 1488588 1692954 1604878 1604404 1578096 1564170 1657336 1701547
6609A701547J52179j35303m0299O8427K75985j64533j30862j48591J76350r5826
$$ 1701547 1853726 1718423 1678124 1746551 2022536 1858003 1727141 1578550 1754900 1659074
6599A659074R5464J3221P4218j49147n3986J8444K31712P5993l1389j88061k4513
$$ 1659074 1754538 1767759 1841977 1692830 1638844 1657288 1889000 1964993 1933604 1745543 1721030
6588A721030J23786J12996K03210K89322o1126k62448j2391K34625J51474R2391
$$ 1721030 1844816 1957812 2161022 2450344 2389218 2126770 2114379 2349004 2500478 2592869
6578B592869o3227j85431j50818k6865k7427N9407J27849j05866r9356m5292J7660
$$ 2592869 2529642 2344211 2193393 2166528 2139101 2198508 2326357 2220491 2121135 2075843 2093503
6567B093503K23117O0171R5575J5978J700J73282K09322J17655M30145J78797
$$ 2093503 2316620 2376791 2472366 2488344 2490044 2663326 2872648 2990303 3420448 3599245
6557C599245J31862M31959M83412O85750P01991P39128O84025L22982o5604n16201
$$ 3599245 3731107 4163066 4646478 5332228 6034219 6773347 7457372 7780354 7714750 7198549
6547G198549o06517r46533o93846m70592m76770n01595j66113k03743p1678P9289
$$ 7198549 6592032 5645499 4951653 4481061 4004291 3502696 3336583 3132840 3061162 3140451
6537C140451J14838m0581j7725m0403j17455J86309j29935j74423n8389k10797
$$ 3140451 3255289 3214708 3196983 3156580 3039125 3225434 3095499 2921076 2862687 2651890
6527B651890j95924l4006j2877r0217j15177j0711j8847J17707j6748K55261j52872
$$ 2651890 2455966 2421960 2409083 2318866 2203689 2192978 2174131 2291838 2275090 2530351 2377479
6516B377479j54591n6631R7044K4290J07219j91961Q1240k48433J26376M3253
$$ 2377479 2222888 2166257 2263301 2287591 2394810 2202849 2284089 2035656 2162032 2205285
6506B205285K22566j91735O549p8332o3088O1407Q8274J85114j01257j28346j7586
$$ 2205285 2427851 2236116 2242665 2164333 2101245 2162652 2250926 2436040 2334783 2206437 2188851
6495B188851n7093J35201N8472O3656m0334l9222j52782R2348K4863K6963l6023
$$ 2188851 2131758 2266959 2325431 2389087 2348753 2309531 2156749 2249097 2273960 2300923 2264900
6484B264900L3581M9064O089M0390M7435n2810k0250Q7294L3128Q2466j5285m8299
$$ 2264900 2298481 2347545 2353634 2394024 2441459 2388649 2368399 2455693 2488821 2571287 2556002 2507703
6472B507703j06407P3710P5505J62552K4269q984n4674n5559J21991M0291N5890
$$ 2507703 2401296 2475006 2550511 2713063 2737332 2728348 2673674 2618115 2740106 2780397 2836287
6461B836287k17986Q390Q554R1550J05119K06392m3904j85192r8077R3081J39904
$$ 2836287 2618301 2626691 2635245 2726795 2831914 3038306 2994402 2809210 2711133 2804214 2944118
6450B944118J66643j9728j51782j04431M070K41902J23246j6494j33929j14051
$$ 2944118 3110761 3091033 2939251 2834820 2838890 3080792 3204038 3187544 3053615 2939564
6440B939564K32359K74056R6356j3261o1746L9719j19263L5462J08182J03873
$$ 2939564 3171923 3445979 3542335 3529074 3467328 3507047 3387784 3423246 3531428 3635301
6430C635301k04616J37716l8733Q6067j28768J83087j8171K46335k1221R8214
$$ 3635301 3430685 3568401 3529668 3615735 3486967 3670054 3651883 3898218 3876997 3975211
6420C975211J12276Q1372P1439O5277N7082J02928m6424k1052l8256R012N891
$$ 3975211 4087487 4168859 4240298 4305575 4362657 4465585 4419161 4398109 4359853 4368865 4374756
6409D374756J55271K50243N2802j12578R7963q5817J40613J95039J92635p7510
$$ 4374756 4530027 4780270 4833072 4720494 4818457 4732640 4873253 5068292 5260927 5183417
6399E183417J59265O2414J83165K89917J70565M0525m6244K8179K98060Q0406
$$ 5183417 5342682 5405096 5588261 5878178 6048743 6089268 6043024 6071203 6369263 6449669
6389F449669J81312R4933o0590r8438L06498J97012L52880J59830J55518P0868
$$ 6449669 6630981 6725914 6665324 6566886 6873384 7070396 7423276 7583106 7738624 7809492
6379G809492M30684N46828L46459L13196L50544K53464M33505M16817N06036O34644
$$ 7809492 8240176 8787004 9133463 9446659 9797203 10050667 10484172 10900989 11407025 12041669
6369A2041669P01261J017794J435983K233392K452590K251710R44735k387o01756
$$ 12041669 12742930 13760724 15196707 17430099 19882689 22134399 23079134 23076747 22474991
6360B2474991m92737m02115L77770P80189J585031K291138K484634J827772N79313
$$ 22474991 21982254 21580139 21957909 22738098 24323129 26614267 29098901 30926673 31505986
6351C1505986l81397n86155o03673M01838J085398J657331J254844K55599o97146
$$ 31505986 31124589 30538434 29934761 30336599 31421997 33079328 34334172 34589771 33892625
6342C3892625q19677p61202n0523M18255J334888K402147M098586N859823Q497848
$$ 33892625 33072948 32311746 32261223 32679478 34014366 36416513 40515099 46374922 54872770
6333E4872770J1367325J3422318J1787926O414710j413194q316976j1903815j1856674
$$ 54872770 66240095 79662413 91450339 97865049 96451855 88134879 76231064 64374390
6325F4374390r942749p227085m763096k780652j200448L27595J440043L182495
$$ 64374390 54431641 47204556 42441460 39660808 38460360 38787955 40227998 43410493
6317D3410493M943661P653928J0077169J1345484R963577P548302M862536K870514
$$ 43410493 48354154 56008082 66085251 77430735 87394312 94942614 99805150 102675664
6309A02675664o13180n409969r799578j1880731j1556411r871399p909445n923413
$$ 102675664 102062484 96652515 86852937 74972206 63415795 53544396 45634951 39711538
6301C9711538l969371k585837j437328p79877J75213N72697J002301J697833K554194
$$ 39711538 35742167 33156330 31719002 30939125 31114338 31687035 32689336 34387169 36941363
6292C6941363L546997M993742O509368Q827852J0643469J1201430R100556N697988
$$ 36941363 40488360 45482102 51991470 60819322 71462791 82664221 91764777 97462765
6284I7462765J898162o88373m138691p287727r867452j0233478r723889p876949
$$ 97462765 99360927 98672554 94533863 87246136 77378684 67145206 57421317 49544368
6276D9544368o110174l960958k373683p88492K27098J597011K920993N409341
$$ 49544368 43434194 39473236 37099553 36311061 36538159 38135170 41056163 46465504
6268D6465504Q534971J0849173J0987571P884828K286482l902942q580487j0306063
$$ 46465504 55000475 65849648 76837219 84722047 87008529 83105587 74525100 64219037
6260F4219037j0245855q880930o930882n303998l667226k184591j016257K6647
$$ 64219037 53973182 45092252 38161370 32857372 29190146 27005555 25989298 26015945
6252B6015945P72149J090650P15325k02725r76794j328649j023958n03622K35837
$$ 26015945 26788094 27878744 28594069 28391344 27414550 26085901 25061943 24558321 24794158
6243B4794158N60459L50441n34717j434506j939106j926563j593383j260977m32296
$$ 24794158 25354617 25705058 25170341 23735835 21796729 19870166 18276783 17015806 16583510
6234A6583510q4246Q28710N06146L9003j008788j627829k030792j803555j472715
$$ 16583510 16499264 17327974 17834120 17873123 16864335 15236506 13205714 11402159 9929444
6225I929444j222562r83676p83381o61112n24963k78555l28098k0067k31949j86221
$$ 9929444 8706882 7723206 6939825 6278713 5753750 5475195 5147097 5127030 4895081 4708860
6215D708860l82877j59632r0886Q4020r8512k7857r1903j11055j12755J05317
$$ 4708860 4325983 4166351 4075465 4159485 4060973 4033116 3941213 3830158 3717403 3822720
6205C822720l1388o3148l06279l8636k52891K24246j60910J66296j84392j6332
$$ 3822720 3791332 3728184 3421905 3383269 3130378 3354624 3193714 3360010 3175618 3159286
6195C159286j80696K55408K46813K83569r6813j28018j59572m2673P2677p4883
$$ 3159286 2978590 3233998 3480811 3764380 3667567 3539549 3379977 3337304 3409981 3335098
6185C335098o9360j15186n6039j20049M8683o8301R3392j10848J381r5351j5170
$$ 3335098 3265738 3150552 3094513 2974464 3023147 2954846 3048238 2937390 2938771 2843420 2828250
6174B828250k47181M2185k2195o4601O2809J56377j29892j35693j9486J03125
$$ 2828250 2581069 2623254 2601059 2536458 2599267 2755644 2625752 2490059 2470573 2573698
6164B573698j66055L3270P6077P6906r7144J5064k0721k4947n9981K1391q6663
$$ 2573698 2407643 2440913 2516990 2593896 2496752 2511816 2491095 2466148 2406167 2427558 2340895
6153B340895j26860L72324O0868J13922q7573j7575k51770p2614n3760m8490j77562
$$ 2340895 2214035 2586359 2647227 2761149 2673576 2656001 2404231 2331617 2277857 2229367 2051805
6142B051805k94438k80291j03030R0278J24187k21204j0121j74365j33665J12690
$$ 2051805 1757367 1477076 1374046 1464324 1588511 1367307 1357186 1182821 1049156 1161846
6132A161846o6507J23011r4816k01786j57036J10340n344Q6772L7867L8940o7660
$$ 1161846 1095339 1218350 1123534 921748 764712 875052 869708 956480 994347 1033287 965627
6121I65627J1850n9480J56336j30009O2293j3180j27456l9834J45223m8113l9203
$$ 965627 977477 917997 1074333 944324 1006617 993437 865981 826147 971370 923257 884054
6110H84054j29468O6284L760J83235n4433O1560j6073j32376O6695R0428J068
$$ 884054 754586 820870 824630 1007865 953432 1014992 998919 866543 933238 1023666 1024734
6099A024734j9017J8502j64493P7722P1578K10068j66961R1454J4021Q5640j2151
$$ 1024734 1005717 1024219 859726 937448 1009026 1219094 1052133 1143587 1157608 1243248 1231097
6088A231097j39543j25552N7742J05749l9788J48329l2262q7883n6260k3238p0915
$$ 1231097 1091554 966002 1023744 1129493 1089705 1238034 1205772 1117889 1061629 1038391 967476
6077I67476J09472M4924q0604o0143j36077J27275J35620N8077n8260j69049j2232
$$ 967476 1076948 1121872 1041268 981125 845048 972323 1107943 1166020 1107760 938711 926479
6066I26479L54933J33809k3350k0377j05472M6012P687J40381R6974O951j07867
$$ 926479 1281412 1415221 1391871 1371494 1266022 1312034 1319721 1460102 1557076 1564027 1456160
6055A456160p6450L6491M9759J00917l1927J26673j21256R2904J11527J63119
$$ 1456160 1379710 1416201 1465960 1566877 1534950 1661623 1540367 1633271 1744798 1907917
6045A907917j18575J04299j12556M3842m0619J49604J10740j24032k30155L55
$$ 1907917 1789342 1893641 1781085 1824927 1784308 1933912 2044652 1920620 1690465 1690820
6035A690820k2346j04328N4745R9651P6055n5292o1336L4668J30144j07278j42732
$$ 1690820 1668474 1564146 1618891 1718542 1794597 1739305 1677969 1712637 1842781 1735503 1592771
6024A592771j38868n4617J17879K20306o8046J04348M7678R3082J95339K58441
$$ 1592771 1453903 1399286 1517165 1737471 1669425 1773773 1821451 1914533 2109872 2368313
6014B368313Q3366j3559j60713L5743j22623R4672n7324j62279j97810j29746
$$ 2368313 2451679 2438120 2277407 2313150 2190527 2285199 2227875 2065596 1867786 1738040
6004A738040o3213J3252J5455M5619J02762k05527l9715R1671M8785j36831M9275
$$ 1738040 1674827 1688079 1703534 1749153 1851915 1646388 1606673 1698344 1747129 1610298 1659573
5993A659573N3165N8497J52539N5718k7508J68466K95503R8270K28530N3595P5562
$$ 1659573 1712738 1771235 1923774 1979492 1951984 2120450 2415953 2514223 2742753 2796348 2871910
5982B871910J31367K72431K3640N2959j90908q8578k17185J80018M2975J91640
$$ 2871910 3003277 3275708 3299348 3352307 3161399 3072821 2855636 3035654 3078629 3270269
5972C270269K4048L37212J07657L72553L53089Q92550N95493L25369l5933o6759
$$ 3270269 3294317 3631529 3739186 4111739 4464828 5357378 5952871 6278240 6242307 6175548
5962F175548m02641m31518m42272o83651n61115n74299j80334p1240l4447k65566
$$ 6175548 5772907 5341389 4899117 4215466 3654351 3080052 2899718 2828478 2794031 2528465
5952B528465o8302k54403R2459P672J83513j16679j3640k56861j63238j12450
$$ 2528465 2460163 2205760 2298219 2305891 2489404 2372725 2359085 2102224 1938986 1826536
5942A826536J14272j53447j14051m00137N8155O5807K07335j00046P6806o1550
$$ 1826536 1940808 1787361 1673310 1273173 1331328 1397135 1604470 1504424 1581230 1519680
5932A519680N2348j33602J66048r4j24236j13805J01028J12060J30260J14689
$$ 1519680 1572028 1438426 1604474 1604380 1480144 1366339 1467367 1579427 1709687 1824376
5922A824376n2679k5069o0339J02401j41059M6509p0775K3319j71311P8794J11685
$$ 1824376 1771697 1746628 1686289 1788690 1647631 1694140 1623365 1646684 1475373 1554167 1665852
5911A665852M228P3824J04440r472j37089M4168J28331J63379N4258R8098N2555
$$ 1665852 1670080 1743904 1848344 1838872 1701783 1745951 1874282 2037661 2091919 2190017 2242572
5900B242572J65077q4607n0598K1902K26351p7697J53788q2661K07258q9683n3330
$$ 2242572 2407649 2323042 2272444 2294346 2520697 2443000 2596788 2514127 2721385 2631702 2578372
5889B578372j17287P6667o6799j21716j76651l8925K1498m2673o2540j44772j26222
$$ 2578372 2461085 2537752 2470953 2349237 2172586 2133661 2155159 2112486 2049946 1905174 1778952
5878A778952n2117j13983J00977J31263r3163N5501l1803K03417l1708J42413
$$ 1778952 1726835 1612852 1713829 1845092 1751929 1807430 1775627 1979044 1947336 2089749
5868B089749j26332N4709l21724J5474L3645K36206o4785j53617k45956L8292
$$ 2089749 1963417 2018126 1696402 1711876 1745521 1981727 1916942 1763325 1517369 1555661
5858A555661K341K51291Q4495K4237p3280l7908O981K75078K6536j08052j21883
$$ 1555661 1558002 1809293 1893788 1918025 1844745 1806837 1813818 2088896 2115432 2007380 1885497
5847A885497m4131o7529J29656l4124M6866j56166j21448r8877J97482P4515o5677
$$ 1885497 1841366 1773837 1903493 1869369 1916235 1760069 1638621 1539744 1737226 1811741 1746064
5836A746064J78800j97264N9196J9447J50399J04134R6235m5280P5350j31810
$$ 1746064 1924864 1727600 1786796 1806243 1956642 2060776 2157011 2111731 2187081 2055271
5826B055271J06030J29272Q5736K2018J30737J74221O9397j10026j70982J85521
$$ 2055271 2161301 2290573 2376309 2398327 2529064 2703285 2772682 2662656 2491674 2677195
5816B677195l7664q718j44359k2197m8541r1407j6003J21747j5234r4759k38597
$$ 2677195 2639531 2630813 2486454 2464257 2415716 2324309 2308306 2430053 2414819 2320060 2081463
5805B081463l4040J69375K4103J32156J11544k41532o7886r5718J41347j8345
$$ 2081463 2047423 2216798 2240901 2373057 2484601 2243069 2175183 2079465 2220812 2202467
5795B202467M8133j25696j39825j90503L46499J90990J27655k63807j23737p9580
$$ 2202467 2250600 2124904 1985079 1794576 2141075 2332065 2459720 2195913 2072176 1992596
5785A992596P658K51080J31128Q8957q4576l8055n9948J85845J83375J22788j62357
$$ 1992596 2000254 2251334 2382462 2471419 2386843 2348788 2288840 2474685 2658060 2780848 2618491
5774B618491j77460m4822R1544J21580P4801l270j62645l5188J06219J52229K09779
$$ 2618491 2441031 2396209 2487753 2609333 2684134 2680864 2518219 2483031 2589250 2741479 2951258
5763B951258r0501J23922J19183K20949j9485J90065j09975r4488m27938M330
$$ 2951258 2860757 2984679 3103862 3324811 3305326 3495391 3385416 3290928 2862990 2867320
5753B867320j58318K2581n9255L1539j04604J68058r1723j05790k5121J36131
$$ 2867320 2709002 2731583 2672328 2703867 2599263 2767321 2675598 2569808 2544687 2680818
5743B680818R8056Q1263L2555q6514M0956j09760l5461P6514k3502k9404j71545
$$ 2680818 2778874 2860137 2892692 2806178 2847134 2737374 2701913 2778427 2754925 2725521 2553976
5732B553976M7139O0501L73115J48754q9563j40857j14861k7555J10880K58316
$$ 2553976 2601115 2661616 3034731 3183485 3093922 2953065 2838204 2810649 2921529 3179845
5722C179845M3799j46009j25369k9589K35041M23375J97794J12401j57171J07606
$$ 3179845 3223644 3077635 2952266 2922677 3157718 3581093 3778887 3891288 3734117 3841723
5712C841723M26952N57233L35668l4613k52481m37813l04480l1921J25085N2982
$$ 3841723 4268675 4825908 5161576 5126963 4874482 4436669 4132189 4100268 4225353 4278335
5702D278335m7602j77328o6335m4731K99051J38209j47224k0527j33728J45517
$$ 4278335 4230733 4053405 3987070 3942339 4241390 4379599 4232375 4211848 4078120 4223637
5692D223637J30466J78958O2858J52912O3564Q5181K41115L94697K36552J45150
$$ 4223637 4354103 4533061 4595919 4748831 4812395 4897576 5138691 5533388 5769940 5915090
5682E915090M65547Q71823J266284J186995M90000m33412q33105r11554p88297
$$ 5915090 6380637 7252460 8518744 9705739 10195739 9762327 8929222 8017668 7229371
5673G229371n48395n81546k74201l57377M7320J8048r7304q4585j57491J18007
$$ 7229371 6680976 6099430 5825229 5467852 5515172 5533220 5435916 5351331 5193840 5311847
5663E311847M45937J15349N1423q9192N8329J83827J23840M72683K44648J89535
$$ 5311847 5757784 5873133 5924556 5835364 5893693 6077520 6201360 6674043 6918691 7108226
5653G108226L528L75309N08242R69004J182505J283900R70271K58637l61518p36123
$$ 7108226 7111754 7487063 7995305 8964309 10146814 11430714 12400985 12659622 12298104 11561981
5643A1561981n86174q17834n38086n11693j40065J18304J89975J44405p1108J24324
$$ 11561981 10975807 10157973 9619887 9108194 8968129 9086433 9276408 9420813 9349705 9474029
5633I474029N3960M11510M33861K92913K91439J78257L07808L24738N99004L58943
$$ 9474029 9527989 9939499 10373360 10666273 10957712 11135969 11443777 11768515 12367519 12726462
5623A2726462O81517L74327N48194R64140J024871Q38319J325995J268821J384655
$$ 12726462 13407979 13782306 14330500 15294640 16319511 17157830 18483825 19752646 21137301
5614B1137301J145433J003821J012545J148124J499988J502356J979878K282314
$$ 21137301 22282734 23286555 24299100 25447224 26947212 28449568 30429446 32711760
5606C2711760K540613K941222L524778M190451M980643O092945P216838Q363481
$$ 32711760 35252373 38193595 41718373 45908824 50889467 56982412 64199250 72562731
5598G2562731R599018J1357439J2736744J4216934J4321271J3356128J1100949
$$ 72562731 82161749 93519188 106255932 120472866 134794137 148150265 159251214
5591A59251214P616355L096036k153839p121973j0568476j1706037j1683484j1150118
$$ 159251214 166867569 169963605 167809766 160687793 150119317 138413280 126729796 115579678
5583A15579678j0960415j1188480j1435459j1691866j0661346r500228q018504
$$ 115579678 104619263 93430783 81995324 70303458 59642112 50141884 42123380
5576D2123380o445338n177788m312054l370677k887166k148441j551348j391694
$$ 42123380 35678042 30500254 26188200 22817523 19930357 17781916 16230568 14838874
5568A4838874j290989j296853r38708o04593l96394o19168k75292m31744l69968
$$ 14838874 13547885 12251032 11312324 10707731 10311337 9692169 9416877 8985133 8615165
5559H615165m49223k79323k84566l24864m30608l87857k53025q6570j71592j98471
$$ 8615165 8165942 7886619 7602053 7277189 6846581 6458724 6205699 6119129 5947537 5749066
5549E749066k00869r2142j03807j7856R33l58662l32649j16132k23151m714r0951
$$ 5749066 5548197 5456055 5352248 5334392 5335325 4976663 4644014 4527882 4304731 4300017 4209066
5538D209066j64163j90513j2990j85473L4897j6077J736p8448j42815j71081O6785
$$ 4209066 4044903 3854390 3841400 3655927 3690824 3674747 3676483 3598035 3455220 3284139 3350924
5527C350924p3068j6384l58430j97849k932Q8347K2335J47726k92756m5154k60193
$$ 3350924 3277856 3261472 2903042 2705193 2702261 2790608 2812943 2960669 2667913 2622759 2362566
5516B362566Q9686j40018L02567k32260j26519j10055J59771j20648J06430n3410
$$ 2362566 2452252 2312234 2614801 2382541 2256022 2145967 2305738 2185090 2291520 2238110
5506B238110o7370j58326K9828J36641O2575q46j62071J5203m2640K25070L4415
$$ 2238110 2170740 2012414 2042242 2178883 2241458 2240612 2078541 2093744 2051104 2276174 2310589
5495B310589j0570j87620O983j69022J62429j19084m223j96402P1660q7524Q3099
$$ 2310589 2300019 2112399 2119382 1950360 2112789 1993705 1989482 1793080 1864740 1777216 1860315
5484A860315p7873J52845j14988L6913j48602P0303j17538J38291j36589j523
$$ 1860315 1782442 1935287 1820299 1857212 1708610 1778913 1661375 1799666 1663077 1661554
5474A661554j43283K18247j0807M0804j68629k924r9546r4129J71687k8093J74967
$$ 1661554 1518271 1736518 1725711 1766515 1597886 1594962 1495416 1401287 1572974 1544881 1719848
5463A719848q0117j58976o2631o3685j1169L23889p9329q3472j8528O8534J07033
$$ 1719848 1639731 1480755 1418124 1354439 1343270 1667159 1587830 1504358 1485830 1554364 1661397
5452A661397K224r3185l226j19323J41248K99949k6168Q1832R5524K30434Q2309
$$ 1661397 1663621 1570436 1567210 1447887 1589135 1889084 1862916 1944748 2040272 2270706 2353015
5441B353015O8308l2212l9645K02457M31967P95601Q27573P56388L42927o36578
$$ 2353015 2421323 2389111 2349466 2551923 2983890 3779491 4607064 5363452 5706379 5069801
5431E069801o38375o32152l77469o66598j45607l67733J8058j08383n8628m0432
$$ 5069801 4431426 3799274 3421805 2755207 2609600 2241867 2259925 2151542 2092914 2052482
5421B052482o6835k5222j5069P7624P7337l3450k28224O8061k6334J7478k92436
$$ 2052482 1985647 1960425 1945356 2022980 2100317 2066867 1838643 1906704 1880370 1897848 1605412
5410A605412N5398Q2161j099j29320J63145q002O4609N45j06499k02829J78649
$$ 1605412 1660810 1742971 1741872 1612552 1775697 1767695 1832304 1832849 1726350 1523521 1702170
5399A702170m3523J98011n8346j52687p5295L1987J5015P7007j81215J7238p6124
$$ 1702170 1658647 1856658 1798312 1645625 1570330 1602317 1617332 1694339 1513124 1530362 1454238
5388A454238N094j87335M4219J55913J709K07850r6585k24474j65801J62883Q6126
$$ 1454238 1459332 1271997 1316216 1472129 1473838 1681688 1585103 1360629 1194828 1357711 1443837
5377A443837J03242m8021n7892j58287J26297k0174L4448n0828n3970r780n0263
$$ 1443837 1547079 1499058 1441166 1282879 1409176 1389002 1423450 1372622 1318652 1308872 1258609
5366A258609m4639J84224O6032q8280l6109m3514N1366P7560N7677j32332j8658
$$ 1258609 1213970 1398194 1464226 1375946 1339837 1296323 1347689 1425249 1482926 1350594 1331936
5355A331936j56188Q5768P63J22202J33235m412j60892k14882l0273K23798J01564
$$ 1331936 1175748 1261516 1262279 1384481 1517716 1513304 1352412 1137530 1107257 1331055 1432619
5344A432619K1547j40387j74732l6027J15074J65823O2255j35069l1146Q1261
$$ 1432619 1454166 1313779 1139047 1103020 1218094 1383917 1446172 1311103 1279957 1361218
5334A361218M8926O0950n8798P9232K9324j02824n3914M5270j43157J62008P3534
$$ 1361218 1410144 1471094 1412296 1491528 1520852 1418028 1364114 1409384 1266227 1428235 1501769
5323A501769k5371j72385N7199k4477J13510q6626l1103J54816J28604K8597j15706
$$ 1501769 1476398 1304013 1361212 1336735 1450245 1363619 1332516 1487332 1615936 1644533 1528827
5312A528827o4035Q8785J85748k67392j6501J14190M0853Q5453k2259J38250q1550
$$ 1528827 1464792 1553577 1739325 1471933 1455432 1569622 1610475 1695928 1673669 1811919 1730369
5301A730369J6048J60009p0542J21049j6226M9104k06832M1689m6636J94123J63577
$$ 1730369 1746417 1906426 1835884 1956933 1940707 1989811 1782979 1824668 1778032 1972155 2135732
5290B135732K19641p201k57573M0737J63801K37454J16344Q578k02405L7642q0181
$$ 2135732 2355373 2348172 2090599 2131336 2295137 2532591 2648935 2657513 2455108 2492750 2412569
5279B412569K76533J42355j95516j76590r8932L4569P3250j12651j32094k2031
$$ 2412569 2689102 2831457 2635941 2459351 2360419 2394988 2468238 2355587 2223493 2201462
5269B201462m2518q2352L6871J46976N8628J001k00248M2032K41182Q629J6304
$$ 2201462 2158944 2076592 2113463 2260439 2319067 2320068 2119820 2161852 2403034 2411663 2427967
5258B427967J15748m0018n9761O7070J38502J21458K29132O6005L10844L5885
$$ 2427967 2543715 2503697 2443936 2511006 2649508 2770966 3000098 3066103 3376947 3412832
5248C412832K09192J1682j14706k12801k57406j80551n4323J72704p7790r4830
$$ 3412832 3622024 3633706 3519000 3306199 3048793 2868242 2813919 2986623 2908833 2814003
5238B814003j49710Q4309J34546K10359k5713J6936k9317P1251J28619M002J90041
$$ 2814003 2664293 2748602 2883148 3093507 3067794 3084730 3055413 3126664 3255283 3259285 3449326
5227C449326K4692j48307M158J72520J52370J17175O3780J10940J24992J63067
$$ 3449326 3474018 3325711 3329869 3502389 3654759 3771934 3835714 3946654 4071646 4234713
5217D234713J75034L55876L75233M81111N45982O57233N36140K02391J2442J09279
$$ 4234713 4409747 4765623 5140856 5621967 6167949 6825182 7361322 7563713 7576155 7685434
5207G685434J7959k96016l75913n18471l32714q5823J04085L17368M16210N14149
$$ 7685434 7703393 7407377 7031464 6512993 6180279 6094456 6198541 6515909 6932119 7446268
5197G446268M25487J58749P9103J2881j04999k01695k14530n62620o79310m83554
$$ 7446268 7871755 8030504 8109607 8122488 8017489 7815794 7601264 7038644 6359334 5875780
5187E875780k54895k71283j34958k34837J62129N01L14906j84411Q5012L4565
$$ 5875780 5620885 5349602 5214644 4979807 5141936 5142437 5457343 5272932 5357944 5392509
5177E392509J80278L14997N05472N11181N93311M52065N00588N25104M61721L66844
$$ 5392509 5572787 5887784 6393256 6904437 7497748 7949813 8450401 8975505 9437226 9804070
5167I804070Q1218j32938M6109K54055M90290P73474Q06734O19339O03853O70613
$$ 9804070 9885288 9752350 9798459 10052514 10542804 11316278 12123012 12742351 13346204 14016817
5157A4016817N35134J43660l42504o75546j149262r39320j341880q44232r64178
$$ 14016817 14551951 14695611 14353107 13677561 12528299 11588979 10247099 9402867 8438689
5148H438689q08867p92076l66253m49810M4807l316J13911P1982n5188K88150
$$ 8438689 7629822 6837746 6471493 6021683 6066490 6063174 6177085 6249067 6193879 6482029
5138F482029P76731R00614Q98365Q00010N67584P30578M75657L61786P6821k34822
$$ 6482029 7258760 8159374 9057739 9857749 10425333 11155911 11631568 11993354 12070175 11835353
5128A1835353m68633p82091o64851m70274n87942o76099p45853n95238n11256
$$ 11835353 11366720 10584629 9919778 9449504 8861562 8185463 7439610 6844372 6333116
5119F333116j29109L7560j94110k29113r5996p0053J05862o2410k04994P9789
$$ 6333116 6204007 6241567 6047457 5818344 5722348 5652295 5758157 5695747 5490753 5570542
5109E570542K9152Q4551j94234K6858N4213K00351m7082n0988j18442K6400Q2127
$$ 5570542 5599694 5684245 5490011 5516869 5571082 5771433 5724351 5673363 5554921 5581321 5663448
5098E663448R8919J17618J40242R6117J49070J5259l223j18023J80958q618j36118
$$ 5663448 5762367 5879985 6020227 6116344 6265414 6280673 6277450 6159427 6340385 6331767 6195649
5087F195649l11554j79569j20788k2526n4789j17870o3200j39840J24229j76006
$$ 6195649 5884095 5704526 5583738 5561212 5506423 5388553 5325353 5185513 5309742 5133736
5077E133736K51087Q5890J46731J5438l4950P2502Q6770P5884K6542p2985k32382
$$ 5133736 5384823 5470713 5617444 5632882 5597932 5670434 5757204 5833088 5859630 5786645 5554263
5066E554263j0399J9502o0605L6323l20589Q7869j80677J59307k6373K03980l1169
$$ 5554263 5543864 5563366 5502761 5539084 5218495 5306364 5125687 5284994 5258621 5462601 5431432
5055E431432J29441j26097n4157J9242K44794P2704j19025r5365k6399O4354L2361
$$ 5431432 5560873 5434776 5380619 5399861 5644655 5717359 5598334 5502969 5476570 5540924 5573285
5044E573285P6469R8906j07470r7182J30533L23421L02477J90892n6652K52505
$$ 5573285 5649754 5748660 5641190 5544008 5674541 5997962 6300439 6491331 6434679 6687184
5034F687184L8134J46766J68415K56705L75621M38329O86656K36092J64675J55472
$$ 6687184 6725318 6872084 7040499 7297204 7672825 8111154 8797810 9033902 9198577 9354049
5024I354049L01669O4165l59192m29062m32453l15611j14453k26696j89291o7026
$$ 9354049 9655718 9719883 9360691 8931629 8499176 8183565 8069112 7842416 7653125 7586099
5014G586099J99635R7633J36984J29334K86869J92139J59639K70845M38643K76198
$$ 7586099 7785734 7883367 8020351 8149685 8436554 8628693 8788332 9059177 9497820 9774018
5004I774018M39605j767j20691K7918L3374K495j47478j12477L0909L8125N6303
$$ 9774018 10213623 10211856 10091165 10119083 10152457 10154952 10007474 9894997 9925906 9964031 10020334
4993A0020334q8538L42570J93142K49353J0926K79121J08116L57539L01201K63585
$$ 10020334 9931796 10274366 10467508 10716861 10727787 11006908 11115024 11472563 11773764 12037349
4983A2037349K11104M95035M77724K92991K87248J91650M16697L52648L74636
$$ 12037349 12248453 12743488 13221212 13514203 13801451 13993101 14409798 14762446 15137082
4974A5137082K73075K71656M67522M23038M25689M27504L51433K83283N09296
$$ 15137082 15410157 15681813 16149335 16572373 16998062 17425566 17776999 18060282 18569578
4965A8569578M01235N61440M92374O34773M47547M82549L52226L22776N86960
$$ 18569578 18970813 19532253 20024627 20659400 21106947 21589496 21941722 22264498 22851458
4956B2851458N37045M01751M24868O49988J038535J052272J086680R44206R50072
$$ 22851458 23388503 23790254 24215122 24865110 25903645 26955917 28042597 28986803 29936875
4947B9936875J071971J338993J314672J546995J649126J861774K005208J986849
$$ 29936875 31008846 32347839 33662511 35209506 36858632 38720406 40725614 42712463
4939D2712463K471677K893634L543469L877177M177137M041180M086499M166766
$$ 42712463 45184140 48077774 51621243 55498420 59675557 63716737 67803236 71970002
4931G1970002M581380N156735O187868P405097Q907603J0170476J1034915J1661085
$$ 71970002 76551382 81708117 87895985 95301082 104208685 114379161 125414076 137075161
4923A37075161J2065383J3141990J4677232J6475198J8217116J8139362J5605201
$$ 137075161 149140544 162282534 176959766 193434964 211652080 229791442 245396643
4916B45396643J0065147L151366m060135r936574j4197065j6142358j5947267
$$ 245396643 255461790 258613156 254553021 244616447 230419382 214277024 198329757
4909A98329757j3918958j1421515j0141221j1285228j3566091j4898599j4608967
$$ 198329757 184410799 172989284 162848063 151562835 137996744 123098145 108489178
4902A08489178j3437666j1662591r764568p718591n908055l960734k987435k194372
$$ 108489178 95051512 83388921 73624353 65905762 59997707 56036973 53049538 50855166
4894E0855166j941346j602878j889637j488014j569847j166581j223598j123272
$$ 50855166 48913820 47310942 45421305 43933291 42363444 41196863 39973265 38849993
4886C8849993j233507o26426m84762j81249k45109m90191m83734j45607J26402
$$ 38849993 37616486 36990060 36505298 36324049 36078940 35588749 35105015 34959408 35085810
4877C5085810N61703N60790M13584J85506J3912l4919l70247o51615r65091j556338
$$ 35085810 35647513 36208303 36621887 36807393 36821305 36786386 36416139 35764524 34799433 33243095
4867C3243095k021657k152467j838167j259127n85396k69385J6204L82510M40179
$$ 33243095 31221438 29068971 27230804 25971677 25386281 25116896 25133100 25515610 25955789
4858B5955789O97803M36069J88898K87700N30710N11151M90423K21725R4096l50713
$$ 25955789 26653592 27089661 27278559 27566259 28096969 28608120 29098543 29320268 29414364 29063651
4848B9063651q40958j422199j745034j999548j762204j716094j548145j590394
$$ 29063651 28222693 26800494 25055460 23055912 21293708 19577614 18029469 16439075
4840A6439075j390660q83958p37055m65404k50374j92451l82799n77660k44057
$$ 16439075 15048415 14164457 13427402 12961998 12711624 12519173 12136374 11558714 11314657
4831A1314657l06389L3599O227K3817l50611k03429l07560K10117O2883j5344
$$ 11314657 11008268 11041867 11048094 11071911 10721300 10517871 10210311 10420428 10483311 10467967
4821A0467967l88308k47341l05384N369K14309l3601j40153j62757j80400J9532
$$ 10467967 10079659 9832318 9526934 9532303 9746612 9713011 9572858 9410101 9229701 9249233
4811I249233J14871K55043Q4536j19309j95269L1663K51761O02206K48154L7000
$$ 9249233 9364104 9619147 9703683 9584374 9389105 9420768 9672529 10274735 10522889 10559889
4801A0559889k29488j34237K14826P1583P6158p3951l9590j32599K84365J70243
$$ 10559889 10330401 10196164 10410990 10482573 10558731 10484780 10445190 10312591 10596956 10767199
4791A0767199J54916J25381J36777K12486Q5844L07694J68995N88795M05431M03741
$$ 10767199 10922115 11047496 11184273 11396759 11482603 11790297 11959292 12548087 12953518 13357259
4781A3357259K27339O06938J34481J23025k76219j75671q6606n720j9074q1254
$$ 13357259 13584598 14191536 14326017 14449042 14172823 13997152 13910546 13904826 13885752 13804498
4771A3804498k53222j49926k8102r9640J9851K29645L21727M54582K52569J10878
$$ 13804498 13551276 13401350 13373248 13273608 13293459 13523104 13844831 14299413 14551982 14662860
4761A4662860K43415L79318K40791M68730M59241K26714J22821O4706O2532L57524
$$ 14662860 14906275 15285593 15526384 15995114 16454355 16681069 16803890 16868596 16931128 17288652
4751A7288652N73485O99620M21298J96999L30120M13147N27864N30692J43409
$$ 17288652 17862137 18561757 18983055 19180054 19510174 19923321 20451185 20981877 21125286
4742B1125286J92481L07705O14239P03553P50542N51055Q12928O79538J069966
$$ 21125286 21317767 21625472 22239711 22943264 23693806 24244861 25057789 25737327 26807293
4733B6807293J081344J495864J404283J311118J336825J594201J663430J954787
$$ 26807293 27888637 29384501 30788784 32099902 33436727 35030928 36694358 38649145
4725C8649145J999112K215827K378828L083665L859307M797418N728561O885858
$$ 38649145 40648257 42864084 45242912 48326577 52185884 56983302 62711863 69597721
4717F9597721P908473R521493J2397705J7572200K7873163N0492870Q7455580
$$ 69597721 77506194 87027687 99425392 116997592 144870755 195363625 282819205
4710B82819205J14546157Q8867918K626274n9469207q5445663p9564272o0014870
$$ 282819205 397365362 486233280 488859554 429390347 343944684 264380412 204365542
4703B04365542m1301570k7642597j6035031p125257K698681J4065662M0764129
$$ 204365542 163063972 135421375 119386344 112261087 114959768 129025430 169789559
4696A69789559P3007983Q7330219L5567706l1687315o0793661o8375409n2485382
$$ 169789559 242797542 330127761 365695467 334008152 273214491 204839082 152353700
4689A52353700l8097390k5341153j7899008j1196827p629784m157183l101524
$$ 152353700 114256310 88915157 71016149 59819322 52189538 48032355 44930831
4682D4930831j232518r53674K28267M5061M61113r3964j60195j233528q35680
$$ 44930831 43698313 42744639 42972906 43017967 43479080 43385116 43224921 41991393 41155713
4673D1155713r61197m10526J28658M71230P78055J649412K499443L701005M904600
$$ 41155713 40194516 39783990 39912648 40383878 41161933 42811345 45310788 49011793 53916393
4664E3916393N506399M827355L432467J090389n76102j606535j227326j85125
$$ 53916393 59422792 64250147 67682614 68773003 68196901 66590366 65363040 65177915
4656F5177915J186926K121608L702489N214245O748730Q473357J0775492J3974739
$$ 65177915 66364841 68486449 72188938 77403183 84151913 92625270 103400762 117375501
4648A17375501J9408995K7856134M1490149N8105167O5870693N0658442J2389304
$$ 117375501 136784496 164640630 206130779 264235946 330106639 380765081 393154385
4641C93154385k6487024m9323883n4148579m6354035l5363669k5788194k0920364
$$ 393154385 366667361 317343478 263194899 216840864 181477195 155689001 134768637
4634A34768637j8491093j6322229j3648892j0693303p593601n561685l500709
$$ 134768637 116277544 99955315 86306423 75613120 68019519 62457834 58957125
4627E8957125k821749k960967k955130k215907j129224k3304P58570N43285p12647
$$ 58957125 56135376 53174409 50219279 48003372 46874148 46850844 47609414 48152699 47440052
4618D7440052k116027l186840l685561l709520k872041k098507j468147j140510
$$ 47440052 45324025 42137185 38451624 34742104 31870063 29771556 28303409 27162899
4610B7162899m30768j9199J34330k48048p71803r60992j328552j263019j277664
$$ 27162899 26732131 26712932 26847262 26599214 25827411 24866419 23537867 22274848 20997184
4601B0997184j175094j001490n26586m90596m73735o03299o05243o79268l82249
$$ 20997184 19822090 18820600 18294014 17803418 17329683 16726384 16121141 15441873 15059624
4592A5059624j86605L6963j88515k94062j44357J39436K75861M75609M44302J62069
$$ 15059624 14873019 14909982 14721467 14427405 14283048 14422484 14698345 15173954 15618256 15780325
4582A5780325j37769r7508L0350P4345j84020p9712n1298O9806K32138L58169
$$ 15780325 15642556 15545048 15575398 15649743 15465723 15386011 15334713 15404519 15636657 15994826
4572A5994826M67328N6769J17672M78414Q34878J242946Q86729M80258j72373
$$ 15994826 16462154 16518923 16636595 17115009 17949887 19192833 20079562 20559820 20387447
4563B0387447o19966p46757o33586j27239K4785m23289q46400j398008j309396
$$ 20387447 19767481 19020724 18387138 18259899 18284684 17861395 17014995 15616987 14307591
4554A4307591j346366q56764n28319k68457j76901p5066K4861N482j20352P5289
$$ 14307591 12961225 12104461 11576142 11307685 11130784 11055718 11080579 11086061 10965709 11040998
4544A1040998K17482K53375K70107J89376K70025P21803R65257J150955J129510
$$ 11040998 11258480 11511855 11781962 11971338 12241363 12963166 13928423 15079378 16208888
4535A6208888J397361J481705J379789J220504P65709M81382L4391K70446L79933
$$ 16208888 17606249 19087954 20467743 21688247 22453956 22935338 22969729 23240175 23620108
4526B3620108M76888P39717R59356Q03627O12196M61547o1477m16375p81802o91694
$$ 23620108 24096996 24836713 25796069 26599696 27211892 27673439 27611962 27195587 26413785 25722091
4516B5722091m39144P5201N51604J407104K132261L139154M001639N566037P042054
$$ 25722091 25282947 25358148 25909752 27316856 29449117 32588271 36589910 42155947 49198001
4507D9198001R196877J2757014J8277692K4510538K6255563J6345891k641254
$$ 49198001 58394878 71151892 89429584 113940122 140195685 156541576 153900322
4500A53900322j8580784k5510689k5045926k0520045j5962394j1518822q153027
$$ 153900322 135319538 109808849 84762923 64242878 48280484 36761662 28608635
4493B8608635n358606l505622k655937j898451j634429j172663j148054q25747
$$ 28608635 23250029 19744407 17088470 15190019 13555590 12382927 11234873 10409126
4485A0409126p40081o11479o40450p04467k36575J32265K28193q5276k23278l45754
$$ 10409126 9669045 9057566 8417116 7712649 7476074 7608339 7836532 7751256 7527978 7182224
4475G182224k10803j98391n4213k21567K0908n054j62682J15938L50665Q57365
$$ 7182224 6971421 6773030 6718817 6497250 6518158 6513104 6350422 6466360 6817025 7674390
4465G674390J017627J340000J481311J160347M39709m42269j050740j475241j246057
$$ 7674390 8692017 10032017 11513328 12673675 13113384 12671115 11620375 10145134 8899077
4456H899077j205052r77216o63147l50998O9471L11724M91101Q37027J168339
$$ 8899077 7694025 6716809 6053662 5702664 5772135 6083859 6574960 7411987 8580326
4447H580326J018911O23818m66567r60708j397698j146556j121669o12187o29653
$$ 8580326 9599237 10223055 9756488 8795780 7398082 6251526 5129857 4517670 3888017
4438C888017l72884m05848l14570k22274p3263n1519l409o0098j34512n6494j56884
$$ 3888017 3515133 3109285 2794715 2572441 2499178 2447659 2444250 2384152 2249640 2193146 2036262
4427B036262K41119M68779L32042M26372N00889Q97518N84839M31998j87624m81539
$$ 2036262 2277381 2746160 3078202 3504574 4005463 4902981 5487820 5919818 5732194 5250655
4417E250655p49811n75951m66035k81218n806J23066p3133j77803J34195N92577
$$ 5250655 4500844 3924893 3458858 3177640 3171834 3294900 3221767 3043964 3178159 3770736
4407C770736P15760P86514R0806k87504p55989p60558m90892k31390l74137l82427
$$ 3770736 4486496 5273010 5363816 5076312 4320323 3559765 3068873 2837483 2463346 2080919
4397B080919j04356j40420p6168K58618N53866O64867J03510k23190m62464m73413
$$ 2080919 1976563 1836143 1759975 2018593 2572459 3237326 3340836 3117646 2655182 2181769
4387B181769m7063O6607j55667k11592J1545K06234M60338L23958K24981M4519
$$ 2181769 2134706 2201313 2045646 1834054 1845599 2051833 2512171 2836129 3061110 3105629
4377C105629J23295p25432l49272n86957n1501k55411j81182m08771j86282J8373
$$ 3105629 3228924 2503492 2154220 1567263 1515762 1260351 1079169 670398 484116 502489
4367E02489J22523m4421N7243l0198j79047o2489m6873Q9083K39936Q5118O6750
$$ 502489 625012 580591 637834 607636 428589 366100 319227 408310 648246 733364 800114
4356H00114k78967p830K44249M04894J14442L06843O3318l4042L04028P9326O1836
$$ 800114 521147 513317 757566 1162460 1276902 1583745 1647063 1613021 1917049 1996375 2058211
4345B058211l75234o9668j13021K7297N4770L11979J50381J52631j30156l79971
$$ 2058211 1682977 1613309 1500288 1527585 1582355 1894334 2044715 2197346 2067190 1687219
4335A687219m73556L842J47779j84296k59186l25255j66854o8924J21457j19634
$$ 1687219 1213663 1217505 1365284 1180988 921802 596547 429693 360769 482226 362592
4325C62592k7366Q8650j84024j1054K7128J48743q0140M9622j21096p1449J75933
$$ 362592 335226 423876 239852 228798 255926 404669 324529 374151 253055 181606 357539
4314C57539J50762J50255R2005L1308p7345O6452L64743K44320J42424j83347
$$ 357539 508301 658556 750561 781869 704524 770976 1135719 1380039 1522463 1339116
4304A339116P1706J8946M01065N94400R04897J518430L111675M449045M240947
$$ 1339116 1410822 1429768 1830833 2425233 3330130 4848560 7960235 12409280 16650227
4295A6650227K92447k298429l448487l348750k450264j702318j138244p77002
$$ 16650227 16942674 14644245 11195758 7847008 5396744 3694426 2556182 1779180
4287A779180n49031l05497l51576k00791j00235j4478N0136r7349O3401k12915
$$ 1779180 1230149 924652 573076 372285 272050 257572 307708 210359 273760 60845
4277F0845O878j61168j703M1727K02168j04182n0388j11210J63516k49850J08002
$$ 60845 67723 -93445 -95148 -53421 148747 44565 -5823 -117033 46483 -203367 -95365
4266i5365Q1778N6018n9951K6328j47062L5188M4552J41375j05344j01391k3569
$$ -95365 -13587 42431 -17520 8808 -138254 -103066 -58514 82861 -22483 -123874 -147443
4255a47443K1943r699J88097j13440Q2187j47761K4243q026l4422J66115m322
$$ -147443 -125500 -135199 52898 -60542 21645 -126116 -101873 -109899 -144321 21794 17472
4244A7472m22L086J23508o0932m989l4678n7704K9727m8877J38156O5874J33122
$$ 17472 17050 20136 143644 82712 77723 43045 -14659 15068 -33809 104347 170221 303343
4232C03343q8442L16383Q8697K40797r2986K01472L39485M30145K12097J21649
$$ 303343 214901 531284 619981 860778 767792 969264 1308749 1738894 1950991 2072640
4222B072640O7001n7470M4421q5675k46290k12711m12202k37089j37311J45229
$$ 2072640 2139641 2082171 2126592 2040917 1794627 1581916 1169714 932625 795314 940543
4212I40543k47583j10478j59647p070J98812K02885o5534j30108R5081l44506
$$ 940543 692960 582482 422835 415765 614577 817462 751928 621820 716901 372395
4202C72395J82996K61081K99963o4239J75692n9549J62533J21879J70870n696
$$ 372395 555391 816472 1116435 1052196 1227888 1168339 1330872 1452751 1623621 1617925
4192A617925L08748J28830P4710K22042L88923L16299N25369L53154J45076r405
$$ 1617925 1926673 2055503 2130213 2352255 2741178 3057477 3582846 3936000 4081076 4071671
4182D071671J06340k3550j55647n85175l86314n17853l37292j87736N7612k875
$$ 4071671 4178011 4154461 3998814 3413639 3027325 2509472 2172180 1984444 2042056 2039181
4172B039181M6892l74K78293K96908M65883Q18037R36493P95254R12569O86137
$$ 2039181 2086073 2085699 2363992 2660900 3126783 3944820 4881313 5676567 6589136 7275273
4162G275273R31229O01455K12408k13158l84977m75742o76295r14759r38623r17789
$$ 7275273 8206502 8807957 9020365 8807207 8422230 7946488 7270193 6355434 5416811 4499022
4152D499022o91224o27010o15503l00056j15955l1110N1598j6012J95183K53276
$$ 4499022 3807798 3180788 2565285 2265229 2149274 2118164 2169762 2153750 2348933 2602209
4142B602209Q03731M91023M29082J33877J05580J8239n549q9661j21377k06493
$$ 2602209 3405940 3896963 4326045 4459922 4565502 4583741 4578192 4488531 4367154 4160661
4132D160661l48778j21879R1465K68980M32552N79220Q2300n644k8595m6164L5307
$$ 4160661 3811883 3690004 3781469 4050449 4483001 5062221 5144521 5138877 5110282 5064118 5099425
4121E099425p5936k00982l59914m19251l93892r2150r4339r8113k839l47423m04847
$$ 5099425 5023489 4822507 4462593 4043342 3649450 3557300 3462961 3364848 3362009 3014586 2609739
4110B609739m60856q9721k1050K68266J53476L03485L74935K73413K35979m7933
$$ 2609739 2148883 2059162 2038112 2306378 2459854 2763339 3138274 3411687 3647666 3599733
4100C599733M0430j7530j15137m28181n05219n24327l88712j61535k72926k16782
$$ 3599733 3640163 3622633 3507496 3079315 2574096 2049769 1661057 1499522 1226596 1009814
4090A009814m57675J86816j22951M8443k7483J68818j46963J46669J52275Q8424
$$ 1009814 552139 738955 616004 664447 636964 805782 658819 805488 957763 1046187
4080A046187o1941J96527R8227O2464N8844k2668Q7759K93892N4555L72996J39696
$$ 1046187 984246 1180773 1279000 1341464 1400308 1377640 1465399 1759291 1813846 2186842 2326538
4069B326538K36243j09682K80511r6396k19206j82801j87318m32329l82604l00029
$$ 2326538 2562781 2453099 2733610 2637214 2418008 2235207 2047889 1615560 1232956 932927
4059I32927k23088p5976k64158j68086k00373J14005J13183k33269q9909j14425
$$ 932927 709839 633863 369705 201619 1246 115251 228434 -4835 -94744 -209169
4049b09169R798j6232J97980n870k67181L4265k8620n1289J1265K79448m3453
$$ -209169 -199371 -215603 -17623 -23493 -290674 -256409 -285029 -336318 -325053 -45605 -89058
4038h9058M4546l16507J43456k9825O0107N4109j56242j09212q179J61733O0515
$$ -89058 -44512 -361019 -217563 -247388 -187281 -133172 -289414 -398626 -406805 -245072 -184557
4027a84557N2911j65191n3805o7620J38586j2907j75600k5578j23449O6056J9570
$$ -184557 -131646 -296837 -350642 -418262 -279676 -292583 -468183 -493761 -617210 -551154 -531584
4016e31584J20522K26938q1106k82109j11180L9859K48259K23525r5355r0018
$$ -531584 -411062 -184124 -265230 -547339 -658519 -618660 -370401 -146876 -242231 -332249
4006c32249j30382l2144J27961J76539J86046k30576j00968j1066J6304o4351
$$ -332249 -462631 -494775 -366814 -190275 -4229 -234805 -335773 -346839 -330535 -394886
3996c94886L52563k33642q2923k08122k5434J43607J52256O7876j51601j83335
$$ -394886 -42323 -275965 -358888 -567010 -592444 -448837 -296581 -228705 -380306 -563641
3986e63641q6341L05404J56881j44085o7510j12752K5737O9148J25876r2873N1654
$$ -563641 -649982 -344578 -187697 -331782 -399292 -512044 -486307 -417159 -291283 -384156 -332502
3975c32502p0452l6883j3923J05873L9129J01678L0098k32385m7563o5237J68635
$$ -332502 -402954 -439837 -453760 -347887 -308758 -207080 -176982 -409367 -456930 -522167 -353532
3964c53532j85693Q3723K9878J15986O4154J8086j52120o4117N5649R8407L0161
$$ -353532 -539225 -455502 -425624 -309638 -245484 -227398 -379518 -443635 -387986 -289579 -259418
3953b59418q7362k07010j7203K58354J62565q160p4129j01790j8447j48973Q5494
$$ -259418 -346780 -553790 -570993 -312639 -150074 -158234 -232363 -334153 -352600 -501573 -416079
3942d16079K42065J0628k5079j39286o2616l8518L25750N7176m5645l56390q7533
$$ -416079 -174014 -163386 -188465 -327751 -390367 -428885 -103135 -45959 -91604 -447994 -535527
3931e35527l1938K97228J66622n7036j68378j86714L4985J33579J90290K02580
$$ -535527 -567465 -270237 -103615 -160651 -329029 -515743 -480758 -347179 -156889 45691
3921D5691k16640k85120p4896O7943L27072K34708j08400l27058j74762Q1651
$$ 45691 -170949 -456069 -530965 -463022 -135950 98758 -9642 -336700 -511462 -429811
3911d29811K47479J67331j77028k61824J2558M275J76448Q0888O5554J24916j20179
$$ -429811 -182332 -15001 -192029 -453853 -441295 -437020 -260572 -179684 -114130 10786 -109393
3900a09393r0876k7746Q3056J02085J47350j49113P7620j05662j4974J17072m4405
$$ -109393 -200269 -228015 -144959 -42874 104476 -44637 32983 -72679 -87653 29419 -14986
3889a4986K1832K5134K2776M571j27849O0549J39088J16013p2328q3342k63595
$$ -14986 6846 31980 54756 59327 -68522 -7973 131115 247128 174800 91458 -172137
3878a72137l2446J08619L63224O420p2635j63969n5054J04950p3140P5370J92578
$$ -172137 -204583 -95964 267260 273680 201045 37076 -17978 86972 13832 89202 281780
3867B81780k4325l02775j49795j97542L06470K91904J66716l60657k04095j54920
$$ 281780 257455 -45320 -195115 -392657 -86187 205717 372433 11776 -192319 -347239
3857c47239M25388P9975K37674k50618k78903j5421J51939J05724K13023k40500
$$ -347239 78149 158124 395798 145180 -133723 -149144 2795 108519 321542 81042
3847H1042k8904j81122j43673L9466M64024J14077j67192k25276j09091K11018
$$ 81042 52138 -128984 -272657 -233191 230833 344910 177718 -47558 -156649 54369
3837E4369K54173J9140k15566j40760k20370K7620K47508J10282l1369Q6753j08558
$$ 54369 308542 327682 112116 -28644 -249014 -221394 26114 136396 105027 191780 83222
3826H3222n6715P4014M0039O1253P3545k36938k28741J6327K94736K35803j29958
$$ 83222 26507 100521 140560 201813 275358 38420 -190321 -173994 120742 356545 226587
3815B26587p3404k18357J33296m9749Q7575j4862N1622o5035p6765j24219j0604
$$ 226587 153183 -65174 68122 18373 105948 91086 142708 77673 908 -123311 -133915
3804a33915j5135J2752J53335q3402j65714Q5034J60186J50339Q518j05291J2597
$$ -133915 -149050 -136298 17037 -66365 -232079 -147045 13141 163480 171998 66707 79304
3793G9304K2134m0424m0721K2178k0766J28560m8894j50273j51396J70124M9886
$$ 79304 101438 61014 20293 42471 21705 150265 101371 -48902 -200298 -30174 19712
3782A9712J74586j84050k99452q7916K21932M6707Q4598r164O3032m8319j79720
$$ 19712 194298 10248 -289204 -377120 -155188 -108481 -23883 -33047 29985 -18334 -198054
3771a98054j21435K40029J39195m0441j70113j93056J41018K02119K75908k0770
$$ -198054 -319489 -79460 59735 19294 -150819 -343875 -202857 -738 275170 254400
3761B54400k78458j40251J01928J85875L2032j11126k66410J09381j13808N2566
$$ 254400 -24058 -164309 -62381 123494 155526 44400 -222010 -112629 -226437 -173871
3751a73871J18323L36699n7644k36372j54575l6200K34384K84366j2232l2736
$$ -173871 -55548 281151 223507 -12865 -167440 -203640 30744 315110 302878 270142
3741B70142l45420L053R8227J11753j41120O5494m6561k401j60733J75807j484
$$ 270142 -75278 -72225 26002 137755 -3365 62129 15568 13167 -147566 28241 26757
3730B6757J27429j646k68918k55042M0210J28966K02101J40681j15660j09989
$$ 26757 154186 152540 -116378 -371420 -331210 -202244 -143 140538 24878 -85111
3720h5111q4469J91541r426k9571n8635L5376j84788j0645j3135K13939J08747
$$ -85111 -169580 21961 12535 -17036 -75671 -40295 -225083 -235728 -248863 -34924 73823
3709G3823J29931k25546k2465p4102J13202L7488q8095k49906l0914m1283J13420
$$ 73823 203754 -21792 -44257 -118359 -5157 32331 -55764 -305670 -336584 -377867 -264447
3698b64447J26366J26691M8794l9385r3706N8469J3200O2650J44262j31299q6622
$$ -264447 -138081 -11390 37404 -1981 -95687 -37218 -24018 38632 182894 51595 -35027
3687c5027j81831L5080R5546M9380n1705J18525j25676l9738j9126Q8306R7703
$$ -35027 -216858 -181778 -86232 -36852 -88557 29968 -95708 -135446 -154572 -66266 31437
3676C1437J58175n6507j12995j71504J5190J39319Q3236J92944j66608j53861
$$ 31437 189612 133105 20110 -151394 -136204 3115 86351 279295 112687 -41174
3666d1174k56939J26240J0993K41826j22624N805n1507M2441j6236R0811J28190
$$ -41174 -298113 -171873 -160880 80946 -41678 -35873 -87380 -44939 -61175 29636 157826
3655A57826j03714k45826p3175L3540J59999J26083o8396q2510j06378J00059
$$ 157826 54112 -191714 -264889 -231349 -71350 54733 -13663 -96173 -202551 -102492
3645a02492J03735J30937M2116n6889j95266r1759L0933P5428L2385Q7764j26208
$$ -102492 1243 132180 174296 117407 -77859 -169618 -138685 -63257 -30872 56892 -69316
3634f9316K5060K1515Q4863Q1618J74825l19131q8556k21692J666J96391L9595
$$ -69316 -44256 -22741 62122 143740 318565 -566 -89122 -310814 -309148 -112757 -73162
3623g3162J28559J5034J4163q2117J14730j22539K6346Q095j00210j45027J38750
$$ -73162 55397 70431 84594 2477 117207 -5332 21014 29109 -71101 -216128 -77378
3612g7378N6269M8277K3082p766J26809L1118m0743Q163j03095P211Q7844O8376
$$ -77378 -21109 27168 50250 42484 169293 200411 159668 167831 64736 71947 159791 228167
3600B28167n4783j42713k1637J11932M3659J00865j25498p3096P270L7715k6599
$$ 228167 173384 30671 9034 120966 164625 265490 139992 66896 74166 111881 85282
3589H5282k84P9266q1885m2804j39326R4733K40983K18199j31206l41063p5530
$$ 85282 84998 164264 82379 39575 -99751 -5018 235965 454164 322958 -18105 -93635
3578i3635K90171K67377L0146j44987l05709k1292J55728J24222J3715J40634
$$ -93635 196536 463913 494059 349072 43363 22071 177799 302021 315736 456370
3568D56370j17754j30262n5388K31381J20855J05387k40208k58034k01471K31155
$$ 456370 338616 208354 152966 384347 505202 610589 370381 112347 -89124 142031
3558A42031K58475K25325j01985j39354O601j9984M5717J31866P195l7992j66782
$$ 142031 400506 625831 523846 384492 391093 371109 416826 548692 555887 517895 351113
3547C51113o8055J24341M1319N8324J27903P0345j16990O7912J80188J52282j624
$$ 351113 283058 407399 448718 507042 634945 705290 588300 656212 836400 988682 987058
3536I87058J44662P980L36194P7416J5169l00266k63344j52759j6747n5501L5879
$$ 987058 1131720 1139700 1475894 1553310 1568479 1268213 1004869 852110 835363 779862 815741
3525H15741j8956k3917j6573J34359q883O0988n0963m15j25047J04899K289j5428
$$ 815741 796785 772868 756295 890654 881771 942759 891796 891381 766334 871233 873522 858094
3513H58094J36176L1934j23682K87752L09265L06831j14580r9936J30686O28707
$$ 858094 994270 1026204 902522 1190274 1499539 1806370 1691790 1591854 1722540 2351247
3503B351247M73971K68274q9479k10399q6940j96472l08019o1268l21847l1172
$$ 2351247 2825218 3093492 3004013 2793614 2706674 2510202 2202183 2140915 1819068 1787896
3493A787896r1846p521J28626K9533R2313q8932l4786Q1533J40620J05967q2434
$$ 1787896 1696050 1688529 1817155 1846688 1939001 1850069 1815283 1896816 2037436 2143403 2060969
3482B060969j56959M0093K10432L71590K50671L10531J502P3735J16837O02588
$$ 2060969 1904010 1944103 2154535 2526125 2776796 3087327 3088829 3162564 3279401 3881989
3472C881989K29944M49963L64342M83574L69451L66872L99361M09967J62634m6511
$$ 3881989 4111933 4561896 4926238 5409812 5779263 6146135 6545496 6955463 7118097 7071586
3462G071586N3786N69781J175393J208530K71292j070488j580655j275337q70593
$$ 7071586 7125372 7695153 8870546 10079076 10350368 9279880 7699225 6423888 5553295
3453E553295q96985o73533n31648m37777k50055q2546J2174M1688o5693k39845
$$ 5553295 4656310 3982777 3451129 3013352 2763297 2680751 2692925 2734613 2668920 2429075
3443B429075q1343p649Q0574R5934j21425r8422m8588J60260M08311K81857J76105
$$ 2429075 2347732 2340083 2420657 2516591 2395166 2296744 2248156 2408416 2816727 3098584 3274689
3432C274689P6057L61645R01647K083587K731869K891190N29708j326253k132148
$$ 3274689 3350746 3712391 4614038 6697625 9429494 12320684 12850392 11524139 9391991
3423I391991k033459j856575j169408q80009o38943n28089l03683j28692k5843
$$ 9391991 7358532 5501957 4332549 3452540 2813597 2285508 1981825 1853133 1827290
3414A827290n3352k70737q823l7400j03267l9494r7047m2066K00357J91535J67578
$$ 1827290 1773938 1503201 1494378 1456978 1353711 1314217 1217170 1175104 1375461 1566996 1734574
3403A734574j08136o4279J3154K46280L13522N96474Q61220J376637J011472K27991
$$ 1734574 1626438 1562159 1575313 1821593 2135115 2731589 3592809 4969446 5980918 6208909
3393F208909o79044q08326r32165q80858r20640n39779k51503k8307J4569j53636
$$ 6208909 5529865 4721539 3789374 2908516 1987876 1448097 1196594 1168287 1182856 1029220
3383A029220l03271p5693Q7230J42164l0729o9117k26329o9073P6918J03979q1871
$$ 1029220 725949 650256 737486 879650 848921 779804 553475 484402 561320 665299 583428
3372E83428J994j32838j23917K3603Q5298J31095R9064j48272j34120j39885N0786
$$ 583428 585422 452584 328667 352270 437568 568663 667727 519455 385335 245450 296236
3361B96236K04945P9735j06471o2084r7411J14947L3842l4256o1354q9736l8573
$$ 296236 501181 580916 474445 412361 314950 429897 463739 429483 368129 278393 239820
3350B39820L8015K3421J2745J61535m7128j48489n4135M9841Q6019k3186r0750
$$ 239820 277835 301256 314001 475536 428408 279919 225784 275625 361644 338458 247708
3339B47708p1365o0095J41551J20273Q322k2089j25127p4523J57627p7749M2294
$$ 247708 176343 116248 257799 378072 386394 364305 239178 164655 322282 244533 286827
3328B86827j50324J24298k07896J75445r2537Q3799Q3672J830j47837J3907P7397
$$ 286827 136503 260801 52905 228350 135813 219612 303284 305114 157277 171184 248581
3317B48581M9084o0643k8436q0610p9091J65386K5216m8617p8417j07780O667
$$ 248581 297665 237022 208586 127976 48885 214271 239487 190870 112453 4673 11340
3306A1340J00676J56999P0483n2105j9837K1396j09197J68618N211j45856j18095
$$ 11340 112016 269015 339498 287393 267556 288952 179755 348373 353584 207728 89633
3295H9633J082J36196K85172K2720k74937k18426p9865J40154L03036m7391j14065
$$ 89633 90715 226911 512083 534803 259866 41440 -38425 101729 404765 357374 243309
3284B43309p6807K86761R5968j8774j2102q3067k47542M632l0068m688J55876
$$ 243309 166502 453263 549231 530457 518355 435288 187746 192378 162310 157622 313498
3273C13498l925m4584l33106j9381K19409K16842m0743l3257j96901j3078J03380
$$ 313498 309573 264989 -68117 -87498 131911 348753 308010 274753 77852 64774 168154
3262A68154K53610l0379k45760K3991P1375m5849K51660J31295P4627k71803N1814
$$ 168154 421764 391385 145625 169616 240991 195142 446802 578097 652724 380921 432735
3251D32735k13222J60286O6283N7577k46512j07053m7796P901j1882J1034l9962
$$ 432735 219513 379799 446082 503659 257147 150094 102298 110199 98317 109351 69389
3240F9389M1952j7576j06085j25917J49206N381P0944M5823j16328j2470J37630
$$ 69389 111341 93765 -12320 -138237 10969 16350 87294 133117 16789 4319 141949
3229A41949P0165n9942k50801L7785R2630N9728N8148o0624p7958J39265N4087
$$ 141949 212114 152172 -98629 -60844 31786 91514 149662 89038 11080 150345 204432
3218B04432r6902j22200N7888o1758K50871j52971p1534o4321J0527N4867K07887
$$ 204432 107530 -14670 43218 -18540 232331 79360 7826 -56495 -45968 8899 216786
3207B16786K6147m2439j05840M6193j1745m876M6891J37759M9068l66373k5756
$$ 216786 242933 200494 94654 140847 129102 124226 171117 308876 357944 -8429 -34185
3196c4185J64349K04873J0730j20884o7941l9408q3443R2910M5428N0665k70900
$$ -34185 130164 335037 345767 224883 156942 117534 34091 127001 172429 223094 -47806
3185d7806J44284l0281K37534r8699K39729k44117O3128j21805K03514j32833
$$ -47806 96478 66197 303731 205032 444761 200644 263772 141967 345481 212648
3175B12648J62067O1674O3300k18362O0178J67066R6306k29676p7027m7935M4910
$$ 212648 374715 436389 499689 281327 341505 508571 604877 375201 298174 250239 295149
3164B95149K59532L4628j40279R1036j42527r7795l2286O0556K29948J904m5389
$$ 295149 554681 589309 449030 540066 397539 299744 267458 328014 557962 559866 514477
3153E14477N5819R9441J6753O1491j03110K1489J1394o272l8477O7221k30871
$$ 514477 570296 669737 686490 747981 644871 666360 677754 671482 633005 700226 469355
3142D69355L8349J00764P8672Q7192n1687o1229J43961J25172n8908J47859J15631
$$ 469355 507704 608468 687140 774332 722645 661416 805377 930549 871641 1019500 1135131
3131A135131m0228l3392J74482N8531R9288J24978n8250J77304Q2164m2164j30334
$$ 1135131 1094903 1061511 1235993 1294524 1393812 1518790 1460540 1637844 1720008 1677844 1547510
3120A547510o7625j38986l1802j9760n4125j29172r783L4356m0572n771J06080
$$ 1547510 1479885 1340899 1309097 1289337 1235212 1106040 1096257 1130613 1090041 1084270 1190350
3109A190350J71487J44330j09359l3067j83946J39290r4413M3628k2981J7852
$$ 1190350 1361837 1506167 1396808 1363741 1179795 1319085 1224672 1268300 1245319 1263171
3099A263171N2639J4655M6576J10028P0112q0482K9660q3853N7987j79226N5916
$$ 1263171 1315810 1330465 1377041 1487069 1557181 1476699 1506359 1422506 1480493 1301267 1357183
3088A357183k65792l0736p0114k8963N847O3094m7481k27697o1799j680K80396
$$ 1357183 1091391 1060655 990541 961578 967425 1030519 983038 755341 693542 691862 972258
3077I72258o193j0298p3203q3343K481K49614l1212q6504r3034l3269j64550N8482
$$ 972258 966065 955767 882564 799221 801702 1051316 1020104 933600 840566 807297 642747 701229
3065G01229j09244q9950j10199J10355l0768p5739o4996L9252R7038J8664j59113
$$ 701229 591985 502035 391836 502191 471423 395684 330688 369940 466978 485642 326529
3054C26529j05357n8923P3572P6186n3780l5220j01847l1147Q9211Q7548j61161
$$ 326529 221172 162249 235821 312007 258227 223007 121160 90013 179224 266772 105611
3043A05611J28808j02311O6523N1990P4843m3150o0272k5506P1324j69027J00882
$$ 105611 234419 132108 198631 250621 325464 282314 222042 196536 267860 98833 199715
3032A99715p3047P313m7194m8668j25442O9001o2670k137J62736J6947p5414q4467
$$ 199715 126668 133981 86787 38119 -87323 -18322 -80992 -83129 79607 96554 21140 -63327
3020f3327J53669m5929j57740j9578O5435r0822R8646j11212J28487j25285M1403
$$ -63327 90342 44413 -113327 -132905 -67470 -158292 -59646 -170858 -42371 -167656 -126253
3009a26253n7721K42185l2685o6720q1645O0299P7207L8525j22009Q2812Q4240
$$ -126253 -183974 58211 25526 -41194 -122839 -62540 14667 53192 -68817 13995 98235
2998I8235j47335n4479L7766j9725J07375N0262p6987M4963n5302Q8986j25254
$$ 98235 -49100 -103579 -65813 -85538 21837 72099 -4888 40075 -15227 73759 -51495
2987e1495R954j34846o765K3362K71800j21548n2643q2149j32110O171J13633
$$ -51495 -41541 -176387 -183152 -159790 112010 -9538 -62181 -144330 -276440 -270269 -156636
2976a56636J52912j15838k7157q3815J26459L4399O7351m2802R0590j74799o2643
$$ -156636 -3724 -119562 -146719 -230534 -104075 -69676 -2325 -45127 45463 -129336 -191979
2965a91979k5328J5808j6315M0319q3781J36132K14704n8539j53747P205j34587
$$ -191979 -217307 -201499 -217814 -177495 -261276 -125144 89560 31021 -122726 -115521 -250108
2954b50108J1566l6242K26725L5627p5127q9629J0760P6051J94287l1164j32993
$$ -250108 -238542 -274784 -48059 -12432 -87559 -177188 -166428 -90377 103910 72746 -60247
2943f0247O4169j16412Q6209k8631J94656k32828n1961j80284Q3711K9810M437
$$ -60247 3922 -112490 -26281 -54912 139744 -93084 -145045 -325329 -241618 -211808 -207371
2932b07371j90576P3539N1047P3314j8096p8389J54092J3286l0922j79202n4566
$$ -207371 -397947 -324408 -273361 -200047 -218143 -296532 -142440 -129154 -160076 -339278 -393844
2921c93844K09143m1353R4096J51392j09762J5869J11484j02852j61801o0982
$$ -393844 -184701 -226054 -131958 19434 -90328 -74459 37025 -65827 -227628 -288610
2911b88610M7220J3518P6765J11888j59900P9115J20829j08385j95780n9838J6545
$$ -288610 -241390 -227872 -151107 -39219 -199119 -120004 825 -107560 -303340 -363178 -346633
2900c46633L615J15681k856J84488j56116L5738k15652J25288l0958K7600p5079
$$ -346633 -343018 -227337 -230193 -45705 -201821 -166083 -381735 -256447 -287405 -259805 -334884
2889c34884M5285j59243O2349J21359K28873j13747J47777k86985n6162Q518K28065
$$ -334884 -289599 -448842 -386493 -265134 -36261 -150008 -2231 -289216 -345378 -336860 -108795
2878a08795p4814J22053j71804K1424j18498J2855J37157N9436j24802k84958
$$ -108795 -183609 -61556 -233360 -211936 -330434 -317579 -180422 -120986 -245788 -530746
2868e30746N4968Q8000J73909J7296J1915j1767L412o0968J64859M7946N5140
$$ -530746 -475778 -387778 -213869 -196573 -184658 -196425 -193013 -253981 -89122 -41176 13964
2857A3964j74046m2579j15561J19290M2429K15088p2797q0393l23120J2896N7006
$$ 13964 -160082 -202661 -318222 -198932 -156503 58585 -14212 -94605 -417725 -404829 -347823
2846c47823L7630R3289Q2315j57129k8113M7414J20054k1794J47672r2606k9217
$$ -347823 -310193 -216904 -134589 -291718 -319831 -272417 -152363 -174157 -26485 -119091 -148308
2835a48308k13552J21182k7419J61420L9982r6861k27413J07121l3450m451o5390
$$ -148308 -361860 -240678 -268097 -106677 -66695 -163556 -390969 -283848 -317298 -321749 -387139
2824c87139J49664m6183J86895j96340O0197m0332K04955L7854P805j61845k6777
$$ -387139 -237475 -283658 -96763 -293103 -232906 -273238 -68283 -30429 -22624 -184469 -211246
2813b11246n0364K05292R0752O0059k46314p6044o3426K6015J28561P7181j7812
$$ -211246 -261610 -56318 34434 94493 -151821 -227865 -291291 -265276 -136715 -59534 -77346
2802g7346k04822j68316M2776J02733K61372J2728K6578r1273m0149j00103J70545
$$ -77346 -282168 -450484 -407708 -304975 -43603 -30875 -4297 -95570 -135719 -235822 -65277
2791f5277k7404k02467k3539R7794J72797J9215Q9652j74989n9072j36190j6787
$$ -65277 -92681 -295148 -318687 -220893 -48096 -28881 60771 -114218 -173290 -309480 -326267
2780c26267J31673K76499j01652j68057m0514j31506k5854K75654j62913J10640
$$ -326267 -194594 81905 -19747 -187804 -228318 -359824 -385678 -110024 -272937 -162297
2770a62297K0748R7580k6173K639j17308O7472K6319J537l1917q6741j46681K39558
$$ -162297 -141549 -43969 -70142 -67503 -184811 -117339 -91020 -89483 -121400 -208141 -354822 -115264
2758a15264k26582J38972J60J7054n4481O4920O7594l0751L032R194j78433J52744
$$ -115264 -341846 -202874 -202714 -185660 -240141 -175221 -107627 -138378 -135346 -126152 -304585 -151841
2746a51841j33130J17128r3739J79527o3223o9181p4588P8509r7167K25413P7814
$$ -151841 -284971 -167843 -261582 -82055 -145278 -214459 -289047 -210538 -307705 -82292 -4478
2735d478L5862k05169j02672O0813j4341J79127R7577j11008k10386r1154J66942
$$ -4478 31384 -173785 -276457 -215644 -229985 -50858 46719 -64289 -274675 -365829 -198887
2724a98887J04258p182j25011O2524R9622N050M5970L5935j33925r9187l691j87296
$$ -198887 -94629 -101811 -226822 -164298 -64676 -59626 -13656 22279 -111646 -210833 -214524 -401820
2712d01820J98885J70010J1487m1672j42869p6181p2576J82441L4439j57976o8109
$$ -401820 -202935 -32925 -21438 -63110 -205979 -282160 -354736 -172295 -137856 -295832 -363941
2701c63941R0290p5364L0766J37079l6286M2285r3444J8066N0187N00k9397J35641
$$ -363941 -273651 -349015 -318249 -181170 -217456 -175171 -268615 -250549 -200362 -199862 -229259 -93618
2689i3618o6154Q0925q1609J70411j1536P9707k15477m2253J86969P9270p9142
$$ -93618 -159772 -78847 -160456 9955 -1581 78126 -137351 -179604 7365 86635 7493
2678G493Q1252r8460k08361J33646J02069R955q0713k75382J09304J34477l0788
$$ 7493 88745 -9715 -218076 -84430 17639 27594 -53119 -328501 -219197 -84720 -115508
2667a15508j70220N9673K35228o6401L1642o5901M2919o2842Q3259j40660O8471
$$ -115508 -285728 -226055 9173 -57228 -25586 -91487 -48568 -111410 -28151 -168811 -100340
2656a00340k7824o739P2428j66107R0582o55n4586J28378q470j84130N0399p1450
$$ -100340 -128164 -134903 -62475 -228582 -138000 -138655 -193241 -64863 -73333 -257463 -207064 -278514
2644b78514J57407j5887k3823j48178J03506j6282J11198R5215m6205n1398J19328
$$ -278514 -121107 -136994 -160817 -308995 -205489 -221771 -110573 -15358 -61563 -112961 6367
2633F367J1078M9777j16768O7374k18707P3093K7354O2501p7867j36794L9316
$$ 6367 17445 67222 -49546 17828 -200879 -127786 -100432 -37931 -115798 -252592 -213276
2622b13276P1523r8999K05144L5496j37734J25151n1052p2881J35263K26711m1136
$$ -213276 -141753 -240752 -35608 -112 -137846 -12695 -63747 -136628 -1365 225346 184210
2611A84210j60869q4648j97687R7834Q0157J97317p0589r2915j49558j9320K18935
$$ 184210 23341 -61307 -258994 -161160 -81003 116314 45725 -47190 -196748 -216068 2867
2600B867O2963P8711j09065k9797P0512K19886J40393J82051J69160j18008k37582
$$ 2867 65830 144541 35476 5679 76191 296077 436470 618521 787681 669673 432091
2589D32091q1553o4886l2925O0414j36600j99387k14266Q4237J84309k236N6750
$$ 432091 350538 285652 252727 313141 176541 -22846 -237112 -152875 31434 29198 85948
2578H5948j09277L746m7708K32837m9356n4590k8624o9776j25062j6195K11089
$$ 85948 -23329 -19583 -67291 165546 116190 61600 32976 -36800 -161862 -178057 33032
2567C3032N0729l8082p6292j66889J64100l6930N1021k981J56577k20134P2790
$$ 33032 83761 45679 -30613 -197502 -33402 -70332 -19311 -22292 134285 -85849 -13059
2556a3059j25411J73145L4850p4473K2699K8251j38090n7361L1404J02224o0193
$$ -13059 -138470 34675 69525 -4948 17751 46002 -92088 -149449 -118045 -15821 -76014
2545g6014p9414K1580o8352J6477N6469N2082M1167J26804K2169M4336m4966N6146
$$ -76014 -155428 -133848 -202200 -185723 -129254 -77172 -36005 90799 112968 157304 112338 168484
2533A68484n1568J447r8463j47907j26804J43409L21290r8875r6210N518r8617
$$ 168484 116916 118363 19900 -128007 -254811 -111402 209888 111013 14803 20321 -78296
2522g8296J72932N967R513O8449k61602j27252O1277R1592K79090R0093j13238
$$ -78296 94636 100603 110116 178565 -83037 -210289 -149012 -57420 221670 311763 198525
2511A98525r3432j21893O0599Q3621k1961j368p0087o7335P7808J03826J70557
$$ 198525 105093 -16800 43799 127420 105459 104091 34004 -33331 44477 148303 318860
2500C18860o9947o3855j53890l8990m3153R0006J25531j05823j39402p6516M3392
$$ 318860 248913 185058 31168 -7822 -50975 39031 164562 58739 -80663 -157179 -113787
2489a13787J50048J74687q9386J09175j46940m6307K3565K37873n892L4407n1209
$$ -113787 36261 210948 121562 230737 83797 37490 61055 298928 293036 327443 276234
2478B76234j97475K0006j2434J10625j54286J3553J20820M1495n2405J48272N7116
$$ 276234 78759 98765 86331 196956 42670 56223 177043 218538 166133 314405 371521
2467C71521q5443j01544j08558p1296K9154J71679R2143M3761L842j75489R583
$$ 371521 286078 184534 75976 4680 33834 205513 297656 341417 345259 169770 179353
2456A79353k540K2325k356j15809m6971J53559j26309O8338Q377J76502J4816
$$ 179353 176813 199138 196782 80973 34002 187561 61252 129590 137967 314469 329285
2445C29285n9599j67055R1944R1481j3229J05467j56768n0938J59285L575K01372
$$ 329285 269686 102631 194575 286056 272827 378294 221526 170588 329873 333448 534820
2434E34820M9305l5532j66912k36757l9974J53784J28053j9085M2830l8501J61309
$$ 534820 584125 548593 381681 144924 104950 258734 386787 367702 410532 372031 533340
2423E33340p6661R7097p1806n0968k8446n7403R9248N5743M3453L57085l61363
$$ 533340 456679 553776 481970 431002 402556 345153 444401 500144 543597 900682 539319
2412E39319k14657r188K76276j5980J19327j0720J16725k33279J83856j13996
$$ 539319 324662 315474 591750 575770 695097 684377 801102 567823 751679 637683
2402F37683P6777K455K9533o4588j7799k4432J25087J11463J58003l536p9581
$$ 637683 714460 716915 746448 681860 664061 639629 764716 876179 1034182 1030646 951065
2391I51065L1740J4808M7874P2147q3683k2891n8812J44211j03158O1946J50314
$$ 951065 982805 997613 1045487 1117634 1033951 1011060 952248 1096459 993301 1055247 1205561
2380A205561Q3624L0829K4638J91943j45124J46346j5782R5130R4677O2326L043
$$ 1205561 1289185 1320014 1344652 1536595 1391471 1537817 1522035 1617165 1711842 1774168 1777211
2369A777211o7378P8203J09828J43676j3977J04795J33554K7285J44050J20435
$$ 1777211 1709833 1788036 1897864 2041540 2027563 2132358 2265912 2293197 2437247 2557682
2359B557682j23044P2937J67164K75426J89310J99240L71640K9710J33231K16796
$$ 2557682 2434638 2507575 2674739 2950165 3139475 3338715 3710355 3740065 3873296 4090092
2349D090092N65708L64851K81805K85657L50396O12711P07975J297566J315734
$$ 4090092 4655800 5020651 5302456 5588113 5938509 6551220 7259195 8556761 9872495
2340I872495J239608N71293L60417J24472M78551R49676J498505J995924K485650
$$ 9872495 11112103 11683396 12043813 12168285 12646836 13596512 15095017 17090941 19576591
2331A9576591L387224M805082P115969J5036644K9530251M1702299L2233459l099327
$$ 19576591 22963815 27768897 34884866 49921510 79451761 121154060 153387519 150288192
2323A50288192k3061445l0799964k6759986j9585083j3834139r790943o824290
$$ 150288192 127226747 96426783 69666797 50081714 36247575 26456632 19632342
2316A9632342m402807l057873j943863j035611k07762K26836L68079o49052q63750
$$ 19632342 15229535 12171662 10227799 9192188 8984426 9211262 9579341 8930289 8066539
2307H066539j181197j033863q52336m73425n20347l49373k74797j44849k73411
$$ 8066539 6885342 5851479 4999143 4525718 4005371 3655998 3381201 3236352 2962941
2298B962941R7031j49860k42136q7946m9496P96j21196k77933r4531j55005j35567
$$ 2962941 3059972 2910112 2667976 2580030 2530534 2531330 2410134 2132201 2037670 1882665 1747098
2287A747098j76429N1990m7678j9829r4158j8772l455L3982J3863N2811r4592
$$ 1747098 1570669 1622659 1574981 1555152 1460994 1442222 1438767 1472749 1486612 1539423 1444831
2276A444831k38110k05200L9006M0460r789k62586L3187k16131L30514j13791
$$ 1444831 1206721 1001521 1040527 1080987 1071198 808612 841799 625668 956182 842391
2266H42391n607k22549J38455m8332J39525j98211J13212j00617N7583m42610
$$ 842391 836784 614235 752690 704358 843883 645672 758884 658267 715850 273240
2256B73240J54028J76208N4771j08208j2987j56911O9554o3162M7623j1336Q7036
$$ 273240 427268 603476 658247 550039 537052 380141 449695 386533 434156 422820 509856
2245E09856p6440k6794r7758O5710P5708n7458J8340j45210M1788j31429J89921
$$ 509856 433416 406622 308864 374574 450282 392824 411164 265954 307742 176313 366234
2234C66234j41158N8297m2174j7818j42543M7335R0342l1451r5827m1819Q35K418
$$ 366234 225076 283373 241199 223381 80838 128173 218515 187064 91237 49418 50253 52671
2222E2671m721o7980J05927L4095N0436M0033l0733r5725J71504j52572q5201
$$ 52671 47950 -20030 85897 119992 170428 210461 179728 84003 255507 102935 17734
2211A7734j73641K71367j26221N3398q3176J14729k2681J9525j26077j1006J09796
$$ 17734 -155907 115460 -10761 42637 -40539 74190 51509 71034 -55043 -66049 43747
2200D3747n3347R2454j32218p7136o1508K70375p7148j083j88825O5238j03167
$$ 43747 -9600 82854 -49364 -126500 -188008 82367 5219 4136 -184689 -119451 -222618
2189b22618J56397p5306J01519q4828J33001j14871K9111j46742L63435j40450
$$ -222618 -66221 -141527 -40008 -124836 8165 -106706 -77595 -224337 139098 -1352
2179a352l4822k27150N0667L5331K90472M6986p7112k40670J01198J49781q1876
$$ -1352 -36174 -263324 -212657 -177326 113146 160132 83020 -157650 -56452 93329 11453
2168A1453k25152r4704k3492l33K07037P7950L4819J03686K4240n2052j65263
$$ 11453 -213699 -308403 -331895 -332228 -125191 -47241 -12422 91264 115504 63452 -101811
2157a01811J83476k29952J10651K2827j3463O7164J72342k50131m542J31535j52834
$$ -101811 81665 -148287 -37636 -14809 -28272 38892 211234 -38897 -43439 88096 -64738
2146f4738j12008J6153r1862Q6537j30215J23186O4268J51211j49181j15639j25130
$$ -64738 -176746 -160593 -252455 -165918 -296133 -172947 -108679 42532 -106649 -222288 -347418
2135c47418J86669K9267Q3014j11227p3067L698P9346p5119Q953J33174l29031
$$ -347418 -160749 -131482 -48468 -159695 -232762 -229064 -149718 -224837 -215884 -82710 -411741
2124d11741R1289j19874K71149N9743J21229j32602J67840k82551N4694n6311
$$ -411741 -320452 -440326 -169177 -109434 11795 -120807 47033 -235518 -180824 -237135
2114b37135L61916j79661K0158l95475O3479M7217M27621K8121j66209j14311
$$ -237135 124781 -54880 -34722 -430197 -366718 -319501 108120 136241 -29968 -144279
2104a44279J13252k85675K10782R1731K12229l14890j70332j9192L12111J63755
$$ -144279 -31027 -316702 -105920 -14189 198040 -116850 -287182 -306374 5737 169492
2094A69492r3703j43825n8344j6372k5843O0668R1231P6873j61537j58190j09032
$$ 169492 75789 -68036 -126380 -142752 -168595 -107927 -16696 60177 -101360 -259550 -368582
2083c68582R6900J10260k0446m2264J633M7006R3231k1208R4727L1923p9025J49845
$$ -368582 -271682 -161422 -181868 -224132 -222499 -175493 -82262 -103470 -8743 23180 -55845 94000
2071I4000M5394j43593j15457J06890n201R0009p3527q7363l8996p4599P4739
$$ 94000 139394 -4199 -119656 -12766 -17967 72042 -1485 -88848 -127844 -202443 -127704
2060a27704K41021J72177J41532j7163l4722k7524J31481J26613l49213l9423
$$ -127704 113317 285494 427026 409863 375141 347617 479098 605711 256498 217075
2050B17075k69455J47880L9002J16348j23512p9767k94626L6941k6802K55588
$$ 217075 -52380 95500 134502 250850 127338 47571 -247055 -210114 -236916 18672
2040A8672J05260N0732m37607k0977j98418L01467O8130J08113k55224q1255j6359
$$ 18672 123932 174664 -262943 -283920 -482338 -180871 -112741 -4628 -259852 -341107 -357466
2029c57466K44848j898K8652j13541k7076j36231K7095K94501K4282M071k25683
$$ -357466 -112618 -114516 -85864 -199405 -226481 -362712 -335617 -41116 -16834 -12763 -238446
2018b38446J04942j38786O4127J13625m4788j78955j1264j10145L73120J00799
$$ -238446 -133504 -272290 -208163 -94538 -139326 -318281 -329545 -439690 -66570 34229
2008C4229j00379m9804J8959n1349o8085K482R690n7194N6498J21715J50670N8629
$$ 34229 -66150 -115954 -96995 -148344 -216429 -213947 -204257 -261451 -204953 -83238 67432 126061
1996A26061r8401j99600j33194J03526J09379L0859p974o3411j30350L9810q5253
$$ 126061 27660 -171940 -305134 -201608 -92229 -61370 -69344 -132755 -263105 -223295 -308548
1985c08548J35475J2244j03243m1195p1600M6456J16194J12155j53479l4326k3029
$$ -308548 -173073 -160829 -264072 -305267 -376867 -330411 -214217 -102062 -255541 -289867 -312896
1974c12896K07198N7738M7498j84770j71749p9303K51909l5973J47453p5951J10247
$$ -312896 -105698 -47960 -462 -185232 -356981 -436284 -184375 -220348 -72895 -148846 -38599
1963c8599L1403Q7942n1874L0866k11196p8866o7077J55858J45108m1981K1576
$$ -38599 -7196 80746 28872 59738 -151458 -230324 -297401 -141543 3565 -38416 -16840
1952a6840k27864N1706Q6082Q9473o268n5409j11027O8203J01002o5131j108J83819
$$ -16840 -244704 -192998 -106916 -17443 -23711 -79120 -190147 -121944 -20942 -86073 -87181 96638
1940I6638k02911j05524Q9327J8132L5606O8390l22414N6361Q4693J58910j5481
$$ 96638 -106273 -211797 -122470 -104338 -68732 -342 -322756 -266395 -181702 -22792 -38273
1929c8273J1727j05473q8113O605J02298J99709j4264j24840k66748J22150J19906
$$ -38273 -26546 -132019 -220132 -213527 -111229 88480 74216 -50624 -317372 -195222 -75316
1918g5316J4084j5767P6093j05188j41523J66146q9582L31494o50k81746j31787
$$ -75316 -61232 -76999 -906 -106094 -247617 -81471 -171053 160441 159791 -121955 -253742
1907b53742Q0746l7169N0052J02100j69625p1276j11295J87644J50518J47346
$$ -253742 -172996 -210165 -160113 -58013 -227638 -298914 -410209 -222565 -72047 75299
1897G5299k0423l45241J6518k2886P2962q4828J73582j6159J3720N8189Q9846
$$ 75299 54876 -290365 -273847 -296733 -223771 -308599 -135017 -151176 -137456 -79267 10579
1886A0579m0966J6776r8594m2879J8769m0670K55658j65344K2305m3204L780j40025
$$ 10579 -30387 -13611 -112205 -155084 -136315 -176985 78673 -86671 -64366 -107570 -103790 -243815
1874b43815q323r7259N3883J07140L9081o0117r3284N5206j1182n7109m5564J75624
$$ -243815 -252138 -349397 -295514 -188374 -149293 -209410 -302694 -247488 -258670 -315779 -361343 -185719
1862a85719J28499r1087k5186q842j0233O8815K7159n1735j86744J08485n027
$$ -185719 -57220 -148307 -173493 -182335 -192568 -123753 -96594 -148329 -335073 -226588 -231615
1851b31615k891Q2111o7959J5676J78019j07027J00438P383m7938j32599L560
$$ -231615 -234506 -152395 -220354 -204678 -26659 -133686 -33248 -25865 -73803 -206402 -202842
1840b02842N0707m4175J35894j47788K6010o6278J62424P7631l0K7113q5514k89094
$$ -202842 -152135 -196310 -60416 -208204 -182194 -248472 -86048 -8417 -8447 18666 -66848 -355942
1828c55942r809J05160J98082j049j15696k30806K40899J23925P4233j95434J13987
$$ -355942 -365751 -260591 -62509 -63558 -179254 -410060 -169161 -45236 28997 -166437 -52450
1817e2450j38446m6633q5951Q1179J92379O3929k49909j73759O2821J42117J68735
$$ -52450 -190896 -237529 -323480 -242301 -49922 14007 -235902 -409661 -346840 -204723 -35988
1806c5988M3223n0227j72022p0656O8722K33879L6699m3939K68j44401L5799p0131
$$ -35988 7235 -42992 -215014 -285670 -216948 16931 53630 9691 9959 -134442 -98643 -168774
1794a68774J39655J89038q6266q7416j28829O791J10667K72135j58064l4401r1103
$$ -168774 -29119 159919 73653 -13763 -142592 -135801 -25134 247001 88937 54536 -36567
1783c6567n7463n1271N4090P7494j20120J21903j21457p5169p2544J60392m9260
$$ -36567 -94030 -145301 -91211 -13717 -133837 -11934 -133391 -208560 -281104 -120712 -169972
1772a69972J40020n5502k52639J50288K2336J07225j02836J41588l25123N0373
$$ -169972 -29952 -85454 -338093 -187805 -165469 -58244 -161080 -19492 -344615 -294242
1762b94242j07200J98533m2803J07960O804P142j65326k0562J57717P6462p4608
$$ -294242 -401442 -202909 -245712 -137752 -130948 -123806 -289132 -309694 -151977 -75515 -150123
1751a50123j14072j03427J27540R9714M5694n5340J30707k15860J14938j91420
$$ -150123 -264195 -367622 -240082 -140368 -94674 -150014 -19307 -235167 -120229 -311649
1741c11649m652P1888J7950O3856M6518j56209M7184J04719K57086q266j92896
$$ -311649 -316301 -244413 -226463 -162607 -116089 -272298 -225114 -120395 136691 128425 -64471
1730f4471j03990k20610P0861J93039Q8411j30055O5028m8325k21595J43858J78438
$$ -64471 -168461 -389071 -318210 -125171 -36760 -166815 -101787 -150112 -371707 -227849 -49411
1719d9411L8859n992l26482k05577J95952J97278J26182O3308j82249o9121l590
$$ -49411 -10552 -16544 -343026 -548603 -352651 -155373 -29191 34117 -148132 -217253 -220843
1708b20843N3074o6749J94196o2138n0723O875Q5810J8844J6835j00208q2578
$$ -220843 -167769 -234518 -40322 -102460 -153183 -146308 -60498 -41654 -24819 -125027 -207605
1697b07605p3467M6759K0598J47588r6801K3373n7622p6850J35269J29123j02705
$$ -207605 -281072 -234313 -213715 -66127 -162928 -139555 -197177 -274027 -138758 -9635 -112340
1686a12340j15046n7546J25549j33412K85077j6375J4640m8051K17109k04530
$$ -112340 -227386 -284932 -159383 -292795 -7718 -24093 -9453 -57504 159605 -44925
1676d4925k6745m9826k19j59355L9423P4112J18725k8935j0129l0044R4729R5503
$$ -44925 -71670 -121496 -121715 -281070 -241647 -167535 -48810 -77745 -87874 -117918 -23189 72314
1664G2314p1998j26178m8645j05933J43375J23432L4019J14814J0684j20956p6291
$$ 72314 316 -125862 -174507 -280440 -137065 -13633 20386 135200 145884 24928 -51363
1653e1363n6422q3865J10475J2130N261J7113m0207n3819N9999p4063n2690l7092
$$ -51363 -107785 -191650 -81175 -69045 -63784 -46671 -86878 -140697 -80698 -154761 -207451 -244543
1641b44543j4573J9207R4793k6880R83O139P0837j9776Q5023j271j0416m9788
$$ -244543 -259116 -239909 -145116 -171996 -171013 -164874 -94037 -113813 -28790 -30061 -40477 -90265
1629i0265l4809q5592J27611j12274L9643q747J35513j65413J65481j29788o6305
$$ -90265 -125074 -210666 -83055 -195329 -155686 -164433 -28920 -194333 -28852 -158640 -224945
1618b24945P7387N7792m2508J35320j30819J4273n2581J52753Q1544j6758j98413
$$ -224945 -147558 -89766 -132274 3046 -127773 -113500 -166081 -13328 68216 51458 -146955
1607a46955k24536j562Q8559L32797J01834j48685o4228r5566k81093J61666K07773
$$ -146955 -371491 -373053 -284494 48303 150137 1452 -62776 -158342 -439435 -277769 -69996
1596f9996P8600j04548k1470j35178k3370K04931J48059O2845j80191l02668j28487
$$ -69996 8604 -95944 -117414 -252592 -275962 -71031 77028 139873 -40318 -342986 -471473
1585d71473K46667J48175J72707j54259r4283j32086j1657J40010J11497o9209
$$ -471473 -224806 -76631 96076 -58183 -152466 -284552 -296209 -156199 -44702 -113911
1575a13911j70153o8502J19767J42545N5301l4987J45619j53885m1459K1125O5354
$$ -113911 -284064 -352566 -232799 -90254 -34953 -69940 75679 -78206 -119665 -98540 -33186
$$ [...]
##END NTUPLES=NMR SPECTRUM
##END=
