##TITLE=1H_DE-80H_X3
 200.13MHz, d2o
 8 sc
 
 19ns.26.2.2025
##JCAMPDX= 6.0         $$ Bruker NMR JCAMP-DX V2.0
##DATA TYPE= NMR SPECTRUM
##DATA CLASS= NTUPLES
##ORIGIN= UXNMR, Bruker Analytische Messtechnik GmbH
##OWNER= pz
$$ XWIN-NMR		Version 3.5
$$ Fri Dec  5 11:32:06 2025 Russian Standard Time (UT+4h)  Yarkov@DPX200
##.OBSERVE FREQUENCY= 200.1313
##.OBSERVE NUCLEUS= ^1H
##.ACQUISITION MODE= SIMULTANEOUS
##.ACQUISITION SCHEME= undefined
##.AVERAGES= 8
##.DIGITISER RES= 18
##SPECTROMETER/DATA SYSTEM= spect
##.PULSE SEQUENCE= zg30
##.SOLVENT NAME= CDCl3
##.SHIFT REFERENCE= (INTERNAL, CDCl3, 0, 15.5067)
##AUDIT TRAIL= $$ (NUMBER, WHEN, WHO, WHERE, WHAT)
$$ ##TITLE= Audit trail, XWIN-NMR		Version 3.5
$$ ##JCAMPDX= 5.01
$$ ##ORIGIN= Bruker BioSpin GmbH
$$ ##OWNER= Yarkov
$$ C:/Bruker/XWIN-NMR/data/yarkov2/nmr/H-C/1/pdata/1/auditp.txt
$$ ##AUDIT TRAIL=  $$ (NUMBER, WHEN, WHO, WHERE, WHAT)
(   1,<2025-12-05 11:31:15.14 +0400>,<Yarkov>,<DPX200>,
      <created by zg, POWCHK disabled, PULCHK disabled
       configuration hash MD5:
       00 E9 B6 7A A2 85 ED C7 34 08 36 98 17 FE 4E 26
       data hash MD5: 16K
       0A 22 FC CF F0 8F 2B D2 6D 9A 61 EB 47 52 04 66>)
(   2,<2025-12-05 11:31:19.68 +0400>,<Yarkov>,<DPX200>,
      <Start of raw data processing
       efp BC_mod = 2 LB = 0.25 FT_mod = 6 PKNL = 1 PHC0 = -5312.553 PHC1 = 20.22191 SI = 16K 
       data hash MD5: 16K
       FB D8 37 72 41 67 8C 58 02 DF 4D 87 90 81 57 C4>)
(   3,<2025-12-05 11:31:24.25 +0400>,<Yarkov>,<DPX200>,
      <abs ABSG = 5 
       data hash MD5: 16K
       49 3A D3 7A 90 45 67 E7 E9 51 EA 5E AC 57 77 AE>)
$$ ##END=
$$ 
$$ hash MD5
$$ 63 E3 0E F7 74 95 1D DE D9 3A F8 29 35 99 83 2C
##$RELAX= 
##$RELAX= 
##$RELAX= 
##$RELAX= 
##$RELAX= 
##$RELAX= 
$$ Bruker specific parameters
$$ --------------------------
##$DU= <C:/Bruker/XWIN-NMR>
##$EXPNO= 1
##$NAME= <H-C>
##$PROCNO= 1
##$TYPE= <nmr>
##$USER= <yarkov2>
##$AMP= (0..31)
100 100 100 100 100 100 100 100 100 100 100 100 100 100 100 100 100 100 
100 100 100 100 100 100 100 100 100 100 100 100 100 100 
##$AQSEQ= 0
##$AQ_mod= 1
##$AUNM= <au_zg>
##$AUTOPOS= <>
##$BF1= 200.13
##$BF2= 200.13
##$BF3= 200.13
##$BF4= 200.13
##$BF5= 200.13
##$BF6= 200.13
##$BF7= 200.13
##$BF8= 200.13
##$BYTORDA= 1
##$CFDGTYP= 0
##$CFRGTYP= 5
##$CHEMSTR= <none>
##$CNST= (0..31)
1 1 145 1 1 1 1 1 1 1 1 1 1 1 1 1 1 1 1 1 1 1 1 1 1 1 1 1 1 1 1 1 
##$CPDPRG= <>
##$CPDPRG1= <>
##$CPDPRG2= <>
##$CPDPRG3= <>
##$CPDPRG4= <mlev>
##$CPDPRG5= <mlev>
##$CPDPRG6= <mlev>
##$CPDPRG7= <mlev>
##$CPDPRG8= <mlev>
##$CPDPRGB= <>
##$CPDPRGT= <>
##$D= (0..31)
0 0.7 0 0 0 0 0 0 0 0 0 0.03 0 0 0 0 0 0 0 0 0 0 0 0 0 0 0 0 0 0 0 0 
##$DATE= 1764919874
##$DBL= (0..7)
120 120 120 120 120 120 120 120 
##$DBP= (0..7)
150 150 150 150 150 150 150 150 
##$DBP07= 0
##$DBPNAM0= <>
##$DBPNAM1= <>
##$DBPNAM2= <>
##$DBPNAM3= <>
##$DBPNAM4= <>
##$DBPNAM5= <>
##$DBPNAM6= <>
##$DBPNAM7= <>
##$DBPOAL= (0..7)
0.5 0.5 0.5 0.5 0.5 0.5 0.5 0.5 
##$DBPOFFS= (0..7)
0 0 0 0 0 0 0 0 
##$DE= 6
$$ [...]
##$SUBNAM3= <"">
##$SUBNAM4= <"">
##$SUBNAM5= <"">
##$SUBNAM6= <"">
##$SUBNAM7= <"">
##$SUBNAM8= <"">
##$SUBNAM9= <"">
##$SW= 18.0517328524113
##$SWIBOX= (0..15)
0 0 2 0 0 0 0 0 0 0 0 0 0 0 0 0 
##$SW_h= 3612.71676300578
##$TD= 16384
##$TD0= 1
##$TE= 0
##$TE2= 300
##$TE3= 300
##$TEG= 300
##$TL= (0..7)
0 120 120 120 120 120 120 120 
##$TP= (0..7)
150 150 150 150 150 150 150 150 
##$TP07= 0
##$TPNAME0= <>
##$TPNAME1= <>
##$TPNAME2= <>
##$TPNAME3= <>
##$TPNAME4= <>
##$TPNAME5= <>
##$TPNAME6= <>
##$TPNAME7= <>
##$TPOAL= (0..7)
0.5 0.5 0.5 0.5 0.5 0.5 0.5 0.5 
##$TPOFFS= (0..7)
0 0 0 0 0 0 0 0 
##$TUNHIN= 0
##$TUNHOUT= 0
##$TUNXOUT= 0
##$USERA1= <user>
##$USERA2= <user>
##$USERA3= <user>
##$USERA4= <user>
##$USERA5= <user>
##$V9= 5
##$VALIST= <valist>
##$VCLIST= <CCCCCCCCCCCCCCC>
##$VD= 0
##$VDLIST= <DDDDDDDDDDDDDDD>
##$VPLIST= <PPPPPPPPPPPPPPP>
##$VTLIST= <TTTTTTTTTTTTTTT>
##$WBST= 1024
##$WBSW= 4
##$XGAIN= (0..3)
0 0 0 0 
##$XL= 0
##$YL= 0
##$YMAX_a= 312594
##$YMIN_a= -254916
##$ZGOPTNS= <>
##$ZL1= 120
##$ZL2= 120
##$ZL3= 120
##$ZL4= 120
##$ABSF1= 15.49018
##$ABSF2= -2.561669
##$ABSG= 5
##$ABSL= 3
##$ALPHA= 0
##$AQORDER= 0
##$ASSFAC= 0
##$ASSFACI= 0
##$ASSFACX= 0
##$ASSWID= 0
##$AUNMP= <proc_1d>
##$AZFE= 0.1
##$AZFW= 0.1
##$BCFW= 0
##$BC_mod= 2
##$BYTORDP= 0
##$COROFFS= 0
##$CY= -3
##$DATMOD= 1
##$DC= 0
##$DFILT= <>
##$DTYPP= 0
##$F1P= 0
##$F2P= 0
##$FCOR= 1
##$FTSIZE= 16384
##$FT_mod= 6
##$GAMMA= 0
##$GB= 0
##$INTBC= 1
##$INTSCL= 3.241238e-09
##$ISEN= 128
##$LB= 0.25
##$LEV0= 0
##$LPBIN= 0
##$MAXI= 10000
##$MC2= 0
##$MEAN= 0
##$ME_mod= 0
##$MI= 1.114404
##$NCOEF= 0
##$NC_proc= -6
##$NLEV= 6
##$NOISF1= 3.799351
##$NOISF2= 2.8
##$NSP= 0
##$NTH_PI= 0
##$NZP= 0
##$OFFSET= 15.5067
##$PC= 1
##$PHC0= -5312.553
##$PHC1= 20.22191
##$PH_mod= 1
##$PKNL= yes
##$PPARMOD= 0
##$PSCAL= 0
##$PSIGN= 0
##$REVERSE= no
##$SF= 200.130003003794
##$SI= 16384
##$SIGF1= 3
##$SIGF2= 2
##$SINO= 0.751879
##$SIOLD= 32768
##$SREGLST= <19F.Aceton>
##$SSB= 0
##$STSI= 16384
##$STSR= 0
##$SW_p= 3612.71676300578
##$SYMM= 0
##$S_DEV= 0
##$TDeff= 16384
##$TDoff= 0
##$TI= <>
##$TILT= no
##$TM1= 0
##$TM2= 0
##$TOPLEV= 0
##$USERP1= <user>
##$USERP2= <user>
##$USERP3= <user>
##$USERP4= <user>
##$USERP5= <user>
##$WDW= 1
##$XDIM= 16384
##$YMAX_p= 481125976
##$YMIN_p= -932915
$$ End of Bruker specific parameters
$$ ---------------------------------
##NTUPLES= NMR SPECTRUM
##VAR_NAME=  FREQUENCY,     SPECTRUM/REAL,   SPECTRUM/IMAG
##SYMBOL=    X,             R,               I
##VAR_TYPE=  INDEPENDENT,   DEPENDENT,       DEPENDENT
##VAR_FORM=  AFFN,          ASDF,            ASDF
##VAR_DIM=   16384,         16384,           16384
##UNITS=     HZ,            ARBITRARY UNITS, ARBITRARY UNITS
##FACTOR=    0.220516191357247, 1,           1
##FIRST=     3103.35582993655, 0,            0
##LAST=      -509.360933069229, 0,           0
##MIN=       -509.360933069229, -932915,     0
##MAX=       3103.35582993655, 481125976,    0
$$ Real data points
##PAGE= N=1
##DATA TABLE= (X++(R..R)), XYDATA
$$ [...]
7748B83500n8387q5291N0139J23280L4220M6256O9776M5462k7601O182p7620M7704
7736D57620o6855p322n9310O3703L2683m519L8907K7365p2753m6633L4938j7924
7724C79900k466p1170K8407N2091M5192j4588L9369Q648M5439o8622N7258p8220
7712D21238l5639O3526N2300k8497K9716L3601l322o7156j9067J9401n7377r6082
7700C12642n3917j3987M4038J02743p2506L3228p4447K632k8903N1667n8048l134
7688B42008L2928O4989M8186K2062l0304N545m1262j45100P814o8188K5511j1089
7676A53100J5895j7003P8664n2398n3427l2867n256k2716K4985N743N4827k9796
7664A19751Q7276K3074l2213l5881m8302l3648J335N535K8208j0162j4659N2115
$$ y = [283500, 225113, 139822, 189961, 313241, 347461, 393717, 463493, 508955, 481354, 487536, 409916, 457620, 390765, 383443, 324133, 387836, 420519, 416000, 454907, 482272, 409519, 362886, 397824, 379900, 377434, 306264, 334671, 386762, 431954, 417366, 456735, 465383, 510822, 442200, 499458, 421238, 385599, 449125, 501425, 472928, 502644, 536245, 532923, 465767, 446700, 466101, 408724, 312642, 258725, 244738, 288776, 391519, 319013, 352241, 277794, 280426, 251523, 303190, 245142, 242008, 274936, 339925, 388111, 410173, 379869, 385414, 344152, 199052, 206866, 138678, 164189, 153100, 168995, 151992, 230656, 178258, 124831, 91964, 86708, 63992, 88977, 94720, 149547, 119751, 207027, 230101, 197888, 162007, 113705, 80057, 81392, 86927, 115135, 104973, 90314, 142429]
7652A42429k4129N697l1590J2683n1609K5470j31756k7477K0666Q4653O0342p482
7640G7897K817P6261o6914L3115k3669j18241K1064N1899j5943J6830M5766k0362
7628H0520Q7910P9385k4756o4050k1363J231k4789o6826N3151l965P9l1062J8716
7615H4181O420O5645j823m8942J8314J8616k0557K950O3273l3762k1885K4707
7603A57137Q818m5717J2399L605K7859k1259N5419M6471R7317n5649K2139l225
7591C05314o8480K2873L8681N2387L2855k757J9036R1822m6022n875q2134m0081
7579C17619j1582L1377J8486N4952o988O2003K5047l1796o3631j4582K6415L190
7567D10510m7066l9480J17934M9315J02838j1911L0112L4432Q3200P291N196l4937
$$ y = [142429, 118300, 123997, 92407, 105090, 53481, 78951, -52805, -80282, -59616, 25037, 85379, 77897, 80714, 156975, 90061, 123176, 99507, -18734, 2330, 54229, 38286, 55116, 100882, 80520, 168430, 247815, 223059, 159009, 137646, 138877, 114088, 47262, 100413, 96448, 96527, 65465, 84181, 90601, 156246, 154423, 105481, 123795, 142411, 121854, 124804, 188077, 154315, 132430, 157137, 165955, 120238, 132637, 136242, 164101, 142842, 198261, 244732, 342049, 286400, 308539, 305314, 236834, 259707, 298388, 350775, 383630, 380873, 399909, 491731, 445709, 439834, 357700, 317619, 306037, 337414, 355900, 410852, 403864, 465867, 490914, 459118, 395487, 380905, 407320, 410510, 363444, 323964, 441898, 491213, 594051, 582140, 612252, 646684, 729884, 737175, 742371, 707434]
7555G07434k072L0875M1186o8173J02522p7500k2310L6930p7060o9536q8336J0749
7543E24709K2765k8003N137Q5206n7576m0226j4999L5678J0723k9165n8213n00
7531D55536k4973K9255M0374k505K5847j5713r8571m698q2930O7487J8582K9615
7519D37306L6595M938N1181m808o4254m3170n7507k9327J8910O130j6109j17448
7507B22437R9610M3477J5272l2508M6721Q535L383K6982o9813m0985L8196K9950
7495C91257J172l7984j4825M4078m5064J5014l1127P0478K6010k1964M7782L7133
7483D81960m3080K6081On8986m0153l0449R9592O345k6766K4401K0766K3707o1256
7470D22168j7635J38263k5604J5883o329q1566k7427L5926M6683l0906O7857j871
$$ y = [707434, 705362, 736237, 777423, 709250, 811772, 734272, 711962, 748892, 671832, 602296, 513960, 524709, 547474, 519471, 524608, 609814, 552238, 512012, 497013, 532691, 543414, 514249, 456036, 455536, 430563, 459818, 500192, 497687, 523534, 507821, 409250, 404552, 321622, 389109, 407691, 437306, 473901, 478839, 530020, 525212, 460958, 417788, 360281, 330954, 349864, 355994, 339885, 222437, 322047, 365524, 380796, 348288, 395009, 403544, 406927, 433909, 364096, 323111, 361307, 391257, 392429, 354445, 339620, 383698, 338634, 353648, 322521, 392999, 419009, 397045, 444827, 481960, 438880, 464961, 464967, 405981, 365828, 335379, 434971, 441316, 414550, 438951, 459717, 483424, 422168, 404533, 542796, 517192, 533075, 526746, 445180, 417753, 453679, 500362, 469456, 537313, 535442]
7458E35442l9224J1163O0241q8446n618O736J01999J1866Q418L4305l3639j9026
7446E84217L5045O673J8155L4935o3711n911J1627N0896j7131Q629P2100K597
7434G38121l1108k2342O1701K7273O758R575M9819M3484n1614J5280M9698J14807
7422A011452L5812m6623o1655J12020J0051j27010N4533N684r577J2749J20937
7411A118373K4017K3679l8991J02066N602L9207M4677O3256M9810L0217J216m8255
7399A414874J40452J18464P5038L8019K227J05285J09143M012J53840R212J19479
7388B290045P9517J51832O1409J29538R0902J14686K01103K20693J79367K04675
7378C723767J33728J88958K69809K57355L22689L24212K81080L30156L77756M95802
$$ y = [535442, 496218, 507381, 567622, 479176, 473558, 480294, 582293, 594159, 602577, 636882, 603243, 584217, 619262, 625935, 644090, 679025, 615314, 609403, 621030, 671926, 654795, 663424, 735524, 738121, 707013, 684671, 746372, 773645, 780403, 789978, 839797, 883281, 831667, 846947, 896645, 1011452, 1047264, 1000641, 938986, 1051006, 1061057, 934047, 988580, 994264, 984687, 997436, 1118373, 1142390, 1166069, 1127078, 1229144, 1234746, 1273953, 1318630, 1381886, 1431696, 1461913, 1463129, 1414874, 1555326, 1673790, 1748828, 1786847, 1789074, 1894359, 2003502, 2007514, 2161354, 2170566, 2290045, 2369562, 2521394, 2582803, 2712341, 2803243, 2917929, 3119032, 3339725, 3519092, 3723767, 3857495, 4046453, 4316262, 4573617, 4896306, 5220518, 5501598, 5831754, 6209510, 6705312]
7368F705312P06203N30104O94926O25735N85015O14021O60913N31418N57527M84749
7358A2695923M98687L58886K12721J55002p4262j49615l92006m48403o11041o34268
7348A1611624p02237p68906p68964o72358o69056n73874o27444n39491m76173
7339E813121m27107m53831l18080l20021l28770k99353k71203k00831j01566j72814
7329B919545j52549j76429j83271j43052j69609q4246m4084k3450j48986n8464
7319A735405j72707J5872n7752o9114m8649j03566m8701N262m2096m0268o8643
7308A105043q4655r3613m6904O1689j14101K9425o0010N696J1217n0900j2987
7297G49900Q460j2181q766j09821n8275P2283J9301l4728K0750p6380j9128K4754
$$ y = [6705312, 7411515, 7941619, 8636545, 9262280, 9847295, 10461316, 11122229, 11653647, 12211174, 12695923, 13194610, 13553496, 13766217, 13921219, 13846957, 13697342, 13305336, 12856933, 12245892, 11611624, 10909387, 10140481, 9371517, 8699159, 8030103, 7456229, 6828785, 6289294, 5813121, 5386014, 4932183, 4614103, 4294082, 3965312, 3665959, 3394756, 3193925, 3092359, 2919545, 2766996, 2590567, 2407296, 2264244, 2094635, 2010389, 1966305, 1942855, 1793869, 1735405, 1562698, 1578570, 1520818, 1451704, 1403055, 1299489, 1250788, 1256050, 1213954, 1173686, 1105043, 1020388, 926775, 879871, 941560, 827459, 856884, 796874, 802570, 813787, 762887, 749900, 758360, 746179, 737413, 627592, 569317, 641600, 660901, 626173, 646923, 570543, 551415, 576169]
7285E76169o9716L8462n8625j14915R109J5821J7291J61289k199l993k2098J7065
7273E63660j09468n6626n7742K931j6149L1172J0005J5111K2935K1352q5682j5123
7261C26376l2523l6923j3143n083O9134k5004J5097J378N4631l4763m141q7169
7249B27867N2928k6391N7874J2360m0924j6674K1804k2660j1504M4110j06047
7238A92743l4226Q9863R1369p481J2506L01R7369p1900q5877r8998K6067N925
7226B17661N3387L8053K5925o4382J20675k7456q6689q4295Q4722J5563m1318
7215B51846J55508P6014K5834Q509K3228l7293J3709n7402j8602q4085n5235l4155
7203B67876N0900o2369M9699l0803J3181M472K1252n222n2716l3285j8817k4117
$$ y = [576169, 506453, 544915, 486290, 371375, 380484, 396305, 413596, 574885, 572686, 568693, 546595, 563660, 454192, 397566, 339824, 342755, 326606, 357778, 367783, 382894, 405829, 427181, 341499, 326376, 293853, 256930, 243787, 238704, 307838, 282834, 297931, 299309, 353940, 319177, 315036, 227867, 280795, 254404, 312278, 324638, 283714, 267040, 288844, 266184, 254680, 298790, 192743, 158517, 248380, 339749, 332268, 344774, 345075, 442444, 370544, 284667, 185669, 211736, 217661, 271048, 309101, 335026, 270644, 391319, 363863, 277174, 192879, 277601, 293164, 251846, 407354, 483368, 509202, 517711, 540939, 503646, 517355, 459953, 441351, 357266, 302031, 267876, 318776, 256407, 306106, 275303, 288484, 292956, 314208, 308986, 256270, 222985, 204168, 180051]
7191A80051L2187Q031K9368P1922l8172j959l3505j3424l7564J9760J5408K6864
7179B58967k1337L9145O6927n2494K858k4794p7166L665k734j3134K2663J455
7167B04021M2602N5078L114M1557O3649j00330k3342P8293K0036j5397K6547K7737
7155D23565Q0021j12613K5518p7438m7718k0194K9970o0034l7375M7397J9665
7144B70764K6890M9824L9576m2824j5737m1096R71k8430J9955M893K2113Q184
7132C15083M5063j17426j2359M0333L9104q5272l8548R146N8730P2419N3995k1706
7120C58562K1723L3866m9178j8781L4851L2808L4906k3616m2972k4793N569k4907
7108C38038o2027q267j8492m5400O634O8643K8835K2693k863n4353m6876L2340
$$ y = [180051, 212238, 220269, 249637, 321559, 283387, 281428, 247923, 234499, 196935, 216695, 232103, 258967, 237630, 276775, 343702, 291208, 294066, 269272, 192106, 195771, 193037, 179903, 202566, 204021, 246623, 301701, 304815, 346372, 410021, 309691, 286349, 364642, 384678, 369281, 395828, 423565, 503586, 390973, 416491, 339053, 291335, 271141, 301111, 241077, 203702, 251099, 270764, 297654, 347478, 387054, 344230, 328493, 287397, 288368, 259938, 279893, 284786, 306899, 315083, 360146, 242720, 230361, 270694, 309798, 224526, 185978, 195124, 253854, 326273, 380268, 358562, 380285, 414151, 364973, 346192, 381043, 413851, 448757, 425141, 382169, 357376, 362945, 338038, 276011, 267744, 249252, 203852, 210486, 279129, 307964, 330657, 327794, 273441, 226565, 258905]
7096B58905P3682J3012K0048q3918k6427K7841J4793r777N6788J6627q91P1255
7084D31938K1093k023L5063L9458O8815J15555J07790J24311j2479m7525j0691
7073H71305J2591k9523M2095P748J5717m7171L1095j8094j10390r5804j4691j12375
7061E52503n7804m76l2446r6850m0292J6201K0563M6287m8586k0399K3026R600
7049C71327k4252l1862n1905M196Q359Q289L2471O3242l4048p1026j986k8458
7037B44347j2551J3930N621L0269Q931Q2188N665l4731o7621p7984L8273J2710
7025B49047L5687N6558m1652k9317J63748J2758q1593n1393m8437n303K1524K0584
7013C02211P1825L1399K5640K9006R4800m614L3889O2351j34953M648N5794j12435
$$ y = [258905, 332587, 345599, 365647, 281729, 255302, 283143, 297936, 288159, 344947, 361574, 360683, 431938, 453031, 451008, 486071, 525529, 594344, 709899, 817689, 942000, 929521, 881996, 871305, 883896, 854373, 896468, 904216, 919933, 872762, 903857, 885763, 775373, 679569, 664878, 552503, 494699, 494223, 461777, 364927, 324635, 340836, 361399, 407686, 359100, 338701, 361727, 371327, 347075, 315213, 263308, 267504, 275863, 284152, 316623, 379865, 345817, 274791, 272805, 244347, 231796, 245726, 251347, 281616, 290547, 372735, 378400, 343669, 276048, 198064, 236337, 249047, 284734, 341292, 299640, 270323, 434071, 446829, 365236, 313843, 265406, 260103, 281627, 302211, 374036, 405435, 431075, 460081, 554881, 550267, 584156, 646507, 511554, 516202, 571996, 459561]
7001D59561j7530N9881j9910o7449r364O5307o0676n1717l724L6898M1596Q0854
6989E13727n2635K027L1141l6877Q047L2675r04p3861o5396k7796O481K1483n933
6976C52179L9543M9923n074O8263K7413k4282m7232P0739J00687O4633J2648o7890
6964F41550P3071n278o4149l7453k6568l7511K789M1853K1786J03677R1491o9158
6952G36100p6270l7866j5778j09257j02648n7121J1837p1m230J4000J32860o8805
6940D22751J6635M647o6830p910n9839O0606M7446P3405M6079l8145k0478K6484
6928E04851k2425l9391k2325J1034N8260l2259j1805k5009O9888j2785o2341o4495
6916C51198m5279l798j2815L8290Q175J09540O3609P9760K6562J9349K5333O0184
$$ y = [459561, 442031, 501912, 482002, 414553, 405189, 470496, 409820, 358103, 354379, 391277, 432873, 513727, 461092, 463119, 494260, 457383, 465430, 498105, 497201, 423340, 357944, 330148, 336629, 358112, 352179, 391722, 441645, 436571, 504834, 532247, 507965, 460733, 531472, 632159, 696792, 709440, 641550, 714621, 709343, 645194, 607741, 581173, 543662, 546451, 588304, 610090, 713767, 805258, 736100, 659830, 621964, 606186, 496929, 394281, 337160, 348997, 348926, 344696, 358696, 491556, 422751, 439386, 444033, 377203, 369293, 309454, 370060, 417506, 490911, 536990, 498845, 478367, 504851, 482426, 443035, 420710, 431744, 490004, 457745, 445940, 420931, 490819, 478034, 415693, 351198, 305919, 302121, 289306, 327596, 335771, 445311, 508920, 588680, 615242, 634591, 659924, 720108]
6904G20108N3046p0539k0613q2399n2193m9835j4281J2617P7382J02948N2042
6893G28283Q397n9606L0946j02436r4060p5501N9252K383j5157j3886J7538K795
6881D88948M0786O1147K6553o931q016J9646J9812K8718P156m7829m6678l3912
6869E49400m6560j6626o5762j1215L354l4857L7820J1918J3660k7052l2070k2634
6857C59376L4402K7490n007k9805J6517K0634l905r8496L4903N7490N3426o4619
6845D02406l6737L0089l4812N0806R8667l705l2916P8098o9683k2959o953j3359
6833D38942N4213L8852j3872k5587M4884K0403J4795R9755P7068L5922k3912K275
6821G63738l8617k3242K4668r309p166m9213o4019o6608j7086q6576J3300L2852
$$ y = [720108, 773154, 702615, 682002, 599603, 547410, 497575, 483294, 495911, 573293, 676241, 728283, 736680, 677074, 708020, 605584, 511524, 436023, 495275, 497658, 482501, 468615, 486153, 488948, 529734, 590881, 617434, 610503, 602487, 622133, 641945, 670663, 677819, 629990, 583312, 549400, 502840, 486214, 420452, 409237, 412591, 377734, 415554, 427472, 441132, 414080, 382010, 359376, 393778, 421268, 416261, 386456, 402973, 423607, 419702, 321206, 356109, 413599, 467025, 402406, 365669, 395758, 360946, 411752, 510419, 506714, 473798, 551896, 482213, 459254, 452301, 438942, 493155, 532007, 518135, 492548, 537432, 557835, 572630, 672385, 749453, 785375, 761463, 763738, 725121, 701879, 726547, 717238, 710072, 660859, 596840, 530232, 513146, 426570, 439870, 472722]
6809D72722L4063k0763N650N4343n8286J5337J5180L1009J4022k4893o0018j3472
6797D64894j800Q748N3418K1682K9158j6682j4367K5642m6260N2313j6600r8440
6785D61706J1185N4637p850K993N8281m9425o9596L0528Q6482J4439n138J21785
6773G10027O6768N9649K9239M7744P6492J3663n1063o2456j5996n0552r7017j5217
6761G11281q7227l0390o6142M683K6095Q070k8060j383N0688O226j5157j5953
6749E62731o0463M0292M0583m0377j0916K0075k1420r507J9119N2357M4563j858
6737F35179M7679J828N1057k0617p502J2451M9146J54078J20071n9157k3716J1260
6725I71757N297j4451o8504k6416j02095L5625M353O6298P8477Q3750J01166j0533
$$ y = [472722, 506785, 486022, 491672, 546015, 487729, 503066, 518246, 549255, 563277, 538384, 478366, 464894, 463094, 471842, 525260, 546942, 576100, 559418, 545051, 570693, 524433, 576746, 560146, 461706, 472891, 527528, 519678, 522671, 580952, 531527, 461931, 492459, 578941, 593380, 588242, 710027, 776795, 836444, 865683, 913427, 989919, 1003582, 952519, 890063, 874067, 823515, 726498, 711281, 624054, 593664, 527522, 532205, 558300, 566370, 538310, 536927, 587615, 593841, 578684, 562731, 502268, 542560, 583143, 542766, 531850, 551925, 530505, 520998, 540117, 592474, 637037, 635179, 682858, 684686, 735743, 715126, 707624, 720075, 769221, 923299, 1043370, 984213, 960497, 971757, 977054, 962603, 894099, 867683, 765588, 801213, 805566, 871864, 950341, 1034091, 1135257, 1124724]
6713A124724m8847p8803p8410R091m3084K5541J3085J24578R2833O6370J85o8093
6701A139170p1772r6041n9229j5710Q998m3293J5139q2801N4110M3202O4934O4024
6689A020731J64288J5058l952j13773n8805r2706l160m8153L7519L9631L2042
6678I88720J58595R7597j5249k4285k1526n5538l1640j22992L915j3948m270l0620
6666I28759j691k1230p50k477n145n2311M6728M79j0912m499N7022P1014K2664
6653A027651q177J04640K1545J0543J05586J10817J3202n9514r814q4885K5552
6642A257146j3045k4274n8163j1774j6667j12697k9936j3557Q597R2083J3633
6631A091346K9175j7903J4098K9350J32246L3892l4438L6482N9317K2999J6596
$$ y = [1124724, 1075877, 997074, 918664, 927755, 884671, 910212, 923297, 1047875, 1140708, 1207078, 1207263, 1139170, 1067398, 971357, 912128, 896418, 905416, 862123, 877262, 794461, 848571, 891773, 956707, 1020731, 1185019, 1200077, 1196125, 1082352, 1023547, 930841, 927681, 879528, 917047, 956678, 988720, 1147315, 1244912, 1229663, 1205378, 1183852, 1128314, 1096674, 973682, 977597, 963649, 959379, 928759, 927068, 905838, 905088, 902611, 897466, 845155, 891883, 892362, 881450, 876951, 933973, 1004987, 1027651, 1019474, 1124114, 1145659, 1156202, 1261788, 1372605, 1385807, 1326293, 1316479, 1231594, 1257146, 1244101, 1219827, 1161664, 1149890, 1133223, 1020526, 990590, 977033, 985630, 1077713, 1091346, 1120521, 1102618, 1116716, 1146066, 1278312, 1312204, 1277766, 1314248, 1373565, 1396564, 1413160]
6620A413160J5686o0682N2750o6452k393J666n8867o368j5344l1243j05156J0348
6608A147105L7673N6880M250r0258p383k7365k5444L7682O40Q5830L5582K0960
6596A276152m1664k680Q885l4067k8842k5811K3297L6797j0360P6457L2529q783
6584A301910q3140n940L8085M2034k8508q751j039K3356O406L0986P4173P909
6572A397481l5038L7719n0709j3212O4207M154O0802N333m5138J7777M8336j3582
6560A478130J00834P7532M3877l5685J49478L3029Q6096M4600N2102J1579k1696
6549B019876p260n7327m1546L8728P4413J8551o226Q0193Q6654J5663P9497J45309
6537B446525O4643N4690K47646K10527L00415K82212M67607N41886O96729O31628
$$ y = [1413160, 1428846, 1368164, 1420914, 1354462, 1352069, 1353735, 1294868, 1288500, 1273156, 1241913, 1136757, 1147105, 1184778, 1241658, 1245908, 1155650, 1148267, 1120902, 1095458, 1133140, 1133780, 1219610, 1255192, 1276152, 1234488, 1231808, 1240693, 1206626, 1177784, 1151973, 1175270, 1212067, 1201707, 1278164, 1310693, 1301910, 1218770, 1212830, 1250915, 1292949, 1264441, 1255690, 1254651, 1278007, 1284413, 1315399, 1389572, 1397481, 1362443, 1400162, 1349453, 1336241, 1400448, 1404602, 1465404, 1470737, 1425599, 1443376, 1491712, 1478130, 1578964, 1656496, 1700373, 1664688, 1814166, 1847195, 1933291, 1977891, 2029993, 2041572, 2019876, 2012616, 1955289, 1913743, 1952471, 2026884, 2045435, 2039209, 2119402, 2206056, 2221719, 2301216, 2446525, 2511168, 2565858, 2813504, 3024031, 3324446, 3606658, 4074265, 4616151, 5312880, 5944508]
6527E944508M24443J74089j78820l76461n63610o76143n64284m30671k72182k87485
6517C193384k46069q6876r6380j6070q2335R8571p3061k5242k08170l6915j33332
6506B287505m3203j58904p6593o4502l2098p051K0008o4245K3868N188l2922J5323
6494A872374l3505m4004N8780O4877p0787k6438m3831P7078l3090N6417p3718
6483A804153L2029l7150P4314r234O9214r6962J1472R168O3411j2742r3157M0546
6471A855062M4222M6999r6541M8326l5089Q0443l4269Q9057L185K1550o8300M550
6459A959195o6253L4870J3737J2265N9714n0722M7288k6387q9546k2961L0323
6448A901523L4077J47942o0171J46236k4412J04510j2890j8615q6635P9641l7184
$$ y = [5944508, 6368951, 6543040, 6364220, 5987759, 5424149, 4748006, 4183722, 3753051, 3480869, 3193384, 2947315, 2860439, 2764059, 2747989, 2665654, 2764225, 2691164, 2665922, 2457752, 2420837, 2287505, 2244302, 2085398, 2008805, 1944303, 1912205, 1905154, 1925162, 1860917, 1884785, 1889973, 1857051, 1872374, 1838869, 1794865, 1853645, 1918522, 1847735, 1821297, 1777466, 1854544, 1821454, 1877871, 1804153, 1836182, 1799032, 1873346, 1864112, 1933326, 1836364, 1847836, 1857004, 1920415, 1907673, 1814516, 1855062, 1899284, 1946283, 1849742, 1898068, 1862979, 1943422, 1909153, 1998210, 2001395, 2022945, 1954645, 1959195, 1892942, 1927812, 1941549, 1953814, 2013528, 1962806, 2010094, 1983707, 1894161, 1871200, 1901523, 1935600, 2083542, 2023371, 2169607, 2145195, 2249705, 2236815, 2218200, 2131565, 2211206, 2174022]
6437B174022P3115J3450R8902N8948J6871k8776J1178n5213k2923R0048p0600
6426B359022K0475l3357J51241N0155Q0826r0073O1386k1918K0544l1447R7629
6415B664483O4318J49060k581k6701Q437K8337N7239K8538l9128l5447K9012P286
6403B932853J21694k7842J19943L9814Q9585J850K5572j31996Q4103J8606J29380
6392C403562R3070J17446Q5644J07272Q6094J29333J13910o106P2531Q310L3276
6381D244342N2956J43276M4021J48402M5605J97277R3755J28953K6764J08530
6371E233881J30285J59640Q9931K89506K15115J53479J63315K13677K65195J16341
6361G030365K18814K14249M08059L36118M31958M36933O52727P53223J018891
$$ y = [2174022, 2247137, 2260587, 2359489, 2418437, 2435308, 2406532, 2417710, 2362497, 2339574, 2429622, 2359022, 2379497, 2346140, 2497381, 2547536, 2628362, 2538289, 2599675, 2577757, 2598301, 2566854, 2664483, 2728801, 2877861, 2875280, 2848579, 2857016, 2885353, 2942592, 2971130, 2932002, 2896555, 2925567, 2932853, 3054547, 3026705, 3146648, 3186462, 3276047, 3277897, 3303469, 3171473, 3255576, 3274182, 3403562, 3496632, 3614078, 3699722, 3806994, 3893088, 4022421, 4136331, 4130225, 4202756, 4211066, 4244342, 4297298, 4440574, 4484595, 4632997, 4678602, 4875879, 4969634, 5098587, 5125351, 5233881, 5364166, 5523806, 5613737, 5903243, 6118358, 6271837, 6435152, 6648829, 6914024, 7030365, 7249179, 7463428, 7871487, 8207605, 8639563, 9076496, 9729223, 10482446, 11501337]
6352A1501337J304659J923945K974399M746868N736756M814808L77372k141351
6344C1238793k907144l087743j597130o10008m07838o03022q10733r00963n22784
6335A9791428j21871N84475J078216J551440J330096R03217O3420m25190p31963
6326B4023268l59416J02604P14312J246794J517601J115119N72822m2709k88095
6317B8602300k08367K68601J094567K148770L317764N026456O861584Q251548
6309E5363223Q547201O600007K646111k126000o249587q103758p970920o775602
6301D1930675n007429l410735j965970r05291J77197J123859K285057L695929
6293C7923292N266039O760003P636663P076865N266746L455694J869671m01380
$$ y = [11501337, 12805996, 14729941, 17704340, 22451208, 28187964, 33002772, 33380144, 31238793, 28331649, 25243906, 23646776, 23036768, 22628930, 22025908, 21215175, 20314212, 19791428, 19669557, 20254032, 21332248, 22883688, 24213784, 25117001, 25180421, 24755231, 24023268, 23663852, 23766456, 24480768, 25727562, 27245163, 28360282, 28933104, 28890395, 28602300, 28393933, 28662534, 29757101, 31905871, 35223635, 40250091, 47111675, 55363223, 63910424, 70510431, 73156542, 71030542, 64780955, 56677197, 48706277, 41930675, 36923246, 33512511, 31546541, 30641250, 30818447, 31942306, 34227363, 37923292, 43189331, 49949334, 57585997, 64662862, 69929608, 73385302, 75254973, 74853593]
6285G4853593l408899o123417p791737q118543p404469o009232m651713l502761
6277B7842822k580239j691766j170866n69108k55731J36413M66116P99420J172771
6268B4149832J599381K011621K653742L606270M592784N800169P121442P639086
6260E9174327O918489N038434K644269O08477j473488l634893n647356o893965
6252E6734294p168231o449380n322978l943867k721858j470722n17368M86693
6244B9626583J515655K718682M369751O084468P265676P108652N055794J789367
6236F5534628k016139n129162o819230p119621o307149n118381l732667k598268
6228B6694011j548830o72680K9991K27457R0053n31536j075355j151755j050656
$$ y = [74853593, 71444694, 65321277, 57529540, 49410997, 42006528, 35997296, 31345583, 27842822, 25262583, 23570817, 22399951, 21830843, 21575112, 21711525, 22177641, 22977061, 24149832, 25749213, 27760834, 30414576, 34020846, 38613630, 44413799, 51535241, 59174327, 66092816, 71131250, 73775519, 74383996, 72910508, 69275615, 63628259, 56734294, 49566063, 43116683, 37793705, 33849838, 31127980, 29657258, 29139890, 29626583, 31142238, 33860920, 38230671, 44315139, 51580815, 58689467, 63745261, 65534628, 63518489, 58389327, 51570097, 44450476, 38143327, 33024946, 29292279, 26694011, 25145181, 24472501, 24502492, 24729949, 24820002, 24288466, 23213111, 22061356, 21010700]
6219B1010700p22179k03998J86788L67968J71770l59916p49759j168969j218149
6210A7314256j045721o13467k23128J85174J95055q0060o63398j066844j441473
6201A2560394j470820j310360j101919r57043p50562n61905l95740k87345k08454
6192E516246k64615j53786j30309k01432l7127j32178q9344j16361o2862p5056
6182D253176q0714m1466r3932k3666k9028k2211R259O6495M9456m5077o6742o7805
6170C907745n5015j2107K5682j36328j47326o7801j03040o1981j04451k1803n7619
6159C165956j73136k1727J0067q2987l5612J0131m0086l1225N308l2471m1706
6148B732512K8924M2447K1185O3792J19959m3898o3214J2463m4870M5920l2074
$$ y = [21010700, 20288521, 20084523, 20271311, 20639279, 20811049, 20451133, 19701374, 18532405, 17314256, 16268535, 15655068, 15431940, 15617114, 15812169, 15732109, 15068711, 14001867, 12560394, 11089574, 9779214, 8677295, 7720252, 6969690, 6407785, 6012045, 5724700, 5516246, 5251631, 5097845, 4967536, 4766104, 4728977, 4596799, 4507455, 4391094, 4328232, 4253176, 4172462, 4130996, 4037064, 4013398, 3984370, 3962159, 3971418, 4037913, 4087369, 4042292, 3975550, 3907745, 3852730, 3840623, 3866305, 3729977, 3582651, 3514850, 3411810, 3349829, 3245378, 3223575, 3165956, 2992820, 2971093, 2981160, 2898173, 2862561, 2872692, 2832606, 2801381, 2806689, 2774218, 2732512, 2761436, 2803883, 2825068, 2888860, 3008819, 2964921, 2901707, 2914170, 2869300, 2915220, 2883146]
6137B883146L8751N8048k8059o5296j2412K218q6870j44231j8789j71950j91693
6126B262863m1085j52455j36936K5185k4927r6065P8663J9938j8185k3197j03160
6115A790639j19492j08155n6293l9401j07854l6675j48432k1178j6102K8959j5378
6104A150638l9262P0473P8144q7867m5894L8531r538m3950n0543N6181J08180
6093A225093L0201k4715J9752N4431J58037L5486N541j8918k0231Q679K6531O9180
6081A569067K428j1871m0884J4807o8726n6481l7720J4162o3368J9603K1970L3644
6069A396631p6709o1370P693N6854m9927L8607n8035N3470k0331o0437L6652l6956
6057A226142j3940j1065m4861q8200K9316Q535N6692N2229O0526M9937P3137J198
$$ y = [2883146, 2921897, 2979945, 2951886, 2886590, 2874178, 2876396, 2789526, 2645295, 2626506, 2454556, 2262863, 2221778, 2069323, 1932387, 1957572, 1932645, 1836580, 1915243, 1935181, 1916996, 1893799, 1790639, 1671147, 1562992, 1506699, 1467298, 1359444, 1322769, 1174337, 1153159, 1137057, 1166016, 1150638, 1111376, 1181849, 1259993, 1172126, 1126232, 1164763, 1155225, 1111275, 1060732, 1116913, 1225093, 1255294, 1230579, 1250331, 1304762, 1462799, 1498285, 1503826, 1484908, 1464677, 1473356, 1499887, 1569067, 1571495, 1559624, 1518740, 1533547, 1464821, 1408340, 1370620, 1384782, 1321414, 1341017, 1362987, 1396631, 1319922, 1258552, 1266245, 1323099, 1273172, 1311779, 1253744, 1307214, 1286883, 1226446, 1263098, 1226142, 1212202, 1201137, 1156276, 1068076, 1097392, 1105927, 1162619, 1214848, 1275374, 1325311, 1398448, 1399646]
6045A399646N9892N126J12355m6096K7268l1189L6444N9230n7141L999n5892N6889
6033A570531o532L2736M3550M9745R8522J07523N8002J60578J04113O6523j13916
6022B171375m246j46532o6878l3794q151o2580m0363P807L4123L5535n2552P9962
6010A913706L4163J2855l1645K2380n9982L9686L5771O7678P41M7413m2880Q7594
5998B127480J06143K05692L4531K26030K60762K70181J79317O3528j81161k03251
5988C089252k29823j89162m3026j11813p3861j04999m2015j16378J1137j35851
5978B053461r1052k2410P196j299M426l8017M9258L2609N6455L2262P8537J07489
5966B268915J25687J31308J86304K85047L35577M74310K82249J56691l5194r8654
$$ y = [1399646, 1459538, 1464664, 1577019, 1530923, 1558191, 1527002, 1563446, 1622676, 1565535, 1569534, 1513642, 1570531, 1563999, 1596735, 1640285, 1690030, 1788552, 1896075, 1954077, 2114655, 2218768, 2285291, 2171375, 2167129, 2020597, 1953719, 1919925, 1911774, 1849194, 1808831, 1816638, 1850761, 1886296, 1833744, 1913706, 1947869, 1960724, 1929079, 1951459, 1891477, 1931163, 1966934, 2034612, 2035353, 2082766, 2039886, 2127480, 2233623, 2439315, 2473846, 2699876, 2960638, 3230819, 3410136, 3473664, 3292503, 3089252, 2859429, 2670267, 2627241, 2515428, 2441567, 2336568, 2294553, 2178175, 2189312, 2053461, 1962409, 1939999, 1947195, 1945896, 1950322, 1912305, 1961563, 1994172, 2050627, 2082889, 2161426, 2268915, 2394602, 2525910, 2712214, 2997261, 3332838, 3807148, 4089397, 4246088, 4210894, 4112240]
5956D112240k07511j86471j50843o5300J2055O3117J48625J97009K91383M00646
5946D614950L99755M09024K50417J18520q1317k61687l57602m80304m60892m13301
5936C737563l14918l15149k68168j91957j00482r2144J2661P0841R8277L4405
5926B670929O7646K1466j12782j49242q5210q7459O056L2065j9249k9476j65161
5915B149583L17p1303q5892j8839o4121p7083j2619M3941L0540J1827J29675Q719
5903B044745P9702n2087l116K9920j8819m4783J5849O3995N7452J01437l770j3588
5891B256937K3326k1520j3427k991N8767M6365R8231J19554O7482J09125J4685
5880B756534O2371k7222K9347l3339k7528L1312j7789L4092M7512n374K9082n57
$$ y = [4112240, 3904729, 3718258, 3567415, 3502115, 3514170, 3577287, 3725912, 3922921, 4214304, 4614950, 5014705, 5423729, 5674146, 5792666, 5711349, 5449662, 5092060, 4611756, 4150864, 3737563, 3422645, 3107496, 2839328, 2647371, 2546889, 2454745, 2467406, 2538247, 2636524, 2670929, 2738575, 2760041, 2647259, 2498017, 2412807, 2325348, 2331404, 2363469, 2344220, 2314744, 2149583, 2149900, 2078597, 1992705, 1973866, 1909745, 1832662, 1820043, 1863984, 1894524, 1906351, 2036026, 2044745, 2124447, 2072360, 2069244, 2099164, 2080345, 2035562, 2051411, 2115406, 2172858, 2274295, 2270525, 2256937, 2280263, 2258743, 2245316, 2242325, 2301092, 2347457, 2445688, 2565242, 2632724, 2741849, 2756534, 2818905, 2791683, 2821030, 2787691, 2760163, 2791475, 2773686, 2807778, 2855290, 2849916, 2878998, 2878441]
5868B878441r8710o0323K3866r9361l7794p7857K7431q454o5342p8851n767p6284
5856B320995j04967K0543n8474r974L4980L2015J15374L0634P5363j5741m3458
5845B397290m1470j11682q8690l0919p2022J2788L3343L2905L2983L0313O9362
5834B264201K236k2971L3461J5212M0646K6553R0886l7632q7122k2161K3506j8335
5822B308480p6283j14319r055K0734n4706O0336O7734P2276Q9591M1389N207M576
5810B415960K8223O0986L2560N8636L7068P5200J45112J93760M5475Q2823R5504
5799C271307J05363M8699p8388m9951p3444q2366m6832l5081r5326J8393m3255
5788B939119q1497Q721o807n4110m273m8549K3941k551j3887j03408o6029q9888
$$ y = [2878441, 2779731, 2719408, 2743274, 2643913, 2606119, 2528262, 2555693, 2547239, 2481897, 2403046, 2397279, 2320995, 2216028, 2236571, 2178097, 2168123, 2203103, 2235118, 2350492, 2381126, 2456489, 2440748, 2397290, 2355820, 2244138, 2155448, 2124529, 2052507, 2065295, 2098638, 2131543, 2164526, 2194839, 2264201, 2266437, 2243466, 2276927, 2292139, 2332785, 2359338, 2450224, 2412592, 2325470, 2303309, 2326815, 2308480, 2232197, 2117878, 2108823, 2129557, 2074851, 2135187, 2202921, 2275197, 2364788, 2406177, 2411384, 2415960, 2444183, 2505169, 2537729, 2596365, 2633433, 2708633, 2853745, 3047505, 3092980, 3175803, 3271307, 3376670, 3425369, 3346981, 3297030, 3223586, 3141220, 3094388, 3059307, 2963981, 2982374, 2939119, 2857622, 2866343, 2859536, 2805426, 2801153, 2752604, 2776545, 2773994, 2760107, 2656699, 2590670, 2500782]
5776B500782j57162q7395o7696m9452M4352M0065j3411J27970K7330L8659J5066
5765B419108l725J5184O9151M1969L0800l714P9376K6070P6886k0622K547O6956
5753B799986N8188P1855L7425r477o8794j15567m8496l1838j6106k9648m6532
5742B600996l232o2960K5747k5961l8000P6455J00622l0299N8589J54483Q2392
5731B938832Q7550Q3533K9715j80578n7841m6996n1851m3902R389n7994j2885
5720B696972J3781R2364J8369M0006N4095O4475K7507Q4002O7833m3230m453m9227
5708C062494q5053o8528M6660J1841J34844J13473J01796L8573J48466J6418L3920
5697C554904M6406p759O4738J31438J05800K5531M2599L562Q9147K0100Q4131
$$ y = [2500782, 2343620, 2256225, 2188529, 2139077, 2183429, 2223494, 2210083, 2338053, 2365383, 2404042, 2419108, 2415383, 2430567, 2499718, 2541687, 2572487, 2568773, 2648149, 2674219, 2751105, 2730483, 2733030, 2799986, 2858174, 2930029, 2967454, 2957977, 2889183, 2773616, 2725120, 2693282, 2677176, 2647528, 2600996, 2597764, 2534804, 2560551, 2534590, 2496590, 2573045, 2673667, 2643368, 2701957, 2856440, 2938832, 3026382, 3109915, 3139630, 2959052, 2901211, 2854215, 2802364, 2758462, 2767851, 2709857, 2696972, 2710753, 2803117, 2821486, 2861492, 2915587, 2980062, 3007569, 3091571, 3159404, 3116174, 3111721, 3062494, 2977441, 2908913, 2955573, 2967414, 3102258, 3215731, 3317527, 3356100, 3504566, 3520984, 3554904, 3601310, 3593551, 3658289, 3789727, 3895527, 3921058, 3963657, 3967219, 4056366, 4076466, 4160597]
5686D160597l3659p949o011K2613m1253J28661R6734J27150J33388J78435K04124
5675D962830K26307R8881P6909k0591K5359Q8098N6617N6361j8959p8201j15860
5664E357751P663j41258n8658o274J2433o2545P9532J6023l4362m3684O660l2305
5652E100976O2094l1547J29888J65960Q8695K17101L80481O14968O55048L33360
5642G717024j65548k16534l69665k26898j43217J4938m5441Q6888P3302J2198
5632F737047Q4744J03031J54229K82686K03477J92757K48246K17905J88568J34230
5622H546920K80609O1096J29946j1314J06091Q5189L08118L06001N85856O39482
5612A1037994Q06661L94301l0267j83205k51016j43207J18798K64821L61927M83294
$$ y = [4160597, 4126938, 4118989, 4112978, 4135591, 4094338, 4222999, 4319733, 4446883, 4580271, 4758706, 4962830, 5189137, 5288018, 5364927, 5344336, 5369695, 5457793, 5514410, 5570771, 5551812, 5473611, 5357751, 5365414, 5224156, 5165498, 5159224, 5171657, 5109112, 5188644, 5204667, 5170305, 5126621, 5133281, 5100976, 5163070, 5131523, 5261411, 5427371, 5516066, 5733167, 6113648, 6728616, 7383664, 7717024, 7551476, 7334942, 6965277, 6738379, 6595162, 6610100, 6564659, 6651547, 6724849, 6737047, 6821791, 6924822, 7079051, 7361737, 7565214, 7757971, 8006217, 8224122, 8412690, 8546920, 8827529, 8888625, 9018571, 9007257, 9113348, 9198537, 9506655, 9812656, 10398512, 11037994, 11844655, 12238956, 12208689, 12025484, 11774468, 11631261, 11750059, 12014880, 12376807, 12860101]
5602A2860101N02846O12200O89430P89348Q34880R10437R09928J087285J031855
5593B0228310J239095J285075J365951J407407J560813J744874J930790K020112
5585C2782427K378197K882863L472890M305462N071529N970030O734873P469983
5577G1068254Q135457Q847818R092017R357136Q980959P784334N368094K126462
5569A30760531j664648n288518q090150r436759r765555r615211r372924r177110
5561F8349656q785446q174719p299648o236599n179419m150061l376251k875786
5553B2271727k303917j968329j599378j395434j132201r66069p91432p34479o19821
5544A0760667n13965m49745m20339l49490k69097j79559k02666k23395k52634
$$ y = [12860101, 13362947, 13975147, 14664577, 15453925, 16288805, 17199242, 18109170, 19196455, 20228310, 21467405, 22752480, 24118431, 25525838, 27086651, 28831525, 30762315, 32782427, 35160624, 38043487, 41516377, 45821839, 50893368, 56863398, 63598271, 71068254, 79203711, 88051529, 97143546, 106500682, 115481641, 123265975, 128634069, 130760531, 129095883, 123807365, 115717215, 106280456, 96514901, 86899690, 77526766, 68349656, 59564210, 51389491, 44089843, 37853244, 32673825, 28523764, 25147513, 22271727, 19967810, 17999481, 16400103, 15004669, 13872468, 12906399, 12114967, 11380488, 10760667, 10246702, 9796957, 9376618, 9027128, 8758031, 8578472, 8375806, 8152411, 7899777]
5535G899777k79858k29730j99162j27210k77265k60474j22175q2525j10671q6558
5525F124149o3595o2694n5706r6270m2930q3187r5375j41615j91199k23018j28470
5514D940090p0001j89999j57423j02635j25105l5989j49434Q0438m9721j08037
5504D032184m7153O258j60513J3110o5154q549o8915o6690J0173L4929j11250
5493C568430p0678n4003n0608k4049K6327O5526j17225O1713N0677p0458R2940
5482C478592P4502p0214M6761j2477o2883J4111l2457j10118j14877L6753m5800
5471C201893n9106j01342J0340j1910l5154j0162J782m3642L2256n6930l5732
5460B892293m3178Q0950L0072K2694L8333j5333p5009m2466J832p2250K8319m8399
$$ y = [7899777, 7619919, 7390189, 7191027, 7063817, 6786552, 6526078, 6403903, 6321378, 6210707, 6124149, 6060554, 5997860, 5942154, 5845884, 5802954, 5719767, 5624392, 5482777, 5291578, 5068560, 4940090, 4870089, 4680090, 4522667, 4420032, 4294927, 4258938, 4109504, 4189942, 4140221, 4032184, 3985031, 3991289, 3830776, 3843886, 3778732, 3770183, 3701268, 3634578, 3644751, 3679680, 3568430, 3497752, 3443749, 3393141, 3369092, 3395419, 3460945, 3343720, 3405433, 3456110, 3385652, 3478592, 3553094, 3482880, 3529641, 3517164, 3454281, 3468392, 3435935, 3325817, 3210940, 3247693, 3201893, 3142787, 3041445, 3051785, 3039875, 3004721, 2994559, 2996341, 2952699, 2984955, 2928025, 2892293, 2849115, 2930065, 2960137, 2982831, 3021164, 3005831, 2930822, 2888356, 2890188, 2817938, 2846257, 2797858]
5448B797858m2924M4513K839m1580N7802M7032K9295K5467O6859M466l0377j8103
5436B943147r276l4375J23510O1542J20155O3237O1636q307J7470L6691J60261
5425C535691K5036M7371J45903J05390J11377J28742J07336J90545J68346R3866
5415D659603M1650L3290J9955L3205J7058J85966J74485J54558K18960L02272
5405E841002K29625L79795M69826N86789P36606J061779J297230K208161L443173
5396A6253986O301614Q687311Q407896J490475m611779o098649p577811n910834
5388A6942209l953133k611240j884217j322678r28488o01527l83751j97050j56662
5379D903463o4249p1942p9686p8837j01235j12762r9130m2349j43990o0025Q2410
$$ y = [2797858, 2754934, 2799447, 2802286, 2760706, 2818508, 2865540, 2894835, 2920302, 2987161, 2991627, 2961250, 2943147, 2933871, 2899496, 3023006, 3084548, 3204703, 3267940, 3329576, 3321269, 3338739, 3375430, 3535691, 3560727, 3608098, 3754001, 3859391, 3970768, 4099510, 4206846, 4397391, 4565737, 4659603, 4701253, 4734543, 4754498, 4787703, 4804761, 4990727, 5165212, 5319770, 5538730, 5841002, 6070627, 6450422, 6920248, 7507037, 8243643, 9305422, 10602652, 12810813, 16253986, 22555600, 31242911, 39650807, 41141282, 36529503, 30430854, 22853043, 16942209, 12989076, 10377836, 8493619, 7170941, 6242453, 5640926, 5257175, 5060125, 4903463, 4839214, 4767272, 4687586, 4608749, 4507514, 4394752, 4295622, 4253273, 4109283, 4049258, 4131668]
5368D131668l3692J7666M033M7034j16764j30091p5384q5048q7021k4065P675
5357C656011K2782m4145m8789J8099q515l3630L4660L6114r5429m8365q1133J9844
5345C427504q11L2612n4239j6293p6219K3277M7712k9160m7467n047q1886l7029
5333C182954J907J39768J2729m279p0070k2597m3324p5836N5423L2194L7465N1977
5321C298311M6757O2512N6093j1231o3284q5596J3379k9184m9445j4913J0847
5310C234246P4390N0938M4r321m7813l2924M2897J3505r79k2387J6727K5695J8956
5297C363974j4068K2692N7740m2556M8303o93Q4410K031J0314O1949L1706n2243
5285C573559n7472m1033K2596k7338O6487L9798J3681j0546R1040l5146L4183
$$ y = [4131668, 4097976, 4115642, 4119675, 4166709, 4049945, 3919854, 3844470, 3759422, 3672401, 3648336, 3656011, 3678793, 3634648, 3585859, 3603958, 3595443, 3561813, 3596473, 3632587, 3537158, 3488793, 3407660, 3427504, 3426693, 3459305, 3405066, 3388773, 3312554, 3335831, 3383543, 3354383, 3306916, 3301869, 3219983, 3182954, 3184861, 3324629, 3337358, 3333079, 3263009, 3240412, 3197088, 3121252, 3176675, 3208869, 3246334, 3298311, 3345068, 3407580, 3463673, 3452442, 3389158, 3303562, 3316941, 3287757, 3238312, 3223399, 3234246, 3308636, 3359574, 3359618, 3350297, 3302484, 3269560, 3312457, 3325962, 3324983, 3302596, 3319323, 3345018, 3363974, 3349906, 3372598, 3430338, 3387782, 3436085, 3435392, 3519802, 3521833, 3532147, 3594096, 3625802, 3573559, 3516087, 3475054, 3497650, 3470312, 3536799, 3576597, 3590278, 3579732, 3670772, 3635626, 3669809]
5274C669809K0156J7282J1210P8831L0691J16091N6118M6272N032R3045L2886
5263D177423K0132m2402k9024P3493M8890N1608M2630M0102j0815k6838j5091
5252D330108n9720p5438r5877o1776J19566J13454K8917P133M9752O9566N6476
5241D482161K5671K1290J13835R0577M6584R6377J78659J97521K17864L83306
5231E853845N38110O63634P32226O64894N27730M9563l06155n46741o73161n34738
5221F969207n29087l57426l80536k15092j29542j65712k8216m8757L8093n8889
5211E094043Q7210J77381Q8355L8174N6578M3351P3553J10945K00859K14391M03055
5200F587895M69709M94695N81031N10828L46746K88564J73126p4016k05086k68778
$$ y = [3669809, 3689965, 3707247, 3718457, 3797288, 3827979, 3944070, 4000188, 4046460, 4051492, 4144537, 4177423, 4197555, 4155153, 4126129, 4199622, 4248512, 4300120, 4342750, 4382852, 4372037, 4345199, 4330108, 4270388, 4194950, 4099073, 4037297, 4156863, 4270317, 4299234, 4306367, 4356119, 4425685, 4482161, 4507832, 4529122, 4642957, 4733534, 4780118, 4876495, 5055154, 5252675, 5470539, 5853845, 6391955, 7055589, 7787815, 8452709, 8980439, 9030002, 8723847, 8177106, 7503945, 6969207, 6440120, 6082694, 5702158, 5487066, 5357524, 5191812, 5163596, 5114839, 5152932, 5094043, 5181253, 5358634, 5446989, 5485163, 5541741, 5585092, 5658645, 5769590, 5970449, 6184840, 6587895, 7057604, 7552299, 8133330, 8644158, 8990904, 9279468, 9452594, 9378578, 9173492, 8904714]
5190H904714l67593m00860l50593k14449p2957N7287J94509K95137L89357L33385
5180H767937J93951J09841R5548j52466k92067l03244l87750m26454k17603j24399
5170G263294J4306J7465Q7461R5084J37029J00188N0518M0906K69016L25599M04790
5159H805656N55481P19387Q68936Q79056Q38446O64807L59890J64913l3774k90273
5149A3532525n04729m19547m03955k4399J71132M01949L98954N35983M04594K36766
5139A4329273j3305l09540o15839p19522q61914p98182q16837o08515m54069l14630
5129H816920l96503j06644j7451J88787K50615L39553M62694O82534P22504O31541
5119A1574550O62818O83108N62718N49758N00670M81694M46664N56859M08926
$$ y = [8904714, 8537121, 8136261, 7785668, 7571219, 7498262, 7555549, 7750058, 8045195, 8434552, 8767937, 8961888, 9071729, 9167277, 9014811, 8722744, 8419500, 8031750, 7605296, 7387693, 7263294, 7277600, 7295065, 7382526, 7477610, 7614639, 7714827, 7765345, 7806251, 8075267, 8400866, 8805656, 9361137, 10080524, 10949460, 11828516, 12666962, 13331769, 13691659, 13856572, 13822798, 13532525, 13027796, 12608249, 12204294, 12179895, 12351027, 12752976, 13151930, 13687913, 14092507, 14329273, 14315968, 14006428, 13390589, 12671067, 11809153, 11010971, 10194134, 9585619, 9131550, 8816920, 8420417, 8313773, 8296322, 8485109, 8735724, 9075277, 9537971, 10220505, 10943009, 11574550, 12237368, 12920476, 13483194, 14032952, 14533622, 15015316, 15461980, 16018839, 16427765]
5110A6427765L64107L72559O93120R41153J671162K829863N104479P402088P881350
5101D3687646K755154l634744n471799o676529n237455l100422k409076k688923
5093A7223852k295174k151001j628960j062127p01140n18823j82183j60057j41899
5084H382488k17291j71365j61083j11470j06046k7247p3021j08126j05723p9238
5074G221878l4772M1656r0132j05330k0715O034q2046n2800o6542j27277l6423
5063F653531m2663j44038o3622M349l267K5610j2086Q3300q9793j27801l171j05066
5051F175283l7410k9941m3081r8753l9087l1959m2821k8301j1609l8331m7941
5040E726049J0149O1227k2132N6672o0562N2584J20172O6184k1345J25775O8393
$$ y = [16427765, 16791872, 17164431, 17857551, 18798704, 20469866, 23299729, 28404208, 35806296, 43687646, 46442800, 42808056, 37336257, 30659728, 25422273, 22321851, 19912775, 17223852, 14928678, 12777677, 11148717, 10086590, 9385450, 8866627, 8684444, 8524387, 8382488, 8165197, 7993832, 7832749, 7721279, 7615233, 7587986, 7514965, 7406839, 7301116, 7221878, 7187106, 7228762, 7138630, 7033300, 7012585, 7018619, 6936573, 6883773, 6817231, 6689954, 6653531, 6610868, 6466830, 6403208, 6407557, 6404290, 6429900, 6417814, 6501114, 6411321, 6283520, 6280349, 6175283, 6137873, 6107932, 6064851, 5966098, 5927011, 5895052, 5852231, 5823930, 5812321, 5773990, 5726049, 5736198, 5797425, 5775293, 5831965, 5771403, 5823987, 5944159, 6010343, 5988998, 6114773, 6183166]
5029F183166K07067J25589L1345K915K5395j9408M9055Q7762R2457J8459J36874
5018F940676N5054R4108J12351J33115J51413J43002J60590L16283M05674O85368
5008I197634J114538J695994K031902J663897J60503j115833j419335j722175
5000A1607125j166068p45205n03292k04597k1660N6253Q6793L04325L19963L39229
4990A0072866M20105L06901K94369L16067L28677K80583J62680O6694j16367l09357
4980A1823218l62218l44937k08055k01045n4673N2725N6280R3204R0212Q158N9571
4969A1012440J17476K1297M1927K28342K02794J77214L13628L80945L98603N53426
4959A3448092N00713M58404K96633K44208K02191J90063J64861K17247J67250
$$ y = [6183166, 6390233, 6515822, 6547167, 6550082, 6575477, 6556069, 6605124, 6692886, 6785343, 6803802, 6940676, 6995730, 7089838, 7202189, 7335304, 7486717, 7629719, 7790309, 8106592, 8512266, 9197634, 10312172, 12008166, 14040068, 15703965, 15864468, 14748635, 13329300, 11607125, 10441057, 9695852, 9192560, 8987963, 8966303, 9022556, 9109349, 9413674, 9733637, 10072866, 10492971, 10799872, 11094241, 11410308, 11738985, 12019568, 12182248, 12248942, 12132575, 11823218, 11461000, 11116063, 10908008, 10706963, 10652290, 10705015, 10761295, 10854499, 10944711, 10952869, 11012440, 11129916, 11151213, 11193140, 11421482, 11624276, 11801490, 12115118, 12496063, 12894666, 13448092, 13948805, 14407209, 14703842, 14948050, 15150241, 15340304, 15505165, 15722412, 15889662]
4950A5889662K40699R6917K01477J26447K39353J99417K59792L50395M64568M90718
4940A8559445M95584M64496M40419M79242N95501O34492O76738P45630Q23333
4931B3914880P94385R44133R26643R45893J086220J248589J313080J335083J441067
4922C3949973J454905J679539K006212K313531K638778K940846L227083L385793
4914E3596660L667889L867016M284575M668041N613138O608656Q013300R146694
4906I9465969J0211584J0892703J1567246J2344597J3469295J4577591J5041541
4899A87570526J3593496J0363638N650312M05349m332196p729589r824054j0542201
4891A85155281j0729743j0959229j2108102j3804502j5145456j5422407j4480485
$$ y = [15889662, 16130361, 16227278, 16428755, 16555202, 16794555, 16993972, 17253764, 17604159, 18068727, 18559445, 19055029, 19519525, 19959944, 20439186, 21034687, 21669179, 22345917, 23091547, 23914880, 24709265, 25653398, 26580041, 27525934, 28612154, 29860743, 31173823, 32508906, 33949973, 35404878, 37084417, 39090629, 41404160, 44042938, 46983784, 50210867, 53596660, 57264549, 61131565, 65416140, 70084181, 75697319, 82305975, 90319275, 99465969, 109677553, 120570256, 132137502, 144482099, 157951394, 172528985, 187570526, 201164022, 211527660, 217177972, 217583321, 213251125, 205521536, 195697482, 185155281, 174425538, 163466309, 151358207, 137553705, 122408249, 106985842, 92505357]
4884I2505357j2853829j0986688r059636p289233n790494m684857l753086k918395
4876C5169139k388229j810265j505786j129424p97753n91950l35625k21782n878
4867B6382447J72367J91457K1125k36056l64078m44718m53838m16464k40211r3777
4857B4518254L21067P67385J239821J532179J965325K097846K248006K544973
4849C7234856K668714K517747K237938J225775r6027j451480k391240l069447
4841C8876836l459208l331912l062532k984767k641886k398891k058477j839836
4833A7099327j430931j057515p26345o20230l72881l55057j67841p7262q5350
4824A2205915j45076j11559k10657j99297k57720k18153k52117j87507k12762
$$ y = [92505357, 79651528, 68664840, 59605204, 52315971, 46525477, 41840620, 38087534, 35169139, 32780910, 30970645, 29464859, 28335435, 27537682, 26945732, 26610107, 26388325, 26382447, 26554814, 26746271, 26767396, 26531340, 26167262, 25722544, 25268706, 24852242, 24612031, 24518254, 24839321, 25606706, 26846527, 28378706, 30344031, 32441877, 34689883, 37234856, 39903570, 42421317, 44659255, 45885030, 45789003, 44337523, 41946283, 38876836, 35417628, 32085716, 29023184, 26038417, 23396531, 20997640, 18939163, 17099327, 15668396, 14610881, 13884536, 13264306, 12891425, 12536368, 12368527, 12291265, 12205915, 12060839, 11949280, 11738623, 11539326, 11281606, 11063453, 10811336, 10623829, 10411067]
4815A0411067j57494k63174p6046j04849o444r8007p5343q3164r4841n6189J09343
4804I504859J16963J53006K26P9381J3272K6057j01378n0298j49963K5263j56065
4793I461323P27m5245J8998L7605J68319j1236j8288k4109R1928O0315J10400
4782I850737l0867o470q2907J46699Q6383J41904P9170J28141L3035K28865J75713
4771A0750403K10392J71514L42578K77531M49861M11526O40091L62949J51119
4762A3767964k1741k7941n8537j28300j89861j74722j53174p6595K7873Q4345
4752A3049311J13080J73503J62915J09752K8880K949J14215J30050K69570O4356
4742A4218581K26403K98575L53295L65331M77303L46980K77895K24424L99645
$$ y = [10411067, 10253573, 9990399, 9914353, 9809504, 9803060, 9705053, 9629710, 9546546, 9451705, 9395516, 9504859, 9621822, 9774828, 9775054, 9854435, 9867707, 9893764, 9792386, 9742088, 9592125, 9617388, 9461323, 9462050, 9416805, 9435803, 9473408, 9641727, 9630491, 9612203, 9588094, 9680022, 9740337, 9850737, 9819870, 9813400, 9730493, 9877192, 9963575, 10105479, 10184649, 10312790, 10345825, 10574690, 10750403, 10960795, 11132309, 11474887, 11752418, 12202279, 12613805, 13253896, 13616845, 13767964, 13746223, 13718282, 13659745, 13531445, 13341584, 13166862, 13013688, 12937093, 12964966, 13049311, 13162391, 13335894, 13498809, 13608561, 13637441, 13640390, 13754605, 13884655, 14154225, 14218581, 14444984, 14743559, 15096854, 15462185, 15939488, 16286468, 16564363, 16788787, 17188432]
4733A7188432K31736M00742L11303J90019J6269J03211J15749L00329K20845M38915
4723A9517550L46291N12349M45464O94609N89141Q57281O97839J033406R31909
4714B5625839J113994R46348J224530J021452J371603J361854K000694J925844
4706C6592158K708926K738120L483575L409272M239814M735000O720111Q377848
4698G3004824J2203051J6736166K6406141M1920747O4980849P7790816N8776657
4691C71819251k183247l9443828n6154364o1211310m6228979l0860972k0429876
4684A15306675j2882824p802483k733019J257218O493074J1449965K1455080L6381981
4676A68925667O7554678R9481049J07675093L7489489m7350870o5957785q9650630
$$ y = [17188432, 17420168, 17820910, 18132213, 18322232, 18338501, 18441712, 18557461, 18857790, 19078635, 19517550, 19863841, 20376190, 20821654, 21516263, 22105404, 22962685, 23660524, 24693930, 25625839, 26739833, 27686181, 28910711, 29932163, 31303766, 32665620, 34666314, 36592158, 39301084, 42039204, 45522779, 48932051, 53171865, 57906865, 64626976, 73004824, 85207875, 101944041, 128350182, 170270929, 235251778, 313042594, 371819251, 369636004, 330192176, 274037812, 212826502, 166597523, 135736551, 115306675, 102423851, 94621368, 91888349, 93145567, 99638641, 111088606, 132543686, 168925667, 236480345, 335961394, 443636487, 481125976, 433775106, 367817321, 278166691]
4669B78166691p5123221m9764289l2104373k2867085j5740139j1480650p461499
4662F3625435n671137l433325k336845j144680q73562O1601P45047J868328K365864
4653E5206726K365111J089861n36564k376015l240741l458889k937454k141568
4645D3970467j319398o25196j03198K88859Q93508J353466K023390K546415K795152
4636E1823465L299344L787958M612404N592033P259806R095862J1392368J4524936
4628A11388176J9845339K7505919L6521475M2243412L7625756J8286088p432184
4621B85983981k6846648l6893860l7714164l1538489k3891264j7376692j3132087
4614I8590777j0304289q051720n672342l889772k399594k075980k485557l746278
$$ y = [278166691, 203043470, 153279181, 121174808, 98307723, 82567584, 71086934, 63625435, 57954298, 54520973, 52184128, 51039448, 50165886, 50227487, 50972534, 52840862, 55206726, 57571837, 58661698, 58125134, 55749119, 52508378, 49049489, 46112035, 43970467, 42651069, 42025873, 41922675, 42211534, 43105042, 44458508, 46481898, 49028313, 51823465, 55122809, 58910767, 63523171, 69115204, 76375010, 85470872, 96863240, 111388176, 131233515, 158739434, 195260909, 237504321, 275130077, 293416165, 285983981, 259137333, 222243473, 184529309, 152990820, 129099556, 111722864, 98590777, 88286488, 80234768, 74562426, 70672654, 68273060, 66197080, 63711523, 59965245]
4606E9965245m632801n248333m837673m194824l325688k866566k135290k086066
4598C0638004j864059j732897j291609j181597p20726o43885j53621j09058P7988
4589B3018540r4066k47891p82710r15392j072617j074901j113878q29086p84834
4580A6103165n20047n43779l86905l73509j85411j81535J3626m4613Q2034J80710
4570A4143736M81070N69560J035725R33449R15279Q88799R77642Q47853J078810
4561B1871923Q89407P00367j28333p30069j562477j666920j775933j473524j214113
4552A4910328o97518n38139R577L03620R60058J348535J317124M44182l54123
4543A7703644p07235q72373p74231p89349o85743o76973n17590l93078j12768
$$ y = [59965245, 55332444, 50084111, 45246438, 41051614, 37725926, 34859360, 32724070, 30638004, 28773945, 27041048, 25749439, 24567842, 23847116, 23203231, 23049610, 22940552, 23018540, 22924474, 22676583, 21893873, 20978481, 19905864, 18830963, 17717085, 16887999, 16103165, 15583118, 15039339, 14652434, 14278925, 14093514, 13911979, 13925605, 13880992, 13963026, 14143736, 14624806, 15194366, 16230091, 17163540, 18078819, 18967618, 19945260, 20793113, 21871923, 22761330, 23461697, 23333364, 22603295, 21040818, 19373898, 17597965, 16124441, 14910328, 14212810, 13674671, 13684248, 13987868, 14947926, 16296461, 17613585, 18057767, 17703644, 16996409, 16124036, 15349805, 14560456, 13874713, 13197740, 12680150, 12287072, 12174304]
4534A2174304J37488L84354N43889P79268Q97845J183750J290821J357021J224395
4525A9973135J023266P32296L91940J88745Q9563n9158k32356l22337o51882p55180
4515B0378032o64453o16370n63586l01875m0540L56610O81254R87570J139954
4506B1356596J238283J432653J420736J302124J027190P33749N57430O28799Q67067
4497C0564627J394718K203827L557076N297324Q004892J1925250J7397126K3326340
4489A03671180K5873193J9615491L794570j1787358k0404760k3714910k1026996
4482G6020410j6158636j1525138q150499n734018m371947l438273l051438k705293
4474B0885168k429687j950946j734817j379572j200512q74735p44411n50137m49486
$$ y = [12174304, 12311792, 12696146, 13240035, 14019303, 14917148, 16100898, 17391719, 18748740, 19973135, 20996401, 21728697, 22120637, 22309382, 22398945, 22339787, 22107431, 21785094, 21133212, 20378032, 19713579, 19097209, 18533623, 18231748, 18191208, 18547818, 19229072, 20216642, 21356596, 22594879, 24027532, 25448268, 26750392, 27777582, 28511331, 29068761, 29697560, 30564627, 31959345, 34163172, 37720248, 43017572, 51022464, 62947714, 80344840, 103671180, 129544373, 149159864, 152954434, 141167076, 120762316, 97047406, 76020410, 59861774, 48336636, 40186137, 34452119, 30080172, 26641899, 23590461, 20885168, 18455481, 16504535, 14769718, 13390146, 12189634, 11314899, 10570488, 10020351, 9570865]
4465I570865k19204j1175J69321J45952j5664l55574m35729m50006n44566m02478
4455G451742k26124j79812j81328j62073j39836r0192k4908p3505k7665j3186
4445F333113Q9942L9104J60632L49737N41023O41055R86165J064816J164653J078916
4435A2449156P20775l117o06794j118253j209756j169374r94921p16894l89639
4426F961183k58065M1703L64767O30007Q52730J046952Q91033L65201k93189p71725
4416I830597j086648j092609r65238p82204o07879n32072m43331l56339k37674
4407C726603j56838k07698n9167J01991L8563R6703J96997L38784L38500M81489
4397D895927N85863O60810N23952K55573j31175m46776n53969n76850n69594l84830
$$ y = [9570865, 9351661, 9340486, 9509807, 9655759, 9640095, 9284521, 8848792, 8398786, 7854220, 7451742, 7225618, 7045806, 6864478, 6702405, 6562569, 6472377, 6447469, 6373964, 6346299, 6333113, 6423055, 6462159, 6622791, 6972528, 7513551, 8154606, 9140771, 10205587, 11370240, 12449156, 13169931, 13166814, 12560020, 11441767, 10232011, 9062637, 8067716, 7350822, 6961183, 6703118, 6744821, 7109588, 7739595, 8592325, 9639277, 10530310, 10895511, 10602322, 9830597, 8743949, 7651340, 6686102, 5903898, 5296019, 4763947, 4320616, 3964277, 3726603, 3569765, 3362067, 3302900, 3404891, 3443454, 3540157, 3737154, 4075938, 4414438, 4895927, 5481790, 6142600, 6666552, 6922125, 6790950, 6344174, 5790205, 5213355, 4643761, 4258931]
4387D258931j65295j33796M5112K17348K86717N06876O07154N56669M62985K12895
4377F855596J1057j52620k24725m55754o24650o82475o21739m97582m08702l02983
4367B895423j49216k9128J13906J67361K34956K70511L30409M19343P3070J0167
4357D336802k23632l31498n54708m02133l39933j40652j66275j2197m817L8833
4347B199790m330O5005j14350m3217m9014O8062N9286Q9591J55314K19001L57694
4336C002832M22273M79075M83542J40650j74277k97879m81691m58337l63767k60536
4326B491885j71670j30699J7416L4767J05483O6954N3578l4901n3330j62349j39958
4315B077176k96913j59472r9785r0633j69250l1088j80684o1040k7654k3567o6538
$$ y = [4258931, 4093636, 3959840, 4004952, 4222300, 4509017, 5015893, 5623047, 6179716, 6642701, 6855596, 6866653, 6714033, 6489308, 6033554, 5408904, 4726429, 4104690, 3607108, 3198406, 2895423, 2746207, 2717079, 2830985, 2998346, 3233302, 3503813, 3834222, 4253565, 4326635, 4336802, 4113170, 3781672, 3226964, 2824831, 2484898, 2344246, 2177971, 2165774, 2160957, 2199790, 2195460, 2260465, 2146115, 2102898, 2053884, 2121946, 2181232, 2270823, 2426137, 2645138, 3002832, 3425105, 3904180, 4387722, 4528372, 4354095, 4056216, 3574525, 3116188, 2752421, 2491885, 2320215, 2189516, 2206932, 2241699, 2347182, 2414136, 2467714, 2432813, 2379483, 2217134, 2077176, 1780263, 1620791, 1521006, 1430373, 1261123, 1230035, 1049351, 988311, 960657, 937090, 870552]
4304H70552L2937K1006n8252l5388O7350L6415m6344L4667L0084k7992m3670L7245
4292I18610R914J10290J11999J24678N0684R1941M4328J07349J29173K31035J37153
4281B067154K91029M29158P87508J455646J907683J368751m62439j090832j442002
4272E311656j555933j020729o45747m90114l12682k34228j61887j23575k3557
4263G43204p3928M063K2138j04327j503J04646q2593p9310J12219p3518o7168
4252E03923p6358R2615l4502L8966m0231J5495J01366N9736q6991Q588k207j1075
4240E69325p9110R8465J0726R8912J1466K5951r1371j9900M3783J06817o710M7493
4228H15847J85240Q7645J03726J39332J39377J09736o3919L3417j078k2143j2963
$$ y = [870552, 903489, 924495, 866243, 830855, 898205, 934620, 888276, 922943, 953027, 925035, 881365, 918610, 928524, 1038814, 1150813, 1275491, 1326175, 1418116, 1462444, 1569793, 1698966, 1930001, 2067154, 2358183, 2787341, 3574849, 5030495, 6938178, 8306929, 7844490, 6753658, 5311656, 3755723, 2734994, 2089247, 1599133, 1286451, 1052223, 890336, 766761, 743204, 669276, 673339, 695477, 591150, 589647, 694293, 611700, 532390, 644609, 571091, 503923, 427565, 520180, 485678, 524644, 484413, 499908, 601274, 661010, 574019, 582607, 580400, 569325, 490215, 588680, 599406, 698318, 709784, 735735, 644364, 624464, 668247, 775064, 768354, 815847, 1001087, 1088732, 1192458, 1331790, 1471167, 1580903, 1516984, 1550401, 1549323, 1527180, 1514217]
4217A514217p1243n5096J6811q3326o4124j45640p0067n8841m7851o2532o109
4206H66199J5122N1787k7527p299m5802M6433N2055Q9230L0143j1232j2620J12164
4194A158653J11617Q4070J56510J64966J76806J37618J68635L09036M93406N71339
4184C532656O78348O99174O07807L36275J02692K6045j45906l33219n18604o01761
4174D383507n80512n19833l23298k91809n2997n8617K4517O706M44j9756p650
4163B560702O5914J1485Q1295K46812K76486L26979M09600N94976R05328R74728
4153F454305R93338J010360Q79149N29911L10612n8512k44975o40313q90394j122063
4143G221418j179993r93748q77797n56860m01665j83012j22675j9328N520J44584
$$ y = [1514217, 1442974, 1387878, 1404689, 1321363, 1257239, 1111599, 1041532, 982691, 934840, 872308, 866199, 881321, 933108, 905581, 898282, 852480, 898913, 950968, 1040198, 1070341, 1059109, 1046489, 1158653, 1270270, 1354340, 1510850, 1675816, 1852622, 1990240, 2158875, 2467911, 2961317, 3532656, 4211004, 4910178, 5517985, 5854260, 5956952, 5982997, 5837091, 5503872, 4985268, 4383507, 3802995, 3283162, 2959864, 2668055, 2615058, 2556441, 2580958, 2587664, 2588108, 2568352, 2560702, 2626616, 2638101, 2719396, 2966208, 3242694, 3569673, 3979273, 4574249, 5479577, 6454305, 7447643, 8458003, 9337152, 9867063, 10177675, 10119163, 9874188, 9233875, 8343481, 7221418, 6041425, 5047677, 4169880, 3613020, 3211355, 3028343, 2905668, 2886340, 2891860, 3036444]
4133C036444K28414K26244L84573M24748M07548L13255K19043J47030J19181m6389
4123E460091k32706k90945l50309j05107n4962J67530K50367L66126K14431J77848
4113E602364P7449L3208j61053l37922n09163m64598n87533l64248k00501K0063
4103C108066M7453K55524L55822L63547J26942J16677K10357K17184K80187K66392
4093E348151J91618M3440o6656j79123j93300j76615l14224m45726n73500n35976
4083C098089m77429l61183k97088k28772j55255j06290j07245j68357j58904o3757
4073I73809n9732J8439R4726L9677m7557L1248K7041j3271J211Q2776K5214J56503
4061A330084K81499K73276L92771L71058L59887K44816R8339o344n2987k34600
$$ y = [3036444, 3264858, 3491102, 3875675, 4300423, 4707971, 5021226, 5240269, 5387299, 5506480, 5460091, 5227385, 4936440, 4586131, 4481024, 4426062, 4593592, 4843959, 5210085, 5424516, 5602364, 5679813, 5713021, 5551968, 5214046, 4704883, 4240285, 3652752, 3288504, 3088003, 3108066, 3155519, 3411043, 3766865, 4130412, 4257354, 4374031, 4584388, 4801572, 5081759, 5348151, 5539769, 5583209, 5516553, 5337430, 5144130, 4967515, 4653291, 4207565, 3634065, 3098089, 2620660, 2259477, 1962389, 1733617, 1578362, 1472072, 1364827, 1196470, 1037566, 973809, 914077, 932516, 1027242, 1066919, 1019362, 1050610, 1077651, 1064380, 1065591, 1148367, 1173581, 1330084, 1611583, 1884859, 2277630, 2648688, 3008575, 3253391, 3351730, 3345386, 3292399, 3057799]
4051C057799k41947m00655l22540m06210k74390k32804j88352j55131p1097j43860
4041F20813k07729j82443Q1057L5000o7977P696K565j9752Q271P54j09077K9591
4029A98769j40312K1516J7737R5186j0272j082R0713l1237o9869K4121k5166o0983
4017A09121k212J9270L0702J8589K9024j1681K4770j1660m0837p0790j1638j15753
4005c3095M021N3300P7860o119M3412o2227j4005J215o6568n4422P0704n5924
3993d1848L3892p8354R8144j8320R2312j2707M41o2275m6428n9106N6831k1663
3981e9081J3364N2625Q4171M0257r5925J8812j6900l2490j00087K301l6145P6040
3969e3058K9063R9046o106N807r0867j896m0302l7276K5699M6797l3961J06121
$$ y = [3057799, 2815852, 2415197, 2092657, 1686447, 1412057, 1179253, 990901, 835770, 764673, 620813, 413084, 230641, 311698, 346698, 278721, 286417, 288982, 269230, 277501, 278255, 169178, 198769, 58457, 79973, 97710, 192896, 182624, 181542, 272255, 241018, 171149, 195270, 170104, 109121, 106909, 126179, 156881, 175470, 204494, 192813, 217583, 205923, 165086, 94296, 82658, -33095, -29074, 24226, 102086, 95967, 139379, 77152, 63147, 64362, -2206, -56628, 14076, -41848, -7956, -86310, 11834, -6486, 85826, 73119, 73560, 11285, -35143, -94249, -37418, -59081, -45717, 6908, 91079, 131336, 35411, 54223, 37323, 4833, -95254, -92953, -129098, -53058, -23995, 75051, 68945, 74752, -16115, -18011, -58313, -95589, -69890, -23093, -57054, 49067]
3957D9067L6223l9096j5539m3797L3633o4908j5254K5427Q7007j9038Q8736o606
3945A15855M7295q3991o0350o1576k5817m6365k714J7722P3859N1916j4547K3231
3933C4518m3297j8349L4878O1973j30587k2185K4494P9123P5212K0430j2659K2644
3921A26195p849L678k3540K3160l4671r566L3924K4616Q827O73j2965j20667J3430
3908B5245O3743q118j8190j5661k8162N7520M9947l4500o225l451n4252O2774
3896I0670j3667K5579M5567M6477M1004K244L5327r9334j4053K9691Q2061R705
3884B81271K0658p607L6028N7426J6516m4528Q7837l0817O2046p0197J13887j6833
3872E05687j2973J3257O0645o036J35580K7246J3643J8663J35081N531q6721K4054
$$ y = [49067, 85290, 46194, 30655, -13142, 20491, -44417, -59671, -34244, 52763, 33725, 122461, 115855, 163150, 79159, 18809, -42767, -68584, -114949, -117663, -99941, -26082, 25834, 11287, 34518, -8779, -27128, 7750, 69723, -60864, -83049, -58555, 20568, 95780, 116210, 103551, 126195, 118346, 122024, 98484, 121644, 86973, 77407, 111331, 135947, 144774, 145447, 132482, 11815, 25245, 88988, 80870, 62680, 47019, 18857, 76377, 126324, 91824, 85599, 82148, 27896, 90670, 77003, 102582, 148149, 194626, 235630, 237874, 273201, 173867, 159814, 189505, 271566, 281271, 301929, 294322, 330350, 387776, 404292, 359764, 447601, 416784, 478830, 408633, 522520, 505687, 492714, 505971, 566616, 560580, 696160, 723406, 737049, 755712, 890793, 896324, 809603, 833657]
3860H33657k5522k2978l4621l3095j17582N7669l4640m5007L0978q435j01018
3849D99406N6518m7555p072m3452L903L3610J2934J0792K881k9062O5285R534
3837E67722q1243k7147l1548J6339m2032N9147k9827j0000l2540L5629K2947K1430
3825D68877q6286n7837j5053L2618j7619M8150k8661K3985J5710J3917j3215J3333
3813C97919M6721l9326K9702l4878P0079n3212k239o067N1949m9189N4522j02708
3801C63273P70j3599N2163o3536N9976K5779l141m153o3109K4558j0358M8872
3789D17495j8488J6238j815N0636N629j026p8086O7238l7788m3486p5189K25n641
3776B95942j4982k9981Q1800K3401l7040M3193l2229l3087j37676j5413J2126
$$ y = [833657, 808135, 785157, 750536, 717441, 599859, 657528, 622888, 577881, 608859, 600424, 499406, 555924, 508369, 501297, 457845, 461748, 495358, 508292, 519084, 521965, 492903, 558188, 567722, 486479, 459332, 427784, 444123, 402091, 461238, 431411, 421411, 388871, 424500, 447447, 468877, 382591, 324754, 309701, 342319, 324700, 372850, 344189, 368174, 383884, 397801, 384586, 397919, 444640, 405314, 435016, 400138, 470217, 417005, 414766, 408699, 460648, 411459, 465981, 363273, 364043, 350444, 402607, 339071, 399047, 424826, 421685, 417532, 354423, 378981, 368623, 417495, 399007, 415245, 413430, 464066, 469695, 468669, 390583, 457821, 420033, 376547, 301358, 301583, 295942, 280960, 250979, 332779, 356180, 319140, 362333, 330104, 297017, 159341, 143928, 156054]
3765A56054O2476k1536J48966o1598m3351L661L7807n6973j9536L30O6170m2875
3753B29595J00752J8270L2532P3046K1471l7603m5046k9502K3767J7432q8014
3742C16700J1605R5258N4978n5684p7552p5809p2807k7568N1940k6826P380L3872
3730B35487M6127j0809P5261M7969J3595j6436o7553L7326p9486p104l8878J7270
3718B52769L7079L1752K807o5737m6916o568k9824K1340J10818n830j4793q1920
3706B04977p9889l9702P3386L705L9525j16436P46K0983l0395N1499j7884K2323
3694A32838j0891n9177O251n3644J0156Q7500m7039K0963P3258J261K1005o1868
3682A20613o9574j9178J0172Q4916L5411j6993p674Q543L8838n768j612k3305
$$ y = [156054, 218530, 196994, 345960, 284362, 241011, 244672, 282479, 225506, 205970, 206300, 272470, 229595, 330347, 348617, 381149, 454195, 475666, 438063, 393017, 363515, 387282, 404714, 316700, 328305, 423563, 478541, 422857, 345305, 269496, 196689, 169121, 221061, 194235, 201615, 235487, 281614, 270805, 346066, 394035, 407630, 391194, 323641, 360967, 281481, 274377, 235499, 252769, 289848, 321600, 324407, 258670, 211754, 205186, 175362, 196702, 307520, 301690, 286897, 204977, 125088, 85386, 158772, 162477, 202002, 85566, 86312, 107295, 76900, 128399, 110515, 132838, 121947, 62770, 69021, 15377, 25533, 113033, 65994, 86957, 160215, 161476, 182481, 120613, 51039, 31861, 42033, 126949, 162360, 145367, 137693, 146236, 185074, 179306, 177694, 154389]
3670A54389o8443j2970N4583O8708L4790k7375l1708k1347j5628l0085K0980m1105
3658H4789m8106K417P0229M1632K320K9930l6484M5217n753j05021J4968p90j9126
3645G6222q493M4861K4005j7106M0057K770k5650K2693p1389J6485j3527J353
3633I2281j731L736L0456M2392l5880L7876k3862n1228l2100Q6483l9220l6857
3621G2346N9417O5857m7031J966N841o2029l2831M735K1642L1359L5028M2058
3609A98358K6131l8195M2859k6917o9563k6960O4590o6849L5457N2074m557K4412
3597B10840J42759k3279j54604N196P3722k8035k1987j0878N7627L0854J253O3014
3585C46482m7769l2530n8537l1289K7147P4408j8109J4271N6614P2422l2159k603
$$ y = [154389, 85946, 72976, 127559, 196267, 231057, 203682, 171974, 150627, 134999, 104914, 125894, 84789, 36683, 39100, 109329, 150961, 153281, 183211, 146727, 191944, 186191, 81170, 96138, 95348, 76222, 67729, 112590, 136595, 119489, 159546, 162316, 136666, 159359, 87970, 104455, 90928, 92281, 90550, 94286, 124742, 167134, 131254, 169130, 145268, 94040, 61940, 148423, 109203, 72346, 131763, 197620, 150589, 152555, 158396, 96367, 63536, 68271, 89913, 121272, 156300, 198358, 224489, 186294, 229153, 202236, 132673, 105713, 170303, 103454, 138911, 190985, 186428, 210840, 353599, 330320, 175716, 180912, 254634, 226599, 204612, 193734, 251361, 282215, 283468, 346482, 298713, 266183, 207646, 176357, 203504, 277912, 259803, 274074, 330688, 403110, 370951, 368348]
3573C68348k9010l6395o850P897j0213K3493J9195L5856N5785K248J8587m4509
3561D04432L1362K2482l8534m3319J3407J1747N8610P764N6338K1053J3865o5358
3549D93849j3433L7200m1386l7650Q9655L1298P0690N2012J9697k5893j6670k4054
3537F35315l8049k8299j4653P7050K9488J2680K1396L8659M8349k7695J9016J8000
3525G91257O1766K5918K1469Q3487P9162Q7200J72921K10813J55335J88772L20104
3514B198204J93367m5373r9909n9438k27860j86478j75783q4111j40290o6893
3504A305436l1835j406l1490N0851K2046P3504M2775Q4675Q650l1958Q6556L8248
3492A616052K6590P0595J49956J3862J18202K48114L13385L66974N90629N72549
$$ y = [368348, 339338, 302943, 296093, 303990, 293777, 317270, 336465, 372321, 428106, 430354, 448941, 404432, 435794, 458276, 419742, 376423, 389830, 401577, 460187, 467951, 524289, 545342, 559207, 493849, 480416, 517616, 476230, 438580, 528235, 559533, 630223, 682235, 701932, 676039, 659369, 635315, 597266, 568967, 554314, 631364, 660852, 673532, 694928, 733587, 781936, 754241, 773257, 791257, 853023, 878941, 900410, 983897, 1063059, 1150259, 1323180, 1533993, 1689328, 1878100, 2198204, 2391571, 2346198, 2246289, 2186851, 1958991, 1772513, 1596730, 1512619, 1372329, 1305436, 1273601, 1272195, 1240705, 1291556, 1313602, 1387106, 1429881, 1514556, 1523206, 1491248, 1577804, 1616052, 1642642, 1713237, 1863193, 1877055, 1995257, 2243371, 2556756, 2923730, 3514359, 4086908]
3482D086908O63616K88657K0207l53336n75893n15100l52363k88120k49036j21002
3472B604538k4165q0988k2283O7649J7920P3581J97026J29947J00035J55449J89696
3461C408405K14341J70269K32846J59191M08526K99594M02087M75608N83485N70838
3451F925190N96515N98049L63651J14403k23879m89706o56924p49075p15654n69970
3441E192600m63479m49646m03697k46298k09483n6945p2420J86796K55876N71391
3431D304695M77725J99593k81232l85973n22881n72006l98129l03518j26299j33623
3421B258352m4725o0706n2274r8467J6366q576q9294q914Q3937j28675R097k4344
3409A851777J9519o5731J10436J42082R9428J13668J75616M29056Q25028J253327
$$ y = [4086908, 4750524, 5039181, 5059388, 4706052, 4130159, 3615059, 3262696, 2974576, 2725540, 2604538, 2580373, 2499385, 2477102, 2544751, 2562671, 2636252, 2833278, 2963225, 3063260, 3218709, 3408405, 3622746, 3793015, 4025861, 4185052, 4593578, 4893172, 5295259, 5770867, 6354352, 6925190, 7521705, 8119754, 8483405, 8597808, 8373929, 7884223, 7227299, 6478224, 5762570, 5192600, 4729121, 4279475, 3875778, 3629480, 3419997, 3363052, 3290632, 3477428, 3733304, 4304695, 4782420, 4982013, 4700781, 4314808, 3791927, 3219921, 2821792, 2518274, 2391975, 2258352, 2213627, 2152921, 2100647, 2002180, 2018546, 2009970, 1920676, 1911762, 1995699, 1867024, 1876121, 1851777, 1871296, 1805565, 1916001, 2058083, 2157511, 2271179, 2446795, 2875851, 3700879, 4954206]
3399D954206J176584K35694n36530p70655j067378p26985o22677m01802l61270
3390A879187j94355j75314m2238j12083r3378n1077P544k2876N5095r0241m3106
3379A117158k2802j3370M503j5131P3019N3616L8430R2793J86055K50880M08810
3368B173961N27967M91636L5659k99028m40431m56219m23536j79371k11278j11751
3358A107609r2836q2402l7736p4739K3118n9316p1697k4653L4959l9926L0457
3347G12838k9840K4007n0686o6452N2697o4720n0616M4704L4993k5682K448m7815
3335E35876j8250J290j8514L9412R2418k3740o874q6468K9152p849J1419j004
3323E46868q5627p4171J06624j1577o4443L7178J00266J11111m2678k6318l4828
$$ y = [4954206, 6130790, 6366484, 5829954, 5059299, 3991921, 3264936, 2642259, 2240457, 1879187, 1684832, 1509518, 1467280, 1355197, 1261819, 1210742, 1218286, 1195410, 1250505, 1160264, 1117158, 1094356, 1080986, 1085489, 1070358, 1143377, 1196993, 1235423, 1328216, 1514271, 1765151, 2173961, 2701928, 3193564, 3229223, 2930195, 2489764, 2033545, 1610009, 1430638, 1219360, 1107609, 1014773, 932371, 894635, 819896, 843014, 783698, 712001, 687348, 722307, 682381, 712838, 682998, 707005, 656319, 589867, 642564, 577844, 527228, 571932, 606925, 581243, 583691, 535876, 517626, 518916, 500402, 539814, 632232, 608492, 601618, 515150, 544302, 536453, 547872, 546868, 461241, 387070, 493694, 482117, 417674, 454852, 555118, 666229, 623551, 597233, 562405]
3312E62405m6951l3626n3637q0748J714O760P2580O9059n4843j4936m6107M743
3300C86413l5620l8005l6221O0433L6333M0631L5449l6713n2847M9064l1456k6413
3288C51048L6263l8735L8306N0970l7443m101k857O6073n3403k295J18882j54527
3276C68181N540O1850P1372k3648O3080P3617J97714O1668L7740J21287n5174
3265I83227q9610r3850p2225j06579n2054m3231r266m8814m2447j21411M0572
3254C44312l7944P5021j0584K902k1386K6836L4169L8833p451k7845J2164Q4674
3242E13701O4497J27686J40946M8405R4205o0231o0765j29320j47924j26500j8011
3231D46689r7472r2803j8935L0860l856p259n4549Q4096o045m6928k2915O381
$$ y = [562405, 515454, 481828, 428191, 347443, 349157, 355917, 428497, 497556, 442713, 427777, 381670, 386413, 350793, 312788, 276567, 337000, 373333, 413964, 449413, 412700, 359853, 408917, 377461, 351048, 387311, 348576, 386882, 437852, 400409, 396308, 393451, 459524, 406121, 403826, 522708, 368181, 373721, 435571, 506943, 483295, 546375, 619992, 817706, 879374, 917114, 1038401, 983227, 893617, 799767, 727542, 620963, 568909, 525678, 516412, 467598, 425151, 303740, 344312, 306368, 381389, 370805, 373707, 352321, 379157, 413326, 452159, 444708, 416863, 429027, 513701, 578198, 705884, 846830, 895235, 989440, 929209, 868444, 739124, 591200, 464700, 446689, 349217, 256414, 237479, 268339, 264483, 257224, 202675, 286771, 280726, 233798, 210883, 217264]
3219B17264m9638n6699M9803k8574Q7561j681O367K3926L5666l4748m2860M804
3207B11191M7983q4635M4477j4024L3419j3524o36L5650k2208N8295K776k9447
3195B69317l2588K8671j05933N6006j7533Q3257k22j4260k8166O7624j8423M0191
3183C27941o7213N2310m6713K6907K5497j7329n6561J7921J27255j9180K6822
3172C97657O712n848j2019K8421j42504M7519J2585J0350r6891L3175L1980k575
3160C08562P8119L2142l5982k0218j6049Q7890O2261o6007L0174j6470m001k1394
3148D19027J06776O3447L3854j45520J14015J16882O658n9385N6876o637O6413
3137G72406M2022k2685K3860n555J01810j0976l8840J2728j8237J033j9432l2226
$$ y = [217264, 167626, 110927, 160730, 132156, 219717, 218036, 224403, 248329, 283995, 249247, 206387, 211191, 259174, 174539, 219016, 204992, 238411, 224887, 224251, 259901, 237693, 295988, 298764, 269317, 236729, 265400, 159467, 215473, 197940, 281197, 280975, 266715, 238549, 306173, 287750, 327941, 260728, 313038, 266325, 293232, 318729, 301400, 244839, 262760, 390015, 370835, 397657, 404369, 398521, 386502, 414923, 272419, 319938, 332523, 342873, 245982, 279157, 311137, 308562, 386681, 418823, 382841, 362623, 346574, 434464, 496725, 430718, 460892, 444422, 440421, 419027, 525803, 589250, 623104, 477584, 591599, 708481, 715139, 655754, 712630, 705993, 772406, 814428, 791743, 815603, 810048, 911858, 900882, 862042, 874770, 856533, 857566, 838134, 805908]
3125H05908K5497k927O3356N6403P5213M5348L8781L1797Q1135O6515O2221L9055
3113A388302J35510J60196J66495J67738O7889L7411r5647j29685j73251r3321
3103A631637j23322j31058n3912l0997K3916k6212q5850N0545O4101l4213m051
3092A280584J3408O1917l419J15609M5366Q5642P0690L5111Q0429J09446L5129
3081A929912O907p2980l5763j19941m2930j14025m8539n987o6577j49650j20688
3070A159739j14032j17141k334N2159K5603P0770K3244j371R933o9455l9788l5762
3058I61565m1475r007K1593J4122K8440l9568r0968j17185r2687n0587l5958o1721
3046D86564n3101N7500Q7880n0708j9536n656K0685j3624j21380m6955k5531R362
$$ y = [805908, 831405, 828478, 891834, 948237, 1023450, 1068798, 1107579, 1139376, 1220511, 1287026, 1349247, 1388302, 1523812, 1684008, 1850503, 2018241, 2086130, 2123541, 2027894, 1898209, 1724958, 1631637, 1508315, 1377257, 1323345, 1292348, 1316264, 1290052, 1204202, 1254747, 1318848, 1284635, 1280584, 1293992, 1355909, 1352490, 1468099, 1513465, 1599107, 1669797, 1704908, 1785337, 1894783, 1929912, 1936819, 1863839, 1828076, 1708135, 1665205, 1551180, 1502641, 1496654, 1430077, 1280427, 1159739, 1045707, 928566, 926232, 978391, 1003994, 1074764, 1098008, 1096637, 1106570, 1037115, 997327, 961565, 920090, 911083, 932676, 946798, 975238, 935670, 844702, 727517, 634830, 584243, 548285, 486564, 433463, 490963, 578843, 528135, 508599, 502943, 523628, 510004, 388624, 341669, 316138, 325500]
3034C25500q849m1434M2828M7365j3261M203j076k7376r9270j9392n3714J1536
3022A67060k5145N5435J05713k0931n406k7436m5937k5758n2802m5665L9237N652
3010A24017P394k0992L3416k494l0910K792M4379o8940L0571O9201l7489k3144
2998A27801Q2839L6845k1838p3212m2679l5757k1184l8076j1228N5788J1057N4531
2986A24887R510L2484k3777n830p6403o0810J9082O7343r3096m8012O7090L2422
2974D4890M8275j5100m7402k3646n5725o105n3863N4211O5946r6718Q4303L9323
2962C8389j7693m2236M8928n2245j3211m3882o2902P7048L8520L2587M8700r1159
2950c9156k6069m7757M6106l6960k3880L7722N3497N6071j9723L9088j6862k7376
$$ y = [325500, 316651, 275217, 318045, 365410, 352149, 356352, 355276, 327900, 228630, 209238, 155524, 167060, 141915, 197350, 303063, 282132, 276726, 249290, 203353, 177595, 124793, 79128, 118365, 124017, 131411, 110419, 143835, 141341, 110431, 113223, 157602, 88662, 119233, 188434, 150945, 127801, 210640, 247485, 225647, 152435, 109756, 73999, 52815, 14739, 3511, 59299, 70356, 124887, 134397, 166881, 143104, 137274, 60871, 61, 19143, 86486, -6610, -54622, 12468, 44890, 93165, 78065, 30663, 7017, -48708, -54813, -108676, -54465, 11481, -85237, -934, 38389, 20696, -21540, 27388, -24857, -38068, -81950, -144852, -67804, -29284, 3303, 52003, -39156, -65225, -112982, -66876, -103836, -127716, -89994, -36497, 19574, -149, 38939, 22077, -5299]
2938e299q1846J341M395n9046o6066R004O9436R5979j9629J3427K499m8717O161
2925g8361J7789l6149j4005q059k9791J30039P227q147N342l8187n5356L6995
2913g0663p7990j546N0071J27661p7875L7669K2o3352l3981p9609L724L2592M4038
2900a09239K473O1508j4915L2485n9469P411p4601M5902k1043l1225N3827L0187
2888g6699o8391R0483J2789n1683j348m3322Q290m3408J7613r327O7702Q876M3916
2875d4509l8333Q9432p2914l4450m6232L7610o3380m1818N6389K1854Q1948p931
2863f2334O7406R227l3453l6936k9005j124L1971o7768L4148J007P1963o1926
2851g6824L0813J0526J9033n7445l6497k768o123k862J1416L0175L5201L0701
$$ y = [-5299, -87145, -85804, -81409, -140455, -206521, -197517, -128081, -32102, -51731, -38304, -35805, -84522, -78361, -60572, -96721, -110726, -118785, -148576, -18537, -11310, -19457, -14115, -52302, -107658, -70663, -148653, -150199, -100128, 27533, -50342, -12673, -12651, -76003, -109984, -189593, -185869, -153277, -109239, -106766, -45258, -60173, -27688, -87157, -79746, -154347, -108445, -129488, -160713, -106886, -76699, -145090, -54607, -41818, -93501, -94849, -138171, -129881, -173289, -155676, -165003, -97301, -88425, -44509, -82842, 6590, -66324, -100774, -147006, -109396, -172776, -214594, -158205, -136351, -54403, -62334, 5072, 14299, -19154, -56090, -85095, -86219, -54248, -122016, -87868, -86861, -14898, -76824, -46011, -35485, -16452, -73897, -110394, -113162, -119285, -122147, -110731, -80556, -45355, -14654]
2839a4654o7210j5322j6612j9374K0950O2752r4927L1458K6592L7387n5156j2868
2827a16984J7219M3655n1770m9631N7186R755J9490n0457J06691L6624l605m2686
2815b4513j3235q4376P6552k5659Q741M1559R207J1421n5691p5685K8236J296
2803a02147l1075L9085k1333K295J2913l441L4664Q0273j731m3778K6037m8135
2791e6373o1651J245k0330Q635M9007J00284k7114o4697O0578j5036L3310p6681
2779f8823L020M3366l1715m6037J5092P6722L966q4252L0144k0411M813k646N9789
2766a6972n2102j1946J6533p320O3253j2146m4793m4942k0512m0730k6875M1279
2754a57273J66605L17l6698J3486o9115o6337j5352j0628M168l8829O0745k3251
$$ y = [-14654, -81864, -97186, -113798, -133172, -112222, -49470, -144397, -112939, -86347, -48960, -104116, -116984, -99765, -56110, -107880, -157511, -100325, -90570, -71080, -121537, -14846, 21778, 18173, -24513, -37748, -122124, -45572, -71231, -62490, -20931, -11724, -303, -55994, -131679, -103443, -102147, -133222, -94137, -115470, -113175, -100262, -103703, -69039, 11234, 9503, -34275, -8238, -56373, -118024, -116779, -137109, -128474, -79467, 20817, -6297, -70994, -10416, -25452, 7858, -68823, -65803, -22437, -54152, -100189, -85097, -8375, -4409, -88661, -58517, -78928, -74115, -76761, -16972, -69074, -81020, -64487, -71807, -8554, -20700, -65493, -110435, -130947, -171677, -198552, -157273, 9332, 9649, -27049, -13563, -82678, -149015, -164367, -174995, -170827, -209656, -148911, -172162]
2742a72162R7859P2619o007R599q1082k3093l5686o8322L9432l804K4546P4638
2730g1463L2997q0154n2877n143J08584m3348j7952k1881J6374K4747n2887L0948
2718a32055J5348K9262O3808k2730m3103k1816Q71n1965L8901O691Q852M3577
2706f4359J6439K814Q974n579Q149m9864n8427L1917k613k6879N173L9517k183
2693i6921k4584m2638k3539P3771l2723P1576K9531M037N1498N7972q4566j15357
2681a31943K1250K9194o9631N3518l9402N3307O947j7892J8423q248k8700j2731
2669a25908l0751N1820L2210o8887Q3748j1705Q4329n7410M2079r4264J6876o8099
2657a45962M1760R661K5649L2m8141l0329j869P5793k0047l0398L5530O7253m5827
$$ y = [-172162, -74303, -1684, -7691, 1908, -79174, -102267, -137953, -206275, -166843, -170647, -146101, -71463, -38466, -118620, -171497, -176640, -68056, -111404, -129356, -151237, -134863, -110116, -163003, -132055, -116707, -87445, -23637, -46367, -89470, -111286, -110415, -162380, -123479, -116788, -107936, -64359, -47920, -45106, -36132, -41711, -33562, -83426, -141853, -109936, -112549, -139428, -134255, -94738, -96921, -121505, -164143, -187682, -113911, -146634, -75058, -45527, -41490, 10008, 67980, -16586, -131943, -110693, -81499, -151130, -97612, -137014, -83707, -76760, -94652, -76229, -84477, -113177, -125908, -156659, -104839, -72629, -141516, -57768, -69473, 14856, -42554, -475, -94739, -77863, -145962, -104202, -94541, -68892, -68860, -117001, -147330, -149199, -73406, -93453, -123851, -88321, -21068, -66895]
2644f6895R948k4492L5275o553L0834m4665K7512q5214O9610o4452L158J3921
2632a02013R6690J5982j8132N7682L7947l6626r0167N0264n5300l9153M784j0522
2620h8564l0049R3386j8221j7532j06239R1292j6019P7477o0076j9176l0820j142
2608a25683l733O9116j399N8773j4410k2212j6097J591J5125m8067J9495k6049
2596i3550J09957q6781j2191N8718n8909m4705J25512m8626N3606k1787j7959
2585c6715j6945l689j6158Q8874O2966q180N1810K3390J62758n7752j9127l4052
2573A97180j8034o6009N266j54634L9686l4339m1971j7654L0709k7165Q1693m9214
2561e4486P8964j246Q997n3475m7302M8744m0737q809k7275P2459m0816J07448
$$ y = [-66895, -56947, -81439, -46164, -52717, -21883, -66548, -39036, -124250, -54640, -119092, -115934, -102013, -5323, 10659, -7473, 50209, 88156, 51530, -38637, 11627, -43673, -82826, -78042, -88564, -118613, -25227, -43448, -60980, -167219, -75927, -91946, -14469, -74545, -93721, -124541, -125683, -129416, -60300, -61699, -2926, -17336, -39548, -55645, -54054, -38929, -86996, -67501, -93550, 16407, -70374, -82565, -23847, -82756, -127461, -1949, -50575, 3031, -18756, -36715, -53660, -57349, -73507, 15367, 78333, 70153, 121963, 145353, 308111, 250359, 231232, 197180, 179146, 113137, 118403, -36231, 3455, -30884, -72855, -90509, -59800, -86965, -5272, -54486, 24478, 23232, 32229, -21246, -68548, -19804, -60541, -69350, -96625, -24166, -64982, 42466]
2549D2466r828m5147l8864M1735o0476L3355j2102K5809n3719M8565P817k8045
2537d8434J1920P705o5871J8268q21l9315N0683Q531R2650q8347J3044M3706r29
2524B790j4522K6817j00773N1119K6498N4315q4739L7773J9218k5471j499l7162
2512d5636J8605L4713O1153l239R7760j26372K9521l9751L1168K1790J3759k3944
2500F9527M3385j01037m2663Q350O3567k750M0710J3714J9564p6589n1928L6629
2488B0479K9139l0908j6264L5093J0492R1249r7047j6272J5230o1155j54992O5835
2476a09121M0687m2164O5204k49L5194O8145N1467m2297n8713j1593j8516J22
2464b1834M0207m1105L7658M2948O1206k8595P3884K9342l9706q4462K6770l8345
$$ y = [42466, 32638, -12509, -51373, -9638, -70114, -36759, -48861, -23052, -76771, -28206, -20389, -48434, -36514, -28809, -94680, -76412, -77233, -116548, -65865, -57334, 35316, -53031, -39987, 3719, 2790, -11732, 15085, -85688, -34569, -8071, 46244, -38495, -722, 18496, -6975, -8474, -45636, -27031, 7682, 68835, 65596, 163356, 36984, 66505, 26754, 57922, 79712, 93471, 69527, 112912, 11875, -30788, -22438, 41129, 38379, 79089, 92803, 112367, 35778, -16150, 20479, 49618, 18710, 2446, 37539, 48031, 139280, 42233, 25961, 41191, -19964, -174956, -109121, -68434, -110598, -45394, -45643, -10449, 57696, 109163, 66866, 8153, -3440, -21956, -21834, 18373, -22732, 14926, 57874, 119080, 90485, 164369, 193711, 154005, 69543, 96313, 57968]
2452E7968n8900p5378P4201o3843M4357K1318K4657N2909k5689l5742L4882R1476
2440A42216n3366n5891K6262R9341k790j0450q494M5342m7817p6912k0470j8145
2428A8826m5800J18575Q9509k1766o898P8193n6845m388L0133M628o1231k0664
2416A22272L2831J8637L3221q187P3127k2603p0250k1778m905o4674M2546J13144
2404B43381R820l6840M1691k0683K0387k5972k185j0410l9538L8350J5231N7601
2392B90833M6108K1401j4212o29k1314n8256k9107N8017m2598L0375M6155L0438
2380C57211l3470M4153L9057M8134k8187j6584j00423K9488K0300R1259m900N2131
2368D98169k74J3701k5432J1538j2155j0329o524J2920j441M9929P8180K2002
$$ y = [57968, -932, -76310, -2109, -65952, -21595, -277, 24380, 77289, 51600, 15858, 50740, 142216, 88850, 32959, 59221, 158562, 155772, 145322, 136828, 182170, 134353, 57441, 36971, 18826, -26974, 91601, 181110, 159344, 152446, 230639, 173794, 169406, 199539, 204167, 142936, 122272, 155103, 173740, 206961, 198774, 271901, 249298, 179048, 157270, 152365, 87691, 130237, 243381, 253201, 216361, 258052, 237369, 257756, 231784, 229599, 219189, 179651, 218001, 233232, 290833, 336941, 358342, 344130, 343501, 322187, 263931, 234824, 292841, 250243, 280618, 326773, 357211, 323741, 367894, 406951, 455085, 426898, 410314, 309891, 339379, 359679, 450938, 446038, 498169, 497895, 511596, 486164, 497702, 485547, 475218, 468694, 481614, 480173, 530102, 608282, 630284]
2356F30284Q8941K0478k6405r87Q5480m7142K1675M1002J03590L9541L6423J14561
2344A107441Q183J05417Q0448O1028L3830R1927N9648J26429P4048K23764J33567
2333B105730K34377K3182K49059J06235L10514M04246O84118O62820M73500O7924
2323E321705J84839P6287K90226L31398P36602R17612J697667K255648L383912
2314A5195896N311675J0274439J5356111J7220623O207982p437754r879682j3714914
2306C8534376j1187554p453964m973030l748343k628477j863022j131310q31840
2298D716836l01280k1129J71493p5837l39094l49121n75962m17572l13303l38817
2288B156214j80170j23220j33838j02422j52156m9704j7685m5082n6559l801p6513
$$ y = [630284, 719225, 739703, 713298, 712311, 797791, 750649, 772324, 813326, 916916, 956457, 992880, 1107441, 1115624, 1221041, 1301489, 1362517, 1396347, 1488274, 1547922, 1674351, 1748399, 1972163, 2105730, 2340107, 2363289, 2612348, 2718583, 3029097, 3433343, 4117461, 4780281, 5253781, 5321705, 5506544, 5582831, 5873057, 6204455, 6941057, 7858669, 9556336, 11811984, 15195896, 20507571, 30782010, 46138121, 63358744, 69566726, 62128972, 52249290, 38534376, 27346822, 19892858, 14919828, 11171485, 8543008, 6679986, 5548676, 4716836, 4415556, 4394427, 4565920, 4490083, 4150989, 3801868, 3225906, 2808334, 2495031, 2156214, 1976044, 1852824, 1718986, 1616564, 1464408, 1414704, 1397019, 1351937, 1295378, 1291577, 1215064]
2277A215064p2349Q149q2891J3192o9769j04862k0464K514r1887r5600o089k8617
2265F66391m1761k2187J9612Q467o6669P6426N780p4424J6470j14121M682o1262
2253D17404j8495l7785k3347m4852M7993K6211L4796J8937J7556k2169r0318m108
2241C21823n2110J8964J0880n8069o860n609O4800o8550l1266j1773k2070k6044
2229A34116L9048k3582J2014J2592l6565m3038R5162N2882M5114j05018k6095
2218A56630l2664L8800n1382R357k7917L1181K8785K0071l3466q765o1508m467
2206F4655r645R014k9454L030J14177j8470n9663K4978N7864j02695J8740J5944
2194H8475n576j1418J1847n3987J0998p5921j08890M2345Q8694M419o6343R1770
$$ y = [1215064, 1142715, 1150864, 1067973, 1081165, 1011396, 906534, 886070, 888584, 796697, 701097, 695008, 666391, 624630, 602443, 622055, 630522, 563853, 640279, 646059, 571635, 588105, 473984, 478666, 417404, 398909, 361124, 337777, 292925, 340918, 367129, 401925, 420862, 438418, 416249, 325931, 321823, 269713, 288677, 299557, 241488, 234628, 229019, 293819, 225269, 194003, 182230, 160160, 134116, 173164, 149582, 161596, 174188, 137623, 94585, 189747, 242629, 287743, 182725, 156630, 123966, 162766, 111384, 120741, 92824, 124005, 152790, 172861, 139395, 130630, 69122, 64655, 55010, 64024, 34570, 37600, 151777, 133307, 73644, 98622, 156486, 53791, 72531, 88475, 82899, 71481, 83328, 29341, 40339, -35582, -144472, -102127, -13433, -9014, -75357, 16413]
2182A6413K4010j2218K0788L3988j9889K9500m5254O9597o4447L6987q8819L7847
2170C8503J5729k769j0571K0940o8878j2598J041L3096M2015l0998j5438j9344
2158i272J4702k7550M016j1762P7568r755J8677o4131Q810l301P9103L0206J5374
2145A22685j05892K8072m6569R4458l7197j4262l427k7772M6511j13848J2645
2134d4596n134P538N7306J8396J1319M5939j26393l0278N235L8571M934J7631
2122D68K8217o405p0178J4367N4676k1194L1533j0919j9263k9414L2106k6794
2110b2800J8414j7677L0806l8745O7549j4518p605n8290j5452m1863M4580M7369
2098h232L0122L3020k297l403Q668P53m0815q0859K789J5481m52J0050K6918O4395
$$ y = [16413, 40423, 28205, 48993, 82981, 63092, 92592, 47338, 116935, 52488, 89475, 656, 38503, 54232, 51463, 40892, 61832, -7046, -19644, -18603, 14493, 56508, 25510, 10072, -9272, 5430, -22120, -18104, -29866, 47702, 37947, 56624, -7507, 1303, -1998, 77105, 107311, 122685, 16793, 44865, -1704, 92754, 55557, 41295, 37868, 10096, 56607, -57241, -44596, -49730, -42192, 15114, 33510, 44829, 90768, -35625, -65903, -60668, -22097, -17163, 468, 28685, 22280, -47898, -33531, 21145, -49, 31484, 20565, 1302, -28112, 3994, -22800, -4386, -22063, 8743, -30002, 37547, 23029, 15424, -42866, -58318, -100181, -55601, -8232, 21890, 54910, 52613, 49210, 57878, 58631, 17816, -63043, -60254, -44773, -45225, -35175, -8257, 56138]
2084E6138P920R785j03840j7929M1309N9436r5332k0330L0157J2605O5785j9849
2072B5855k5202n9778n802M2530l968k7140P5753o1493K7287N9592J3180p583
2060E3231m4175j631l2709n487j2075k1455N2548N7392J8035k7906o2338M793
2048b1777K1328K2944n9470J05077M5423J09213N8858k0806K9630K7802o7781
2037B50441j02995r0409o6737J1262L141L933K7024p430j9062L4969k0397j1839
2025A1901m5562j512m1054J9202n662M078l146k06O7610K9905K108j24373K7690
2012e9021j9333M969Q476l3946J7021P0148R638n7278L2317O9650r7745r4031
2000a49135P5630J8678K6806m9958P4623L0572j6749k1380j7459n6959k0612L6900
$$ y = [56138, 64058, 73843, -29997, -47926, -6617, 52819, -42513, -62843, -32686, -20081, 45704, 25855, 653, -59125, -64927, -22397, -26365, -53505, 22248, -39245, -11958, 47634, 60814, 53231, 9056, 7425, -25284, -30771, -42846, -64301, -11753, 45639, 63674, 35768, -26570, -21777, -449, 22495, -36975, 68102, 113525, 222738, 281596, 260790, 290420, 318222, 250441, 147446, 57037, -9700, 1562, 4703, 8636, 35660, 28230, 9168, 44137, 23740, 11901, -33661, -35173, -76227, -57025, -62687, -58609, -61755, -61961, 5649, 35554, 37662, -86711, -59021, -78354, -73385, -64909, -98855, -81834, -11686, -2048, -59326, -27009, 42641, -55104, -149135, -73505, -54827, -28021, -77979, -3356, 27216, 10467, -10913, -28372, -85331, -105943, -69043]
1988f9043k6491K3170M585n697M2741j2587o4676m0231J5795M0269M1348q044
1976e8861l8807K4027J7542J40767m9186p0575o3468m3396R141M8593L7568P0299
1964B3644l5375O555K0617o2658j8706K0405r749l1445J8018k7387M9370J9624
1952b7087P3246j6315o1460n65P9730m556m6586n0259l384O148k2672l842m0569
1939a18171Q0708O4864M1185p6122p9277N4253K4107J0414K6320o48L8578m1702
1927B4509L0502L5772J7231n2880o5017p392l2169l7900P478J4402R921Q3077
1915B7534M286o1989l2908o052N4310k0777j6955k153K1526M1674L5028L4142
1903G7666k6133m7017N5149L7752j26947O8940K6866O858P806k1713j0853m0232
$$ y = [-69043, -95534, -72364, -67779, -73476, -30735, -43322, -107998, -148229, -132434, -92165, -50817, -58861, -97668, -73641, -56099, 84668, 35482, -35093, -98561, -141957, -132816, -84223, -46655, 23644, -11731, -5176, 15441, -47217, -65923, -45518, -55267, -86712, -68694, -96081, -46711, -27087, 46159, 29844, -31616, -32181, 47549, 42993, -3593, -53852, -57236, -51088, -73760, -77602, -118171, -37463, 27401, 68586, -7536, -86813, -32560, -8453, 1961, 28281, 27633, 66211, 24509, 55011, 90783, 108014, 55134, -9883, -17275, -49444, -87344, -79866, -65464, -55543, 27534, 31820, -30169, -63077, -69129, -14819, -35596, -52551, -54704, -33178, 8496, 43524, 77666, 51533, 4516, 59665, 97417, -29530, 39410, 66276, 73134, 80940, 59227, 48374, 8142]
1891H142r8113m6574N372N5193N8180j3918k4565L4806J8654O5464k690j7927
1879D2024m0595n3694k1249k6677l5318N675J23641J4036q33K9463j5951k5032
1867d510P647K0100m3385k5875L2658m5960N1125P1873l4865n7816M8690n0985
1855c1303l9218J4717n0856O3848J6648j3330m8959R2033m1057N273j2783L0966
1843a4021L277m9983o3047O7936J00337k1777J3785J2833k1161M1888k049q9764
1831b1746K0614j1499J5758M4176n197q6916O2156k4875N0857n5383j3987J8226
1819g816j653m2867J4380J065J661M555P7448m1852k1418K2921m0158j8868j2515
1806f5117O2974K0628O0081r5129k8955L5415N1019o4604j1610J1157j6513j5378
$$ y = [8142, -89971, -136545, -131173, -75980, -17800, -31718, -56283, -21477, -2823, 62641, 59951, 42024, 1429, -52265, -73514, -100191, -135509, -129834, -6193, 7843, 7010, 36473, 20522, -4510, 3137, 23237, -20148, -46023, -13365, -59325, -8200, 63673, 28808, -29008, 19682, -31303, -70521, -55804, -106660, -42812, -26164, -39494, -88453, 3580, -37477, -32204, -44987, -14021, -10744, -60727, -123774, -55838, 44499, 22722, 36507, 49340, 28179, 70067, 68018, -21746, -1132, -12631, 3127, 47303, 42106, -44810, 17346, -7529, 43328, -12055, -26042, -7816, -9469, -52336, -37956, -36891, -35230, -30675, 46773, 4921, -16497, 6424, -33734, -52602, -65117, -2143, 18485, 78566, -16563, -45518, -10103, 40916, -23688, -35298, -24141, -40654, -56032]
1794e6032K7991K9818J9343j1200j16247L3821j568N3831n5160o7270P6348Q3361
1782A7036J648N0130J0492o537p9747O0730j22499k4132O4759j9990J5807J6852
1770a5451P0949J4524N7848m4411o7754n9712M4123r560j3170k1541N4679n2278
1758d1754R6994l1513m0384l7931M7272J4625Q748k7190K9871M2165k6642l1434
1746B827L8545k4138l6717n3122J5865P4523L4119o6817j1321P1885m4960J4163
1734A4852J4800R251K154k4586q9493k989J9535N0871M2774R277n281O3668o6568
1721C8265j35358m0898N7936K2744j4457j6000K597N4731R6423R228l3948J5401
1709E6664m7496K6557n6427j8245l1724N1758M1600M4522j6021o2767O49N134
$$ y = [-56032, -28041, 1777, 21120, 9920, -106327, -72506, -74074, -20243, -75403, -142673, -66325, 17036, 18684, 68814, 79306, 72769, -6978, 53752, -68747, -92879, -28120, -48110, -32303, -15451, 55498, 70022, 127870, 83459, 15705, -44007, 116, -9444, -22614, -44155, 10524, -41754, 55240, 23727, -16657, -54588, -7316, 7309, 16057, -11133, 18738, 60903, 34261, 2827, 41372, 17234, -19483, -72605, -56740, 17783, 51902, -14915, -26236, 45649, 689, 14852, 29652, 38903, 41057, 16471, -73022, -76011, -56476, -5605, 37169, 46446, 41165, 104833, 38265, -97093, -137991, -80055, -57311, -71768, -87768, -85171, -30440, 65983, 75211, 41263, 56664, 9168, 35725, -20702, -38947, -70671, -18913, 22687, 67209, 51188, -11579, -10930, -5796]
1697e796l46n3833M425j7482L117O8339M0321l1969K4793l9515j8935p1940L6873
1684f1948m4264M8727k7904O2699j2247l272l3485K0935Q161l9342k420L4564
1672d9796M4269M1968M8874o6172m9777k6829N1150l7966O6574p010J9193O6737
1660A01215k6859l3108l9074m1030M3191m5343j6721L8467n9821J5961M8111n943
1648b0954L0832o0306o548l5307m5735J20995k1101n2598k429R2027J7228m4499
1636b8395J158L0365J1632q7840j9546M0017n1544L5732P1339l6891j6663N1618
1624I82m732k6359m3263j5435p943K6253K9883O4550M5943L1020l1645k0241r5662
1611d6649j06946K4822P0297o76J29622J5131m6328l3834j23952L3441J0820L1178
$$ y = [-5796, -6142, -59975, -55550, -73032, -69915, -1576, 38745, 6776, 31569, -7946, -26881, -98821, -61948, -106212, -57485, -85389, -22690, -34937, -38209, -71694, -50759, -42598, -81940, -84360, -49796, -5527, 36441, 85315, 19143, -30634, -57463, -6313, -44279, 22295, 15285, 34478, 101215, 74356, 41248, 2174, -38856, 4335, -41008, -57729, -19262, -79083, -63122, -15011, -20954, 9878, -50428, -56976, -92283, -138018, -17023, -38124, -90722, -93151, -1124, 16104, -28395, -27237, 3128, 14760, -73080, -92626, -52609, -104153, -68421, 2918, -33973, -50636, 982, -3750, -30109, -73372, -88807, -96750, -70497, -40614, 23936, 69879, 100899, 69254, 49013, -46649, -153595, -128773, -58476, -59152, 70470, 85601, 39273, 5439, -118513, -85072, -74252, -43074]
1599d3074Q429l5587k6491P2663J6393J02631Q155m6105j11498j9168m8928N8970
1587f3610J00155R171n1010K9818k3853N7590k9071m6992j6199k8430J8780j1510
1575e5161l4060M9748O3663l1743Q575m7538P317j27327N9023R436N6165N2938
1563A1036j5318j9960J509M3035j819j7137j1926L3958k9742p3m0281p670l1056
1550h5444R3704J6642N3932m0451l6157J9313J3549q2265J7039j2750J5227J2304
1538a5357L7480L6398l9216n6013j2434Q988l1352n5155M3708Q2867q545J04888
1526I6257n0488j4916q2512Q0989m3271l8223o9016O7933k5772P9458j0524j5281
1514b5366k6078j9764p8039N4618K0953n1448P6141n0065J10768L5633J2029r9887
$$ y = [-43074, -34645, -70232, -96723, -24060, -7667, 94964, 103119, 57014, -54484, -73652, -122580, -63610, 36545, 45716, -5294, 24524, 671, 58261, 29190, -17802, -34001, -62431, -43651, -55161, -89221, -39473, 24190, -7553, 1022, -46516, -39199, -166526, -107503, -98067, -41902, 11036, -4282, -24242, -22733, 20302, 18483, 1346, -10580, 23378, -6364, -6437, -46718, -54388, -85444, 8260, 24902, 78834, 38383, 2226, 21539, 35088, -47177, -30138, -42888, -27661, -15357, 22123, 58521, 19305, -36708, -49142, -40154, -71506, -126661, -82953, -86, -8631, 96257, 45769, 30853, -51659, 29330, -13941, -52164, -121180, -53247, -79019, 439, -10085, -25366, -51444, -71208, -149247, -94629, -73676, -125124, -48983, -99048, 11720, 47353, 59382, -40505]
1502d0505K8622p3575k3322k4356N8317j455J02363m2360N3530J4037l5294p809
1490H193M8367q046m6469m7747l3167P8215Q921M3697n4787J2130j13285R2667
1478a1311K0814k252l2070O934r301R825M7518J1655j6028L3907K3164l864j06831
$$ y = [-40505, -11883, -85458, -108780, -133136, -74819, -76274, 26089, -16271, 37259, 51296, 16002, 8193, 56560, 48514, 2045, -45702, -78869, -654, 8267, 51964, -2823, 9307, -103978, -11311, 9503, 7251, -24819, -17885, -27186, -17361, 30157, 41812, 25784, 59691, 82855, 78991, -27840]
$$ [...]
##END NTUPLES=NMR SPECTRUM
##END=
