##TITLE=1H_DE-80H_X3
 200.13MHz, d2o
 8 sc
 
 19ns.26.2.2025
##JCAMPDX= 6.0         $$ Bruker NMR JCAMP-DX V2.0
##DATA TYPE= NMR SPECTRUM
##DATA CLASS= NTUPLES
##ORIGIN= UXNMR, Bruker Analytische Messtechnik GmbH
##OWNER= pz
$$ XWIN-NMR		Version 3.5
$$ Fri Dec  5 11:56:55 2025 Russian Standard Time (UT+4h)  Yarkov@DPX200
##.OBSERVE FREQUENCY= 200.1313
##.OBSERVE NUCLEUS= ^1H
##.ACQUISITION MODE= SIMULTANEOUS
##.ACQUISITION SCHEME= undefined
##.AVERAGES= 8
##.DIGITISER RES= 18
##SPECTROMETER/DATA SYSTEM= spect
##.PULSE SEQUENCE= zg30
##.SOLVENT NAME= CDCl3
##.SHIFT REFERENCE= (INTERNAL, CDCl3, 0, 15.5067)
##AUDIT TRAIL= $$ (NUMBER, WHEN, WHO, WHERE, WHAT)
$$ ##TITLE= Audit trail, XWIN-NMR		Version 3.5
$$ ##JCAMPDX= 5.01
$$ ##ORIGIN= Bruker BioSpin GmbH
$$ ##OWNER= Yarkov
$$ C:/Bruker/XWIN-NMR/data/yarkov2/nmr/H-C/1/pdata/1/auditp.txt
$$ ##AUDIT TRAIL=  $$ (NUMBER, WHEN, WHO, WHERE, WHAT)
(   1,<2025-12-05 11:55:58.23 +0400>,<Yarkov>,<DPX200>,
      <created by zg, POWCHK disabled, PULCHK disabled
       configuration hash MD5:
       00 E9 B6 7A A2 85 ED C7 34 08 36 98 17 FE 4E 26
       data hash MD5: 16K
       8F F8 04 77 BB 21 01 C5 DC AB 75 B6 CB EC 7F F2>)
(   2,<2025-12-05 11:56:07.57 +0400>,<Yarkov>,<DPX200>,
      <Start of raw data processing
       efp BC_mod = 2 LB = 0.25 FT_mod = 6 PKNL = 1 PHC0 = -5312.553 PHC1 = 20.22191 SI = 16K 
       data hash MD5: 16K
       02 D2 F7 62 F5 AD DB 0E 55 29 D1 81 4C EA 5C 6A>)
(   3,<2025-12-05 11:56:13.50 +0400>,<Yarkov>,<DPX200>,
      <abs ABSG = 5 
       data hash MD5: 16K
       AB 10 A7 85 08 B3 D7 97 B3 51 B1 AB 70 CA BD 43>)
$$ ##END=
$$ 
$$ hash MD5
$$ 83 5A 6A 81 85 69 78 F3 3A FA 51 F5 54 D2 2A BB
##$RELAX= 
##$RELAX= 
##$RELAX= 
##$RELAX= 
##$RELAX= 
##$RELAX= 
$$ Bruker specific parameters
$$ --------------------------
##$DU= <C:/Bruker/XWIN-NMR>
##$EXPNO= 1
##$NAME= <H-C>
##$PROCNO= 1
##$TYPE= <nmr>
##$USER= <yarkov2>
##$AMP= (0..31)
100 100 100 100 100 100 100 100 100 100 100 100 100 100 100 100 100 100 
100 100 100 100 100 100 100 100 100 100 100 100 100 100 
##$AQSEQ= 0
##$AQ_mod= 1
##$AUNM= <au_zg>
##$AUTOPOS= <>
##$BF1= 200.13
##$BF2= 200.13
##$BF3= 200.13
##$BF4= 200.13
##$BF5= 200.13
##$BF6= 200.13
##$BF7= 200.13
##$BF8= 200.13
##$BYTORDA= 1
##$CFDGTYP= 0
##$CFRGTYP= 5
##$CHEMSTR= <none>
##$CNST= (0..31)
1 1 145 1 1 1 1 1 1 1 1 1 1 1 1 1 1 1 1 1 1 1 1 1 1 1 1 1 1 1 1 1 
##$CPDPRG= <>
##$CPDPRG1= <>
##$CPDPRG2= <>
##$CPDPRG3= <>
##$CPDPRG4= <mlev>
##$CPDPRG5= <mlev>
##$CPDPRG6= <mlev>
##$CPDPRG7= <mlev>
##$CPDPRG8= <mlev>
##$CPDPRGB= <>
##$CPDPRGT= <>
##$D= (0..31)
0 0.7 0 0 0 0 0 0 0 0 0 0.03 0 0 0 0 0 0 0 0 0 0 0 0 0 0 0 0 0 0 0 0 
##$DATE= 1764921357
##$DBL= (0..7)
120 120 120 120 120 120 120 120 
##$DBP= (0..7)
150 150 150 150 150 150 150 150 
##$DBP07= 0
##$DBPNAM0= <>
##$DBPNAM1= <>
##$DBPNAM2= <>
##$DBPNAM3= <>
##$DBPNAM4= <>
##$DBPNAM5= <>
##$DBPNAM6= <>
##$DBPNAM7= <>
##$DBPOAL= (0..7)
0.5 0.5 0.5 0.5 0.5 0.5 0.5 0.5 
##$DBPOFFS= (0..7)
0 0 0 0 0 0 0 0 
##$DE= 6
$$ [...]
##$SUBNAM3= <"">
##$SUBNAM4= <"">
##$SUBNAM5= <"">
##$SUBNAM6= <"">
##$SUBNAM7= <"">
##$SUBNAM8= <"">
##$SUBNAM9= <"">
##$SW= 18.0517328524113
##$SWIBOX= (0..15)
0 0 2 0 0 0 0 0 0 0 0 0 0 0 0 0 
##$SW_h= 3612.71676300578
##$TD= 16384
##$TD0= 1
##$TE= 0
##$TE2= 300
##$TE3= 300
##$TEG= 300
##$TL= (0..7)
0 120 120 120 120 120 120 120 
##$TP= (0..7)
150 150 150 150 150 150 150 150 
##$TP07= 0
##$TPNAME0= <>
##$TPNAME1= <>
##$TPNAME2= <>
##$TPNAME3= <>
##$TPNAME4= <>
##$TPNAME5= <>
##$TPNAME6= <>
##$TPNAME7= <>
##$TPOAL= (0..7)
0.5 0.5 0.5 0.5 0.5 0.5 0.5 0.5 
##$TPOFFS= (0..7)
0 0 0 0 0 0 0 0 
##$TUNHIN= 0
##$TUNHOUT= 0
##$TUNXOUT= 0
##$USERA1= <user>
##$USERA2= <user>
##$USERA3= <user>
##$USERA4= <user>
##$USERA5= <user>
##$V9= 5
##$VALIST= <valist>
##$VCLIST= <CCCCCCCCCCCCCCC>
##$VD= 0
##$VDLIST= <DDDDDDDDDDDDDDD>
##$VPLIST= <PPPPPPPPPPPPPPP>
##$VTLIST= <TTTTTTTTTTTTTTT>
##$WBST= 1024
##$WBSW= 4
##$XGAIN= (0..3)
0 0 0 0 
##$XL= 0
##$YL= 0
##$YMAX_a= 316132
##$YMIN_a= -217968
##$ZGOPTNS= <>
##$ZL1= 120
##$ZL2= 120
##$ZL3= 120
##$ZL4= 120
##$ABSF1= 15.50669
##$ABSF2= -2.545159
##$ABSG= 5
##$ABSL= 3
##$ALPHA= 0
##$AQORDER= 0
##$ASSFAC= 0
##$ASSFACI= 0
##$ASSFACX= 0
##$ASSWID= 0
##$AUNMP= <proc_1d>
##$AZFE= 0.1
##$AZFW= 0.1
##$BCFW= 0
##$BC_mod= 2
##$BYTORDP= 0
##$COROFFS= 0
##$CY= -3
##$DATMOD= 1
##$DC= 0
##$DFILT= <>
##$DTYPP= 0
##$F1P= 0
##$F2P= 0
##$FCOR= 1
##$FTSIZE= 16384
##$FT_mod= 6
##$GAMMA= 0
##$GB= 0
##$INTBC= 1
##$INTSCL= 3.241238e-09
##$ISEN= 128
##$LB= 0.25
##$LEV0= 0
##$LPBIN= 0
##$MAXI= 10000
##$MC2= 0
##$MEAN= 0
##$ME_mod= 0
##$MI= 1.114404
##$NCOEF= 0
##$NC_proc= -6
##$NLEV= 6
##$NOISF1= 3.799351
##$NOISF2= 2.8
##$NSP= 0
##$NTH_PI= 0
##$NZP= 0
##$OFFSET= 15.50669
##$PC= 1
##$PHC0= -5312.553
##$PHC1= 20.22191
##$PH_mod= 1
##$PKNL= yes
##$PPARMOD= 0
##$PSCAL= 0
##$PSIGN= 0
##$REVERSE= no
##$SF= 200.130003003829
##$SI= 16384
##$SIGF1= 3
##$SIGF2= 2
##$SINO= 0.751879
##$SIOLD= 32768
##$SREGLST= <19F.Aceton>
##$SSB= 0
##$STSI= 16384
##$STSR= 0
##$SW_p= 3612.71676300578
##$SYMM= 0
##$S_DEV= 0
##$TDeff= 16384
##$TDoff= 0
##$TI= <>
##$TILT= no
##$TM1= 0
##$TM2= 0
##$TOPLEV= 0
##$USERP1= <user>
##$USERP2= <user>
##$USERP3= <user>
##$USERP4= <user>
##$USERP5= <user>
##$WDW= 1
##$XDIM= 16384
##$YMAX_p= 274924508
##$YMIN_p= -308948
$$ End of Bruker specific parameters
$$ ---------------------------------
##NTUPLES= NMR SPECTRUM
##VAR_NAME=  FREQUENCY,     SPECTRUM/REAL,   SPECTRUM/IMAG
##SYMBOL=    X,             R,               I
##VAR_TYPE=  INDEPENDENT,   DEPENDENT,       DEPENDENT
##VAR_FORM=  AFFN,          ASDF,            ASDF
##VAR_DIM=   16384,         16384,           16384
##UNITS=     HZ,            ARBITRARY UNITS, ARBITRARY UNITS
##FACTOR=    0.220516191357247, 1,           1
##FIRST=     3103.35392134866, 0,            0
##LAST=      -509.362841657124, 0,           0
##MIN=       -509.362841657124, -308948,     0
##MAX=       3103.35392134866, 274924508,    0
$$ Real data points
##PAGE= N=1
##DATA TABLE= (X++(R..R)), XYDATA
$$ [...]
9952 184247 224573 244689 236411 213415 212806 216295 193671 175875 120243 54742 85175 100672
9940 100672 122298 175716 152827 93375 145238 128950 95189 176162 145835 118804 142829 165173
9928 165173 181788 149076 89679 185847 233643 209263 202287 186995 229582 308846 182973 104922
9916 104922 132184 170399 134054 182588 213748 190402 256582 181880 130022 207533 249346 163189
9904 163189 174687 186031 170855 207330 159816 141579 237470 214598 217223 352587 289417 145299
9892 145299 187595 183738 216385 238045 183306 197386 191310 166522 203804 161256 160096 125121
9880 125121 115340 234641 153530 169931 187448 139453 220676 267324 229242 258650 147108
9869 147108 138145 253932 217647 209409 262556 196343 220648 225168 159561 193906 303094 235440
9857 235440 248425 284960 246027 317944 219461 197770 266095 192702 269309 318346 245726 249780
9845 249780 243100 260279 284157 199460 217652 259507 255583 241878 229855 244427 293680 299922
9833 299922 219048 226450 246929 257613 267480 284818 262962 253239 289683 277519 243661 317977
9821 317977 281715 286963 357015 376073 322182 403401 352166 401164 411039 276365 355340 428193
9809 428193 298293 377341 369081 296520 397121 299504 309265 385297 291894 234792 293529 276788
9797 276788 259376 331804 313797 352587 382607 315395 305592 303404 353486 409235 416086 328968
9785 328968 329336 449583 364552 414681 471734 279295 309499 442675 301892 354577 362173
9774 362173 287559 384667 397652 331767 382557 349227 296880 435667 350658 281577 357260
9763 357260 343231 311942 407840 350691 330682 460988 385749 362712 423407 421456 386917 400862
9751 400862 385090 339845 405951 419424 383529 405229 409246 326896 375442 397981 365506 399544
9739 399544 422832 375307 363071 380114 384435 364024 285109 314158 325379 331469 394295 349764
9727 349764 368894 334432 309839 282424 315184 316408 340373 278331 285297 346251 342266 331002
9715 331002 409181 350430 375893 413322 373408 403350 373966 395865 473276 414023 408394 424865
9703 424865 397024 437953 449447 482165 466416 508935 509668 539134 534831 533395 584228 612291
9691 612291 694548 726956 692772 722037 692589 762703 807189 835454 835201 832806 878199 988387
9679 988387 1008845 965490 1010997 998875 935148 986473 955114 939809 1003162 925544 788673
9668 788673 875898 831719 778826 846913 801370 882664 835950 708128 716158 675752 751245 880485
9656 880485 906096 983475 935267 960986 982032 1007912 1014510 963816 978681 981381 915258 815247
9644 815247 878758 762473 694398 773095 636207 605110 693421 625495 654031 673423 596402
9633 596402 668812 682780 582597 663727 593745 524246 615443 576638 587944 598868 573345
9622 573345 550509 558028 539216 624424 607126 549226 597636 589471 618843 632574 615138 653016
9610 653016 693078 696374 617743 671914 660828 667321 626316 627317 684076 653356 735901 713129
9598 713129 688001 742098 743211 725993 684134 667394 670133 775446 764791 680274 708829 682136
9586 682136 693838 726309 687644 687800 685802 681529 638625 613777 631528 706765 702337 594288
9574 594288 621327 724146 710526 725863 723328 666782 727518 781695 786929 774656 861809 887970
9562 887970 952156 1020879 1059790 1181419 1255262 1264277 1388415 1401411 1421720 1476317 1419933
9551 1419933 1360903 1332109 1273810 1296677 1227338 1084491 1028976 1034543 924770 939975 910135
9540 910135 776342 719383 726013 689331 711424 717518 721495 679757 648638 575103 629677 665633
9528 665633 638362 650323 604574 626569 592429 568431 513298 595589 652118 640657 645692 612145
9516 612145 654631 713793 721392 646111 708940 754657 676105 752931 792269 816900 842048 908403
9504 908403 836680 840794 869226 854215 861813 808848 748211 878669 916153 838616 827390 794917
9492 794917 843109 950468 975712 1027881 1046624 997191 1003245 919135 864953 884974 821381 844115
9480 844115 804659 782211 735185 642731 599939 675037 837242 832192 867459 835676 834986 861348
9468 861348 854212 940899 1016297 1060252 1141537 1185007 1204119 1297956 1317955 1370705 1386048 1352385
9456 1352385 1329326 1368433 1377087 1285712 1319003 1382917 1421725 1467457 1544497 1553215 1553545 1538000
9444 1538000 1424988 1489701 1417489 1279728 1261687 1178771 1077034 986068 908041 908447 864383
9433 864383 832237 765156 824253 836644 857184 913642 851165 828435 928722 952008 947247 1003185
9421 1003185 969875 950062 1022566 1070086 1144838 1229827 1289287 1343832 1327073 1339650 1348879 1448696
9409 1448696 1417731 1360897 1356547 1257456 1202977 1143585 1123625 1114282 1016907 961776 1013530 1014333
9397 1014333 918646 913689 993597 820095 714117 811165 748402 768702 889677 813432 762359
9386 762359 802268 689506 782137 834064 740809 776844 733829 702285 882335 869978 863313
9375 863313 913379 883915 843876 956742 885720 868062 957850 991425 1005260 1055962 1000537
9364 1000537 965182 959234 847834 827406 855470 901160 898829 965947 919473 914379 994826 944267
9352 944267 967434 1038599 1000299 1017031 1012396 1035179 1170733 1215031 1274327 1356037 1376994 1378604
9340 1378604 1477545 1442725 1325450 1346768 1321653 1222976 1171257 1086015 1062046 1072794 1128696
9329 1128696 1120559 1059038 1102760 1084140 1048528 1161428 1222799 1110901 1078183 1008448 946232
9318 946232 984344 914159 810771 939098 892298 869076 931528 890390 908342 842473 810406
9307 810406 766339 859191 852269 850696 907533 837140 852528 892884 938880 922375 866699 807546
9295 807546 803933 867930 788121 768680 781309 844767 859573 777126 706873 676607 642094 620913
9283 620913 676786 676263 648394 626252 667497 627639 664561 734731 699221 738097 737853 668377
9271 668377 680724 655682 608182 653450 740438 743580 794966 798936 835832 834609 846484 733604
9259 733604 757040 779849 764307 777675 833928 776237 783550 802786 796957 857803 779786 717626
9247 717626 813948 820703 791332 808047 821165 785748 846485 865968 824385 881535 908481 868370
9235 868370 855620 809393 760489 762546 776537 822395 837114 785683 782122 799645 794847 840718
9223 840718 849244 859915 879676 867447 888446 931911 888598 873712 851125 868313 899700 905923
9211 905923 934953 1063458 1032357 1024011 1013829 1009821 1107322 1054850 996583 1125503 1103335 1141397
9199 1141397 1160222 1087584 1116799 1122608 1061592 1147751 1228202 1115200 1140913 1151076 1141509 1174387
9187 1174387 1052824 1052859 1045772 1027722 992128 956892 951678 975922 966403 952555 956915 957194 962992
9174 962992 995890 1058753 1090696 1057354 1012753 1090048 1176289 1169580 1203847 1134101 1124910 1211371
9162 1211371 1149641 1132710 1209016 1260751 1277429 1184597 1205426 1188035 1214897 1251063 1235075
9151 1235075 1283356 1286950 1317835 1295651 1334101 1275847 1301325 1302216 1239806 1234824 1300488 1228440
9139 1228440 1179437 1103088 1131789 1217270 1147216 1110905 1220306 1132534 1036111 1119846 1155623
9128 1155623 1203807 1209000 1177292 1223139 1223412 1102971 1143716 1167288 1140857 1171672 1181828 1214411
9116 1214411 1307880 1251153 1294782 1315057 1279173 1329317 1319331 1324548 1392513 1238120 1279434 1366861
9104 1366861 1379807 1417568 1367592 1357559 1464923 1481988 1395418 1436087 1396274 1422019 1542587
9093 1542587 1511117 1506115 1547347 1515185 1613133 1636790 1624719 1728052 1762088 1848019 1928465
9082 1928465 1919867 1929787 2040903 2062895 2039177 2058449 2143802 2131771 2070865 2104216 2112996 2118959
9070 2118959 2159262 2105094 2095781 2153091 2094394 2186539 2270690 2157785 2203462 2244626 2140619
9059 2140619 2278303 2236872 2216383 2344657 2290594 2241479 2341463 2337541 2348504 2371371 2301153
9048 2301153 2253408 2188373 2171164 2308776 2288701 2289871 2450511 2448166 2532167 2650024 2609200
9037 2609200 2750014 2726011 2681039 2842388 2862617 2872087 2961459 2888197 2817688 2844106 2828772
9026 2828772 2853047 2855003 2844395 2965272 2986789 2966473 3041182 3033256 3022922 3010036 3001427 3101727
9014 3101727 3066932 3061450 3216794 3307571 3246734 3362250 3374775 3402274 3466941 3468243 3561956
9003 3561956 3524068 3424062 3456723 3303969 3217930 3206416 3057007 3074872 3091449 3008373 3170175
8992 3170175 3110545 3065858 3327869 3392725 3371431 3498717 3613813 3629644 3749682 3783804 3787568
8981 3787568 3829236 3747618 3720922 3706018 3624163 3633909 3619333 3617171 3609776 3713371 3822736 3877945
8969 3877945 3952070 4046131 4076693 4251954 4395045 4460615 4535389 4699843 4722010 4734515 4670076
8958 4670076 4583141 4476427 4273660 4293219 4352886 4395546 4482276 4568645 4515371 4669958 4921015
8947 4921015 5050041 5311260 5388616 5567026 5731006 5791598 5894317 6000913 5992388 6136926
8937 6136926 6132352 6170053 6257134 6517882 6793848 7226973 7729883 8669859 10267994 13005765
8927 13005765 16679736 20693630 21414986 19385434 17296104 14554908 12158809 10053670
8919 10053670 8648292 7699057 7036778 6616846 6505676 6249568 6157202 6105050 6060952 6034434
8909 6034434 5993961 6126450 6232993 6218645 6303401 6468944 6580000 6677235 6762309 6822233 6986647
8898 6986647 7005365 7082311 7234129 7408359 7584435 7724764 7789866 7929055 8030411 8164046
8888 8164046 8378035 8599793 8761981 9003483 9101617 9417365 9911325 10409357 11013259 11488060
8878 11488060 12072872 12978911 14032905 15323148 16761951 17961377 18815360 19580148 20549918
8869 20549918 21408911 21974919 22080367 21830471 21075142 20071442 19058709 18102258 17488039
8860 17488039 17104128 16806137 16768549 16877767 17140428 17796328 18615533 19548460 20755411
8851 20755411 21725477 22362985 22783269 22575245 22077530 21474988 20520954 19655164 19066651
8842 19066651 18764914 19042661 19838401 21086690 23007190 25012214 27053361 29418000 31823316
8833 31823316 34142205 36065439 36931338 36985792 35928581 33686594 31132633 28250700 25462381
8824 25462381 22983321 20984075 19695731 18869815 18144897 17942867 17990763 18174776 18766274
8815 18766274 19683541 20877123 22272127 23740214 24946830 25612642 25840514 25304794 24096702
8806 24096702 22428522 20569565 18637099 17015134 16008797 15256702 15220601 15652752 16346492
8797 16346492 17395725 18828890 20617886 22566933 24209360 25430522 26050562 26013866 25193962
8788 25193962 23652189 21686733 19602329 17453232 15363330 13775637 12732900 11972659
8780 11972659 11453801 10965820 10574203 10311949 9882703 9604000 9448390 9285811 9089236
8771 9089236 8828539 8651478 8432534 8011871 7813093 7700306 7425382 7339528 7253314 7134917
8761 7134917 7191559 7145866 7050619 7234336 7210703 7166910 7208642 7147825 7158820 7228003 7184340
8750 7184340 7276202 7424329 7517656 7685582 7805977 7832401 7796103 7758846 7756830 7661826 7714376
8739 7714376 7786448 7848319 7946243 7956556 7960640 8067331 8118411 8041721 8073246 7934535 7793298
8728 7793298 7667738 7585535 7739756 7814277 7710800 7944503 8093090 8138871 8315091 8442106
8718 8442106 8517081 8667988 8818027 8959222 9284906 9672647 10189963 10699377 11490722 12668003
8708 12668003 13902155 15232852 16606046 17910113 19194735 20296505 21064472 21723994
8700 21723994 21944578 21705448 21530205 21403271 21233483 21280169 21533559 22087014 22742413 22959369
8690 22959369 23081219 22948477 21958050 20569305 18944189 17007893 15295656 13985621 12764252
8681 12764252 11913847 11405901 10942499 10644327 10585758 10428717 10345581 10484948 10503523 10650338
8671 10650338 10778088 10921912 11407630 11860587 12438725 13364903 14459194 15614019 16938513
8662 16938513 18276083 19367094 20343947 21143537 21511667 21543682 21289417 20959391 20912349
8653 20912349 20873485 20927601 21364868 21880863 22236934 22451652 22354081 21664461 20491621 18903727
8643 18903727 17049342 15318790 13777195 12488385 11497569 10764464 10278877 10086211 9830742
8634 9830742 9711065 9721230 9608968 9617357 9640690 9581472 9575010 9535626 9473044 9486001 9521460
8623 9521460 9636737 9897606 10161142 10444314 10898336 11565982 12266476 13015201 13648559 14169847
8613 14169847 14855332 15520083 15880402 15917334 15805636 15419912 14869692 14424312 14077570 13831521
8603 13831521 13659358 13630912 13762454 13869581 13681963 13411968 12935966 12191809 11341488 10579417
8593 10579417 9942256 9544036 9349265 9306562 9351444 9472898 9595753 9708264 9884141 10091038
8583 10091038 10327671 10628514 10996712 11339610 11949037 12641521 13605016 14920444 16231065
8574 16231065 17467047 18766937 19713024 20550854 21295493 21409873 21040907 20496584 19601113
8565 19601113 18788478 18070849 17503515 17423783 17540193 17668649 17806787 17686436 17122439 16320046
8555 16320046 15043930 13454725 11935344 10542122 9446044 8632934 8095656 7890406 7662873
8546 7662873 7593308 7536665 7556131 7689252 7784480 7929706 8014480 8096603 8240961 8493834 8802137
8535 8802137 9367989 9920966 10373878 10870516 11313819 11828265 12133434 12070002 11961385 11617527
8525 11617527 11069031 10709092 10383035 10035915 9972005 9974007 10037846 10109647 9883075 9541405
8515 9541405 9134535 8381194 7650919 7007613 6353369 5943254 5568244 5404716 5318177 5088213
8505 5088213 4997042 5078452 5086890 5254777 5464554 5454439 5670699 5961898 6119232 6411540
8495 6411540 6787987 7041225 7492915 8084301 8552371 8933810 9107169 9506697 9745621 9656839
8485 9656839 9642555 9569162 9361780 9060200 8767864 8560543 8299862 8080240 7888216 7694805
8475 7694805 7511562 7406878 7455149 7513976 7721510 8064480 8296892 8520854 8581028 8348723
8465 8348723 8072961 7634504 7149908 6646746 6219360 5786648 5364588 5096795 4933525 4886984
8455 4886984 5036221 5278242 5444573 5611211 5862698 6085093 6326287 6530218 6606427 6563351
8445 6563351 6634718 6753665 6695444 6635219 6421475 6163988 5893454 5685766 5489271 5533111
8435 5533111 5590530 5603448 5759614 5969551 6237265 6431833 6211608 6107272 6015833 5522286
8425 5522286 5129680 4676029 4147141 3766658 3367577 2953043 2674363 2523996 2380141 2206090
8415 2206090 2073516 1920561 1708079 1537904 1477933 1424404 1385479 1545426 1619834 1538442
8405 1538442 1647035 1789789 1850942 1890831 1853118 1831225 1786766 1620758 1515447 1353289
8395 1353289 1257315 1289305 1212317 1015222 1048795 1066162 1027647 1036908 1062383 1120979 1125826 1142004
8383 1142004 1176060 1192472 1220601 1271523 1329462 1390575 1351921 1361083 1418344 1489520 1650456
8372 1650456 1732528 1801822 1885554 1906219 1989127 2087567 2161193 2221830 2196118 2182436 2174266 2043042
8360 2043042 1958554 1921835 1848373 1663837 1551365 1438130 1334546 1298557 1245883 1203243 1234871
8349 1234871 1346905 1472823 1815230 2106000 2191854 2309790 2495496 2479333 2509683 2381630
8339 2381630 2204085 2040176 1807076 1651400 1439215 1252677 1155378 1108325 1041001 1047130
8329 1047130 1077651 1063548 1111905 1093307 1081989 1230994 1378088 1432939 1507441 1554225 1611523
8318 1611523 1620968 1492162 1310570 1191739 1101777 1015230 955418 935173 1040126 1082727 1078640
8307 1078640 1144434 1208336 1255595 1354486 1446037 1439010 1366810 1265759 1178702 1095623 1006456
8296 1006456 901380 818267 772687 759506 755644 706547 721235 875672 821981 731576 694343
8285 694343 606813 703476 674008 653805 733306 667874 585558 661821 542188 532272 582503 528476
8273 528476 470309 571107 569986 517447 577826 428196 420522 564631 543568 488873 528621
8262 528621 555600 617986 630241 584812 591773 594080 526278 564438 581195 598734 714208 822896
8250 822896 878151 941164 955321 929942 999135 1007597 901537 896362 947174 955928 1033357 1069075
8238 1069075 1027771 1080797 1096889 1063359 1182702 1235325 1203352 1194486 1084956 1046724 1008819
8227 1008819 892793 883941 833813 717784 563094 533760 498170 469311 523438 638064 679274
8216 679274 632307 715803 817945 852034 1045513 1054549 1109846 1255395 1270325 1294336 1426347
8205 1426347 1316225 1350659 1383126 1179534 1121776 1058300 894734 848678 650664 472637
8195 472637 370082 307856 -88759 -308948 357152 353110 461655 447808 392200 355147 298263
8184 298263 234392 172460 166715 160291 177847 176596 198560 176536 134381 105354 147578 148447 46253
8171 46253 41626 120521 11426 139210 133389 45982 174238 150334 38419 201829 206897
8160 206897 145646 185840 60062 45595 124724 26755 11165 77746 110802 152907 109370
8149 109370 86594 36401 22985 103783 161143 116098 143089 169010 190795 221547 115885
8138 115885 154592 55152 -35546 86436 92901 -45458 75371 82627 24552 61383 -8592
8127 -8592 40541 90612 46923 49052 53561 33826 68610 103189 50387 33653 68975 50401
8115 50401 161652 108345 34690 47921 38372 -5177 15635 17793 68841 84235 90730 46120
8103 46120 51680 46301 -92754 -66491 83685 27954 5037 96671 6810 67418 178608 68885
8091 68885 104246 170466 43605 125520 147659 -54288 62863 118117 5911 95166 706
8080 706 -45919 -13240 -72376 38739 -28347 -17462 -3362 -5771 55204 78244 33879 25317
8068 25317 39753 4655 42130 -4541 17054 79992 -66433 -53836 41323 -78896 -9830
8057 -9830 74150 12710 197700 237689 38342 188025 167246 32640 102647 145585 97064
8046 97064 256450 145278 77323 149512 157465 79891 150476 158577 57783 111621 46115 17402
8034 17402 45352 72023 61867 121445 115718 60505 147350 146829 64660 75046 63000 76678
8022 76678 82736 43800 50122 91093 417 -65357 109773 107403 25864 37900 76846 106647
8010 106647 133931 87174 86609 101728 55272 109251 153861 142363 113913 54355 145926 131673
7998 131673 49810 48702 108229 126157 160976 166195 163237 143702 41089 133877 175031 101812
7986 101812 95896 84829 59745 131308 94345 8706 106029 104238 87379 142627 66492 50195
7974 50195 140141 140460 48675 159244 136522 47276 127359 85045 42042 110000 21427 37875
7962 37875 162245 74385 76696 167778 36203 91003 135271 68762 81982 144340 99060 185041
7950 185041 216305 85677 119579 241914 182131 149126 111800 6008 99958 100199 54683
7939 54683 123844 95324 108905 228093 183568 101287 122519 121708 137564 229122 212776 119706
7927 119706 210639 176142 119542 166103 199002 132965 101118 156030 225447 224153 182440 257890
7915 257890 306462 283994 240075 201368 203250 244019 169705 297150 375944 305582 332773 257336
7903 257336 310340 357985 256189 329488 410997 350833 453591 520662 401348 510040 482954
7892 482954 342704 484035 486683 468186 482199 461054 547872 515984 475159 464829 456000 470442
7880 470442 474029 418837 390089 404759 371501 384005 360297 371747 437742 358032 394645 414569
7868 414569 297461 355814 403836 338511 366611 354707 388213 499688 440735 369229 489770
7857 489770 447287 482026 511892 468529 541253 563772 472635 540058 586251 574521 639418 586874
7845 586874 597802 621390 537572 521794 454352 438955 541243 504277 455482 412548 365778
7834 365778 423068 429832 397272 429566 464575 406790 369215 361683 352869 373406 324641 398405
7822 398405 376829 416812 433589 436498 461334 444906 468827 429124 388806 450562 518410 471375
7810 471375 394415 523864 540076 554099 755356 505922 383392 385296 400912 488639 415225
7799 415225 432666 539629 525022 526814 587126 569058 600479 553717 514358 545927 531942 560296
7787 560296 581786 593905 607896 657995 627153 741273 744026 613630 707620 829176 816520
7776 816520 838716 845079 899310 978244 992443 983451 1014865 1019581 1009725 1047568 1093058 1153350
7764 1153350 1158326 1188401 1234233 1187006 1156415 1195767 1166286 1138509 1116451 1123050 1185908 1195180
7752 1195180 1136992 1170551 1205351 1310619 1317201 1297825 1391503 1448248 1416181 1493625 1571126
7741 1571126 1641670 1640864 1685966 1843720 1926495 1931389 1988142 2071946 2099394 2197151 2246300 2260155
7729 2260155 2387874 2491371 2530120 2611223 2790938 2907828 2983167 3115195 3356436 3548935
7719 3548935 3795188 4066677 4330599 4696628 5058538 5221010 5582704 5856092 6099309 6449882
7709 6449882 6642162 6827578 7102316 7271782 7421978 7425600 7222049 7174906 7146319 6878939
7699 6878939 6808896 6702434 6412755 6269474 6106313 5839347 5677226 5447422 5118381 4909762
7689 4909762 4636805 4443937 4303898 4038379 3751303 3544148 3232461 3060430 2930874 2642696
7679 2642696 2484957 2466817 2319344 2157546 2013479 1922680 1888371 1889118 1767897 1716198 1697655
7668 1697655 1519858 1423061 1338782 1235823 1303388 1250480 1141373 1131921 1094851 1000211 1013261
7657 1013261 923723 956514 957162 910912 916001 933871 870316 839762 873968 943854 854434 815043
7645 815043 700645 800398 811009 676425 762892 718723 581577 625062 657465 657785 646149
7634 646149 542018 570268 656796 549301 524684 623138 568333 621509 602024 488468 553727
7623 553727 554392 475834 568571 550174 473517 515611 510157 499029 558070 562079 599886 619962
7611 619962 554138 584953 692832 590250 537230 580151 583321 595311 608568 570568 651322
7600 651322 668609 648916 616619 643477 593149 589992 614654 540258 512958 572518 494570 513538
7588 513538 573825 460755 539891 608239 473443 579252 624366 612271 798561 677093 571647
7577 571647 692712 644496 664518 674034 586754 741757 827873 659659 679002 630115 541869
7566 541869 651995 650512 615246 685996 588534 575630 616064 475743 507981 556277 434180
7555 434180 407030 415457 361064 384517 449922 400431 475347 438320 481769 523342 421405 373810
7543 373810 444181 430934 479000 596343 523918 438110 462225 388717 364363 436939 323781
7532 323781 344717 386930 340253 346215 459084 344091 333419 352935 304818 369040 393841
7521 393841 314647 427333 461614 373794 430471 353102 294904 384347 360287 293894 255860
7510 255860 184209 137251 216831 190573 207917 260455 306327 292028 231307 196613 250575 227407
7498 227407 242473 335797 293097 279868 285488 288406 287265 269529 321393 329393 251887 287601
7486 287601 294681 266763 297431 296873 324900 326695 388402 371572 350421 310164 323228 375414
7474 375414 328864 272173 276310 300636 247210 286483 311000 286184 319770 293077 199980 199517
7462 199517 199689 236498 309925 320235 238095 208582 297668 279757 242964 258097 232802 225240
7450 225240 211818 179473 224722 266010 211424 176232 211276 237230 241841 261857 254263 315455
7438 315455 318857 358561 370408 359867 280033 256086 313560 353360 286098 265142 362852 348533
7426 348533 295638 245920 282266 441337 368817 357144 468893 370245 344029 368670 269989
7415 269989 309803 297135 242918 331264 335438 322818 387638 384905 332299 398870 309191 281503
7403 281503 434314 377565 402071 496986 436975 458344 428036 319335 369930 442894 365637
7392 365637 391423 489724 414094 458743 400958 339200 307682 364677 385360 337327 367460 258838
7380 258838 280816 378278 337614 365377 349419 241502 376621 287665 231258 383010 356739
7369 356739 307162 390049 293516 289977 353354 397967 395849 436788 383140 421816 466067 434696
7357 434696 489590 453453 416298 501908 479541 510593 529085 467536 481844 470844 413275 417315
7345 417315 440411 271225 269554 304583 272697 300344 297114 227088 302693 282296 263919 296402
7333 296402 245157 302902 306453 214860 307618 350740 326060 364880 330809 300960 283948 363609
7321 363609 395377 348491 404350 436627 431967 325016 344986 418383 371900 349963 353545 346406
7309 346406 336915 346354 322562 257566 388397 358890 319210 486933 392294 312219 421422
7298 421422 411967 448066 503425 423422 472318 537300 363207 407034 437430 329742 456638
7287 456638 416675 336630 449966 444112 351994 446021 464929 336180 411518 321498 298440
7276 298440 397198 359053 355577 384612 391655 414895 466068 402095 391051 415736 427287 427167
7264 427167 394821 337902 311780 364886 344132 323277 307833 339224 329671 372504 414840 393455
7252 393455 391765 321985 385338 454325 345138 355708 401110 404636 495089 481274 409710 447520
7240 447520 512828 448075 457071 495447 402873 351688 406563 391015 370710 372996 467150 452353
7228 452353 479689 437264 455337 472268 446443 423258 436774 512406 468889 447142 448458 436894
7216 436894 510458 536795 461965 511973 482401 427949 496527 467366 466198 568891 515513 451475
7204 451475 489453 512426 513192 575803 591178 561934 595496 491849 565188 517646 427457 452132
7192 452132 456691 375631 380190 419018 478586 422539 421768 464517 480133 539774 419383 414082
7180 414082 457111 428222 465975 531318 399392 418131 533189 514858 476096 512398 378931
7169 378931 423361 498144 377594 494485 548423 401694 501338 475360 364655 521152 540289
7158 540289 412772 531047 484032 478234 630031 614115 537812 592585 523553 538494 632707
7147 632707 560393 548749 608452 578728 535065 561390 552708 464149 471768 431341 408712 515851
7135 515851 432676 398500 528960 446980 416471 567362 529231 471054 532920 482642 555022
7124 555022 633831 514986 571239 594154 573596 618061 657548 659187 809191 779103 690258
7113 690258 802705 794197 753189 724779 690882 737733 725214 707406 625104 588766 632561 654015
7101 654015 568014 624291 561170 554167 671412 621570 619235 611311 559544 609156 613011 589983
7089 589983 639134 646324 568601 524027 611268 595988 588300 586488 651706 681488 685290 681770 698625
7076 698625 759210 793742 862957 972796 1012460 1060936 1184729 1198125 1147483 1299743 1242491
7065 1242491 1187661 1250468 1184912 1102977 1155894 1156443 1152529 1197389 1100831 1106328 1119619 994806
7053 994806 1029377 1044898 898013 892497 922627 796000 773714 741427 623295 722757 760500
7042 760500 656033 715482 696976 590984 621343 679100 563278 617052 641159 528570 639870
7031 639870 629226 583441 687757 658390 567292 659135 689472 707035 753298 615807 578299
7020 578299 637456 578135 591729 574397 545375 550237 545701 542357 594358 629102 654723 636444
7008 636444 665878 615775 672148 732758 789572 844538 881606 939407 959080 1016178 1112084 1127315
6996 1127315 1217967 1205157 1156845 1208472 1150748 1085068 1112897 1039236 956632 950860 951420 972795
6984 972795 890352 870651 932189 921382 836541 749295 775301 795771 791427 818717 734339 641002
6972 641002 746883 833512 819660 888026 928827 977745 1158608 1191887 1285022 1432008 1481925
6961 1481925 1506816 1521912 1485374 1436708 1372253 1288931 1356036 1437409 1470943 1557331 1540991
6950 1540991 1542951 1547317 1451228 1440586 1374557 1284407 1104941 986462 940281 877644 855118
6939 855118 905301 850904 896531 823221 736048 831571 817133 820518 903175 882514 869632 906234
6927 906234 898452 902026 973274 946153 971502 925101 870947 880604 878715 892095 967259 912397
6915 912397 855477 924295 814376 892353 870355 781769 884897 934066 1020498 1195820 1229816
6904 1229816 1271837 1344476 1375253 1468965 1497837 1465531 1463866 1421855 1376787 1317806 1300221 1344516
6892 1344516 1365555 1404718 1453095 1515339 1537593 1608867 1540315 1497069 1334853 1208060 1207960
6881 1207960 1164342 1159770 1223331 1224478 1306284 1400542 1384182 1382779 1297571 1143573 1222839 1212588
6869 1212588 1083972 1081690 1116656 1033851 1029601 952025 928923 950193 866800 873341 858135 854228
6857 854228 898403 844532 799819 918662 869721 869625 941226 960262 908646 869828 862132 988610
6845 988610 1002010 895244 963603 1010797 1044330 1041648 945556 1055235 1087589 1093868 1129556 1221470
6833 1221470 1195587 1172806 1089440 1107500 1185693 1138589 1204101 1323219 1331401 1384492 1466246
6822 1466246 1441404 1434351 1431868 1379573 1347234 1253001 1155751 1165447 1154493 1106089 1062464 1093863
6810 1093863 1095550 1084491 1071968 1033266 1103767 1139943 1062206 1072394 1161594 1114971 1157168 1084700
6798 1084700 1046553 1130397 1094942 1072828 1166393 1146130 1177938 1189346 1113557 1158837 1202494
6787 1202494 1184563 1263579 1335740 1241561 1296021 1257599 1204467 1248313 1279430 1287542 1471362
6776 1471362 1447724 1409942 1558062 1582710 1626462 1782072 1788574 1759945 1852281 1949528 1889510
6765 1889510 1875119 1767300 1673814 1696578 1632084 1571010 1470967 1446898 1516545 1508791 1417732
6754 1417732 1432109 1426138 1383521 1383864 1457037 1412311 1506896 1582102 1568473 1561316 1612124 1641942
6742 1641942 1655222 1644822 1618246 1656085 1650734 1651621 1792999 1791748 1832763 1925894 1965450 2012254
6730 2012254 2020786 2144800 2244698 2275674 2279628 2232286 2280840 2380116 2361823 2353832 2370188 2386784
6718 2386784 2418644 2586003 2682988 2693667 2854605 3048004 3033522 3065944 3049816 3000354 2956487
6707 2956487 2877944 2896014 2998884 3087935 3133838 3180522 3273263 3258176 3289296 3318091 3207542
6696 3207542 3178428 3227480 3201250 3267641 3393752 3513357 3721076 3868543 3872081 4168997 4320735
6685 4320735 4284454 4390764 4354716 4311854 4532674 4583572 4701263 5036903 5172916 5294625
6675 5294625 5687490 5840613 6016900 6330294 6447601 6607442 6829537 6968404 7214178 7639948
6665 7639948 7890066 8163324 8620908 9071971 9571249 10126444 10649880 11281425 12033056 12850625
6655 12850625 13700188 14807299 15986860 17354714 18931895 20526084 22307243 24001376
6647 24001376 25184705 25861106 25717149 24493986 22776734 21019351 19174635 17875731
6639 17875731 16956466 16007719 15468113 15004499 14335713 13807137 13330601 12746386 12399594
6630 12399594 11956587 11385454 11118220 10646110 10055843 9643329 9050286 8392485 7891092
6621 7891092 7384506 6906683 6508683 6123253 5748818 5500992 5187312 4928847 4822392 4679456
6611 4679456 4404357 4280394 4144004 3902405 3836619 3767267 3635546 3580955 3494843 3343586
6601 3343586 3396017 3314388 3227900 3291380 3097756 3108827 3151794 2947386 2958263 2863972 2683567
6590 2683567 2747193 2671823 2577596 2479485 2445535 2432835 2493111 2452420 2454928 2452885 2458625 2492364
6578 2492364 2449528 2380832 2355992 2319449 2281870 2395084 2275248 2364388 2417190 2213563 2351152
6567 2351152 2405720 2265481 2386377 2365495 2261197 2379320 2340197 2352607 2489512 2421033
6557 2421033 2474578 2574332 2563079 2613116 2632560 2619103 2675572 2746332 2686002 2710139 2793168
6546 2793168 2800579 2782988 2756082 2746759 2741930 2766367 2845591 2860662 2889738 2951655 2968277 3075369
6534 3075369 3036005 3062429 3321192 3436813 3498272 3762207 3937598 4190241 4584775 4835278
6524 4835278 5324438 5844731 6214319 6592754 6956372 7170890 7245973 7250333 7042965 6694358
6514 6694358 6303021 5790454 5342433 5048797 4561062 4230726 4026227 3742058 3529879 3539379
6504 3539379 3319180 3052073 2974628 2786476 2710233 2740625 2694277 2608948 2616619 2485845 2497855
6493 2497855 2565206 2491234 2500301 2566904 2491861 2449935 2542597 2423640 2441258 2503469 2443148
6482 2443148 2462970 2491579 2405000 2486971 2502292 2390664 2449685 2476339 2356960 2452076 2485116
6471 2485116 2409331 2504412 2476527 2389795 2471766 2380754 2364338 2465396 2440710 2391991 2458250
6460 2458250 2506300 2524539 2540419 2411664 2363553 2465633 2423205 2372127 2524885 2536786 2490625
6449 2490625 2536291 2545941 2521697 2614879 2643219 2632253 2644945 2625810 2605656 2688331 2688963 2562232
6437 2562232 2644279 2601661 2650069 2753622 2652521 2680996 2760601 2700727 2735518 2759452 2819540
6426 2819540 2938016 2944847 2939009 2953753 2931514 2956591 2982661 2953832 3079575 3083191 3077171 3115328
6414 3115328 3043285 3036844 3135969 3138299 3107308 3133335 3123019 3259731 3344308 3262953 3343468 3374287
6402 3374287 3380516 3395670 3435144 3489879 3573014 3669774 3617985 3739667 3831411 3805476 3945700
6391 3945700 4067863 4047134 4110677 4255771 4361954 4475205 4563042 4625465 4837518 4980004
6381 4980004 4959024 5200083 5339957 5381170 5518762 5598678 5641792 5929526 6053673 6200043
6371 6200043 6564768 6707657 6895928 7264447 7510475 7815836 8230348 8649476 9228452 9980807
6361 9980807 10628032 11541890 12713197 14373879 16764606 20174654 24312508 28721095 31112924
6352 31112924 32438088 36054874 40392002 41386048 41233744 40601254 37473675 33192912 28684324
6343 28684324 24558032 21508876 19957957 19092729 18665444 18426191 18251644 18154502 18150017
6334 18150017 18061867 18053993 18128570 18122263 18089694 18096070 17900622 17827872 17972176 18211970 18560390
6323 18560390 19184442 19828295 20770612 21829815 22815622 23997974 25449743 27043943 29082315
6314 29082315 31321005 33576353 35818575 38005935 39674670 40798248 41131890 40353063
6306 40353063 38604766 36034557 32844680 29689017 26874375 24565237 23057317 22344006
6298 22344006 22367391 23137970 24468075 26362482 28574244 31037437 33716722 36486521 38869567
6289 38869567 40454325 41151310 41173794 40096609 38033457 35401516 32186579 28774443 25316587
6280 25316587 22021026 19119911 16939618 15086350 13678106 12681524 11962536 11503503 11180808
6271 11180808 10914560 10788873 10858623 11018274 11210020 11570228 12107102 12613201 13288679 14226283
6261 14226283 15261427 16504326 18081536 20032817 22378907 24927204 27706813 30796234
6253 30796234 33779754 36844886 39763286 41876965 43326340 44127798 43937112 43034418 41493335
6244 41493335 39245884 36673500 33934165 31116974 28752134 26723444 25220424 24490954
6236 24490954 24428396 24983374 26301007 27945568 29749468 31585980 33373094 35006198 36172970
6227 36172970 36742062 36425663 35352911 33630575 31234543 28818307 26385004 24015089
6219 24015089 22200081 20729739 19536856 18685068 17811167 16850486 16128882 15470143 14880967
6210 14880967 14533412 14203144 13977429 13955031 13908666 13934375 13915593 13742930 13559525 13372963
6200 13372963 12862859 12352450 11931309 11410967 10927672 10480586 9891161 9272129 8673101
6191 8673101 7853356 7032113 6598748 6093582 5668672 5440990 5179688 4970690 4803427 4658901
6181 4658901 4608394 4669166 4470364 4389942 4445714 4356407 4348838 4326599 4286247 4330003 4346434
6170 4346434 4338432 4473437 4521641 4478199 4579341 4608339 4622311 4692758 4643760 4561194 4597148
6159 4597148 4616378 4649224 4755683 4773090 4693548 4674696 4711976 4672104 4562080 4461589 4301355
6148 4301355 4297377 4202894 4027287 3881516 3771513 3667632 3596411 3514057 3446911 3461447 3459361
6137 3459361 3419629 3398443 3413157 3464290 3441747 3467842 3534445 3475347 3519942 3597821 3541474
6126 3541474 3550740 3559563 3452673 3358458 3247840 3062235 2980415 2868847 2641510 2670013 2633412
6115 2633412 2545683 2509766 2473259 2407348 2535056 2522716 2513556 2642028 2668716 2837841 3023373
6104 3023373 3055482 3203791 3394538 3437753 3611533 3746381 3700203 3771157 3800400 3708203 3668275
6093 3668275 3621466 3404134 3313334 3161793 2887766 2756005 2640270 2447472 2353955 2285098
6083 2285098 2107364 2120105 2066168 1940722 1972030 1974283 1983079 2057749 2062515 2063630 2069384 2051586
6071 2051586 2072981 2191626 2140338 2124715 2217156 2129484 2084401 2216530 2128646 2020699 2117108
6060 2117108 2101219 2182082 2210774 2128231 2162756 2201882 2167645 2168281 2237219 2267993 2226487 2257758
6048 2257758 2258769 2246074 2241443 2275281 2198790 2238277 2326050 2244585 2254438 2250297 2297024 2264398
6036 2264398 2216071 2221299 2283731 2282793 2289068 2377589 2370191 2448225 2551509 2584953 2732997 2756169
6024 2756169 2769718 2844938 2794332 2789162 2865095 2881084 2944989 2967370 2923175 3060378 3178235
6013 3178235 3076540 3095175 3053403 2985256 3047389 2906272 2891530 2841672 2677054 2649349 2684513
6002 2684513 2559392 2555436 2697795 2662259 2629822 2727495 2691415 2696778 2703006 2685591 2805330
5991 2805330 2750324 2670648 2662678 2693708 2830396 2911869 2974943 3089491 3162175 3375912 3534598
5980 3534598 3674045 3742915 3697893 3788125 3832771 3814714 3588209 3433822 3317771 3162685
5970 3162685 3100791 2897287 2937892 2918987 2840706 2884585 2915893 2907461 2971132 3008405 3027399
5959 3027399 3141100 3196148 3132774 3206806 3278378 3348553 3441424 3619890 3807222 3973370 4188466
5948 4188466 4389503 4736388 4949031 5075086 5280989 5351823 5431923 5612251 5622468 5759840
5938 5759840 6009350 6234468 6438407 6764102 6813901 7002106 7110816 6956529 6838877 6591639
5928 6591639 6165712 5787366 5366283 4899436 4586055 4259236 3981104 3768564 3646951 3532982
5918 3532982 3564016 3512457 3561792 3552640 3643828 3728280 3715691 3768702 3747896 3696900 3649342 3537461
5906 3537461 3498818 3416403 3239748 3206656 3150255 3046134 2993444 2979253 2912725 2978730 2929108
5895 2929108 2869934 3007661 3096023 3076481 3093687 3091225 3156908 3249670 3214765 3214324 3280564 3302702
5883 3302702 3343400 3369660 3470631 3642801 3672307 3684386 3682134 3691076 3786598 3830247 3884311
5872 3884311 3930564 3817832 3896001 3952262 3889020 3987298 3948674 3838693 3886979 3869160 3807260
5861 3807260 3882571 3806767 3679452 3660028 3500492 3351860 3330145 3168923 3060007 3102199
5851 3102199 2995233 3008322 2915307 2829198 2803795 2758919 2814136 2828752 2884676 2962128 2971940
5840 2971940 2985693 3026509 2990588 3009064 3054003 2986448 2972701 2960024 2925768 3011094 3056285
5829 3056285 3104222 3123897 3185720 3255025 3364520 3437914 3536813 3662007 3696893 3692328 3845438
5818 3845438 3887745 3867442 3996802 4015080 4034979 4137820 4123412 4075781 4104080 4035944 4026102
5807 4026102 4057131 3942279 3846392 3910729 3775034 3661001 3592736 3419105 3307362 3427110
5797 3427110 3306825 3218299 3347480 3184922 3183658 3317235 3139155 3139247 3279246 3158716 3144837
5786 3144837 3211576 3158346 3202442 3232302 3063947 3139719 3152475 3091262 3225075 3213841 3185061
5775 3185061 3333102 3299888 3232931 3236508 3190866 3192276 3338568 3301161 3280885 3331901 3400295
5764 3400295 3384113 3387423 3465863 3476970 3499014 3491813 3473589 3492733 3615588 3550883 3586373 3557765
5752 3557765 3425924 3653717 3740388 3631354 3735289 3678280 3652611 3878103 3835570 3770955
5742 3770955 3959278 3978949 3911359 4037006 3916632 3990518 4107165 4051867 4170254 4157803
5732 4157803 4127304 4145869 4131803 4109465 4217620 4271575 4314194 4374373 4271416 4299231 4399036
5721 4399036 4528100 4749822 4801472 4944516 5004621 4894395 4936671 5047473 5064451 5204488
5711 5204488 5250978 5211699 5379510 5338628 5160530 5225145 5200255 5167108 5229539 5182701 5180737
5700 5180737 5306682 5238910 5251014 5469588 5419183 5368025 5505763 5492257 5570624 5658869 5771637
5689 5771637 5999402 6274034 6529751 6784188 7290754 7987326 8695763 9582866 10113284 10197878
5679 10197878 10572500 11126816 12072074 12838358 12953677 13178268 13221137 12584235 11781328 10988098
5669 10988098 10140934 9720055 9450889 9197910 9262071 9292018 9216591 9300662 9420346 9612064
5659 9612064 9870898 10138819 10596710 11156790 11827430 12662184 13940307 15822899 18078047
5650 18078047 20379779 21723859 21709419 22315319 24145126 26505600 27815676 27819172 27860056
5641 27860056 26922089 24636060 21464964 18218369 15524321 13523358 12305580 11536544
5633 11536544 10898678 10524763 10317668 10121184 10184944 10426066 10680502 11013890 11438310 11998135
5623 11998135 12729993 13734043 15230124 17250211 19548299 21770036 22827985 22789500 23737586
5614 23737586 25610966 28120010 29147284 29042915 29222669 27982044 25574399 22573748
5606 22573748 19375196 16909453 15321469 14352980 13871795 13554345 13582788 13713123 13939974
5597 13939974 14308427 14823932 15384706 16071539 16839995 17508126 18173635 18939345 19931416
5588 19931416 21060182 22396667 23707797 24578706 25450688 26798506 28475696 30358926
5580 30358926 31904634 33275798 34804455 36173659 37444391 38938345 40767445 43127825
5572 43127825 46278524 49980636 54042024 58517562 62916083 66999699 70659091 73437098
5564 73437098 75262945 76051752 75436629 73601750 70780459 67076976 62759966 58287105
5556 58287105 53561685 48916940 44512243 40395182 36650757 33047277 29701021 26622920
5548 26622920 23795420 21155089 18815245 16924711 15430766 14262660 13308425 12663617
5540 12663617 12034909 11555098 11088320 10596553 10177397 9747536 9272336 8831547 8494051
5531 8494051 8119120 7870262 7647520 7426837 7277961 7107196 6912157 6919052 6896784 6809674
5521 6809674 6809946 6772600 6763170 6794104 6766417 6797056 6849164 6840368 6796041 6872519 6777187 6780131
5509 6780131 6724526 6635106 6578636 6538447 6370501 6253079 6254444 6052160 5951851 5898051 5797339
5498 5797339 5710626 5663391 5520926 5458129 5415467 5332773 5366625 5397177 5363394 5465078 5435989
5487 5435989 5413632 5517891 5490715 5505487 5545260 5569927 5544038 5598698 5524761 5509323 5436630
5476 5436630 5387278 5360037 5315287 5267885 5338047 5255482 5156355 5131707 5062667 5052870 5066192 4926412
5464 4926412 5010514 5136100 5093291 5178081 5298552 5300923 5416669 5369041 5306259 5383948 5404364
5453 5404364 5453178 5512631 5496603 5526090 5537029 5618513 5703848 5711534 5804202 5853507 5971124
5442 5971124 6128142 6145870 6197825 6506805 6631582 6661426 6795597 6796497 6945601 7162421 7239834
5431 7239834 7429251 7582471 7636350 7964403 8149341 8240417 8461413 8642467 8948642 9297012
5421 9297012 9466552 9763581 10235683 10626064 11103756 11687463 12256562 12967926 13714722 14528067
5411 14528067 15663715 17009422 18606877 20538085 22859776 25848058 30339994 36932702
5403 36932702 45927757 56292334 66946928 70007454 68459759 71150418 77847110 89523400
5395 89523400 99675107 100113175 101292866 100937298 92226122 78571812 61874341 46122290
5387 46122290 34386171 26749275 21510910 18012260 15258846 13239896 11652756 10501507
5379 10501507 9593168 9094685 8685363 8488982 8263420 8143434 8121209 8208582 8173737 8263198
5369 8263198 8135835 8060001 8040745 8026582 8126647 8156921 8084897 8068947 7926722 7729984 7525931
5358 7525931 7329271 7103218 6904413 6708380 6550687 6383257 6209543 6212774 6135667 6046263
5348 6046263 6040072 5958601 5932146 5922031 5847805 5831408 5843092 5734403 5754996 5830383 5794650
5337 5794650 5737385 5730692 5716421 5735041 5791313 5810811 5811660 5815867 5865768 5952130 6018563 6062359
5325 6062359 6100114 6393598 6407250 6382753 6242496 6029402 5908436 5875229 5847011 5916595 5952055
5314 5952055 5917506 5993603 6043374 6036417 6064729 6046722 5993362 5999954 5845560 5819191 5915130 5872605
5302 5872605 5896565 5976704 6071677 6148240 6177852 6056323 6108437 6205747 6189017 6217364 6121653
5291 6121653 6101684 6218690 6217026 6266076 6271262 6210735 6309350 6248851 6244878 6262353 6259849 6288536
5279 6288536 6309979 6306352 6377113 6332792 6377939 6539076 6596882 6655069 6698819 6715416 6781778
5268 6781778 6787176 6809833 6899426 6955588 7069308 7182452 7135097 7166928 7355010 7316987 7375120
5257 7375120 7562465 7544512 7641274 7687173 7671943 7900855 8061193 8205127 8332396 8344314
5247 8344314 8471616 8530502 8499894 8660625 8812617 8782257 8846623 8867274 8896902 8953399 9003955
5236 9003955 8917926 9012616 9197466 9276728 9440783 9652196 9764652 9915544 10159814 10444701
5226 10444701 10727104 11079154 11359061 11745110 12137573 12588730 13064377 13524666 13973438
5217 13973438 14586393 15238517 16002158 16958650 17905717 18823051 19639934 20320339 21205692
5208 21205692 21940573 22287652 22365206 22170102 21446263 20439146 19238858 18090022 17114837
5199 17114837 16116170 15369230 14826065 14349160 13946794 13683506 13504606 13356050 13262614 13231636
5189 13231636 13334216 13531710 13668021 13935071 14298998 14609459 15082773 15501187 15885526
5180 15885526 16441839 16697099 16924411 17077387 17198015 17255707 17360601 17334829 17317653 17292311
5170 17292311 17238644 17335772 17430096 17516614 17564229 17614412 17624412 17531278 17384703 17107117 16815655
5159 16815655 16482938 16199065 15925202 15709607 15583027 15392875 15268879 15242006 15279805 15439520
5149 15439520 15591413 15766309 15987043 16192736 16533067 16836294 17038397 17288614 17591599
5140 17591599 17725476 17813968 17901790 17877712 18023081 18189718 18242010 18436589 18531715 18609430
5130 18609430 18840419 18903185 18949146 19141733 19162686 19215360 19370918 19440030 19680574 19879167
5120 19879167 20117431 20506372 20823684 21182880 21752823 22444946 23191323 24252788 25441129
5111 25441129 27178540 29862981 33860509 39555427 46685678 53524203 57065135 61474348
5103 61474348 69485382 72968903 73011265 73039286 69617921 63394100 55750851 49294669 43775590
5094 43775590 39267841 36040588 33177582 30305804 27575038 25223917 23491644 22261040
5086 22261040 21547009 21110856 20725977 20429853 20232720 20136815 20133267 20065460 19990515 19882838
5076 19882838 19788421 19816468 19801932 19856630 19871439 19876104 19854991 19719013 19584321 19568009 19446974
5065 19446974 19296821 19139614 18943938 18721269 18592718 18442680 18416269 18345505 18203368 18204438
5055 18204438 18178338 18049710 17955699 17887964 17907273 17930795 17840157 17748106 17830301 17744545 17764268
5044 17764268 17753395 17679460 17672855 17543284 17331694 17304454 17262780 17133691 17131871 17077451 17013111
5033 17013111 17023794 16948066 16965142 17066414 17069376 17128483 17258493 17297727 17362224 17343180 17426076
5022 17426076 17479456 17540987 17699662 17842037 17909688 18074527 18179440 18282712 18515881 18880062
5012 18880062 19435080 20159219 21146101 21996257 22246934 22866012 24086742 24357214 24285253
5003 24285253 24283436 23578673 22732111 21821667 21044254 20509627 20182726 19954055 19799624 19538582
4993 19538582 19287841 19036717 18707689 18518941 18452375 18247754 18222869 18226810 18206410 18266448
4983 18266448 18271615 18277007 18267078 18227641 18267197 18256797 18180027 18227800 18340212 18374252 18536752
4972 18536752 18622158 18782299 18898802 18981825 18998050 18915293 18976707 18933390 18931705 19060497 19231154
4961 19231154 19385403 19605822 19824634 20039267 20399392 20716103 21017921 21397507 21581779
4952 21581779 21850802 22231294 22444765 22637520 22863585 22976046 23265305 23579524 23778342
4943 23778342 24203437 24714712 25309533 26132953 27057145 28023265 29083550 30215194 31366332
4934 31366332 32572906 33728819 34827617 35949931 37031080 37944650 38646277 39157603 39814634
4925 39814634 40366918 40658471 41129094 41756440 42383541 43239221 44322878 45843358 47696435
4916 47696435 49869602 52489921 55724948 59328958 63419032 68143197 73475612 79333981
4908 79333981 85899157 93040106 100843272 109104669 117318623 125245245 132555207 138714546
4900 138714546 143565936 146482263 147340030 146211673 142893688 137504593 130848840 123029677
4892 123029677 114509780 105734821 96823185 88047132 79851847 72084451 65004647 58803544
4884 58803544 53405831 48769304 44803207 41216875 38203625 35496554 33176869 31330845
4876 31330845 29779040 28363145 27127222 26140887 25342121 24600661 23972126 23366913 22861084
4867 22861084 22309784 21771929 21308832 20919506 20461623 19958841 19609442 19181203 18797357
4858 18797357 18421186 17963518 17605912 17413763 17131327 16658645 16267880 15910104 15582831
4849 15582831 15333721 15037448 14821309 14616418 14440191 14313891 14194166 14036171 13982787 13902065
4839 13902065 13720819 13669818 13748878 13686965 13652182 13600045 13611532 13598462 13501544 13267293 13122331
4828 13122331 12960845 12834506 12858466 12858301 12883518 13095015 13162733 13206930 13157065 13069355 13127076
4817 13127076 13398323 13691594 13904759 14005582 14058302 14052879 14227583 14347173 14398129 14277570
4807 14277570 14282323 14097091 13800279 13348176 12915663 12505104 12301088 12135783 11994833 11904764
4797 11904764 11862381 11758617 11766151 11785396 11896754 11912277 11894805 11828408 11939168 12014544 12133090
4786 12133090 12213282 12316444 12366857 12495418 12646757 12961829 13325486 13813719 14271720 14756477
4776 14756477 15171986 15328970 15351255 15201687 14905270 14588771 14177732 13994232 13801028 13739893
4766 13739893 13768635 13940655 13968668 14087306 14141283 14164956 14229084 14197044 14262127 14371728 14446705
4755 14446705 14583919 14747960 14906853 15157142 15456437 15648486 15952859 16275029 16652519
4746 16652519 16890381 16953319 17010762 16912716 16969913 17265020 17581048 17866220 18251874 18496852
4736 18496852 18749705 19101798 19360148 19507971 19664626 19629799 19841875 19996869 20204512 20464107
4726 20464107 20852053 21175867 21825780 22370035 23029587 23841844 24796786 25698075 26946547
4717 26946547 28216100 29759310 31400455 33396437 35573132 38702402 42236545 46833999
4709 46833999 53128205 62473802 76206138 95585889 118693686 140837546 157612331
4702 157612331 178098226 189245334 186481140 179169718 162233956 139154488 114148038
4695 114148038 91500430 73663776 61602374 54044568 49424924 46674500 45218928 44854555
4687 44854555 45782888 47807510 50548424 54618751 59477765 66568641 77512443 94919246
4679 94919246 120070046 153049294 185530307 201560017 220696575 261032289 274924508
4672 274924508 271535649 267784488 242815979 205810892 163257256 123790444 92226582
4665 92226582 72143888 58357972 49564031 42969990 38170141 34414556 32126887 30461272
4657 30461272 29709006 29438672 29727405 30199243 31231118 32290925 33489536 34518548 35485335
4648 35485335 36046135 36267901 36003126 35224584 33891368 32265482 30449766 28788123 27289612
4639 27289612 26208652 25382712 24788913 24308082 24163040 24131691 24237995 24598991 25071061
4630 25071061 25731778 26499008 27442015 28657539 30146853 31846159 33807328 36114824 38960811
4621 38960811 42356120 46413638 51199089 56901676 63823035 72747876 83849873 97124918
4613 97124918 111820381 126369346 139331625 150880289 160616233 166167679 166083365 160897789
4605 160897789 150700209 136624338 120314920 104159035 89611258 77385980 67630648
4598 67630648 59681581 52999042 47576595 42943045 39125551 35834007 33125181 30974568
4590 30974568 29209654 27491492 26092279 24729502 23460727 22269501 21119117 19933044
4582 19933044 19005010 18166391 17485503 16903861 16452037 16063745 15823276 15659365 15581331 15577653
4572 15577653 15925316 16314601 16854740 17561744 18589264 19895019 21344221 22590172 23667445
4563 23667445 24138094 24012195 23384293 22323128 20937766 19442870 17934879 16462133 15178496
4554 15178496 14218724 13211897 12463200 11837263 11250216 10824012 10477386 10256113 10181051
4545 10181051 10132011 10126303 10186807 10250075 10348897 10632105 10895772 11074706 11444857 11761786
4535 11761786 12045119 12570854 12995501 13525634 14297620 14853409 15439936 16197493 16697132
4526 16697132 17171901 17631605 17824450 17903278 17875556 17643402 17595085 17509204 17369907 17298167
4516 17298167 17174510 17134100 17066188 17000261 16919661 16891196 16885586 16947264 17103429 17299616 17717617
4505 17717617 18228127 18900553 19726009 20854560 22284384 23941387 26064632 28638409 31932275
4496 31932275 36438722 42314103 49203165 56614028 63218890 68906891 74635551 78809932
4488 78809932 79647618 77882740 73078016 65694388 56823299 47587002 39430319 32872006
4480 32872006 27785351 24158464 21385991 19320929 17800288 16530481 15460360 14606887
4472 14606887 13791249 13213989 12648748 12187468 11742658 11444900 11259762 11109565 10826468
4463 10826468 10651259 10427840 10146807 9956322 9578203 9285634 9032406 8619837 8473208
4454 8473208 8353508 8102869 7937729 7616727 7247319 6964749 6609652 6338098 6119668 5928245
4444 5928245 5823567 5768334 5631350 5616450 5615589 5479581 5541403 5566621 5657084 5861573 5935272
4433 5935272 6060182 6288601 6447602 6712115 7021920 7273309 7731271 8087777 8429214 8927820
4423 8927820 9169229 9352376 9490546 9527171 9497487 9436531 9244265 8940648 8551769 8165685
4413 8165685 7727901 7320971 7086736 6936394 6944547 7047274 6993220 7038737 7265563 7313733
4403 7313733 7418771 7325550 7076447 6910878 6511784 6018809 5713278 5358762 5109064 5040580
4393 5040580 4854105 4769031 4813065 4783737 4877424 5133596 5336114 5591648 5920637 6274292
4383 6274292 6593114 6742443 6826739 7051752 7109165 7099610 7079488 6970006 6850933 6595347
4373 6595347 6390190 6278346 6144966 6236627 6323121 6331651 6519545 6664383 6772119 7096599
4363 7096599 7221656 7163652 7289447 7198953 6970083 6733987 6325263 5998498 5796126 5448847
4353 5448847 5254756 5086693 4827643 4801599 4731638 4575549 4732081 4818579 4852370 5003088
4343 5003088 5147634 5288008 5477166 5715330 5849925 6208764 6643526 7129780 7811756 8657985
4333 8657985 9417343 10206255 10949522 11490322 11819783 11733469 11115923 10424654 9485088 8418884
4323 8418884 7567774 6612378 5920108 5509327 5074264 4788164 4608232 4312278 4080919 4032917
4313 4032917 3894195 3887943 3856260 3787040 3864030 3904934 3917214 3990314 4019046 4110593 4206212
4302 4206212 4209035 4165661 4230556 4321039 4268182 4269711 4220213 4249907 4301660 4316027 4315970 4385686
4290 4385686 4517607 4731966 5035401 5288384 5611062 6046653 6475211 7198282 7918831 8666194
4280 8666194 9813198 11668781 14469419 18662477 23885767 28391460 30289475 33952179
4272 33952179 39430686 39255881 38405857 36417888 31547183 25585118 19457609 14405084
4264 14405084 10547543 8347559 6829427 5686161 5008725 4547460 3898733 3650751 3429593
4255 3429593 3243041 3146514 3132348 2982852 3084394 2977242 2810830 2700374 2661955 2452456
4245 2452456 2458561 2386988 2183370 2143371 2171870 2053637 2067303 2033225 1914289 2029401 2003174
4234 2003174 1938519 2035804 1913080 1847573 1983261 1939474 1931976 2099653 2115751 2132185 2216386
4223 2216386 2147319 2261468 2319755 2310697 2480203 2629915 2707503 2802336 2913852 3025408 3165427
4212 3165427 3295710 3453010 3568660 3696650 3758250 3930645 4151764 4259091 4466105 4705902
4202 4705902 4856880 4956874 5073756 4928353 4838727 4668273 4274652 4174248 3926244 3608273
4192 3608273 3452565 3313907 3236216 3231604 3128341 3107785 3247597 3264394 3258339 3372529 3511184
4181 3511184 3572217 3585201 3772231 3978291 4176009 4344550 4507465 4761150 5103436 5510913
4171 5510913 5926722 6425014 6863089 7201109 7509407 7644470 7657676 7543191 7217489 6835743
4161 6835743 6303813 5692332 5175387 4711113 4304687 4036695 3901062 3745513 3640263 3666155
4151 3666155 3784397 3858981 4007274 4114110 4207724 4459463 4503432 4500138 4531690 4489540 4340285
4140 4340285 4227222 4080549 3990453 4002487 3857675 3919035 4081560 4050351 4303446 4474880
4130 4474880 4414665 4571396 4674608 4484714 4414214 4239351 3924037 3865356 3619854 3382087
4120 3382087 3307191 3131608 3097316 3245256 3336126 3429927 3702347 3909261 4189634 4504115
4110 4504115 4748351 4951675 5050081 5064514 4931418 4703325 4468652 4115299 3794302 3377919
4100 3377919 3033835 2819040 2501196 2326668 2199048 1975764 1904621 1919839 1802099 1681203
4090 1681203 1680369 1607691 1647186 1610106 1558125 1558118 1556103 1607450 1630653 1688644 1716555 1758943 1836770
4077 1836770 1863192 1901250 1986227 2112605 2182636 2400053 2467694 2415174 2613931 2675715 2522380
4066 2522380 2483801 2336926 2072496 2055518 1784340 1674739 1706235 1438644 1339839 1332814 1116015
4055 1116015 1073965 1162994 956387 954544 1095288 991816 1016065 1037785 897031 907694 930938
4044 930938 827546 852243 841756 678228 776280 791750 663768 752324 788061 705470 805093
4033 805093 843181 704784 790132 801529 782633 921361 759219 648626 787716 776940 780891
4022 780891 951817 874917 872855 879504 739928 749587 752672 736177 773351 825375 791185 786883
4010 786883 799795 840649 829033 809817 788000 745236 760107 776892 712989 799636 818217 768817
3998 768817 874952 795128 774458 786314 725910 845432 917584 817513 819949 811438 794665
3987 794665 863118 788949 788749 878650 914304 930254 987765 892991 936068 939978 849389 875939
3975 875939 816520 812280 927248 772840 769372 777521 727946 794721 803423 716591 855919 827373
3963 827373 700106 803904 833471 749567 839365 793343 727586 861404 849201 856612 928277
3952 928277 862180 807768 923556 885982 825964 864216 867501 826180 972768 1013700 962304
3941 962304 1086089 1038468 1002305 1038894 1034417 1078687 1146913 1048453 1029290 1167206 1040364
3930 1040364 1135266 1257746 1073071 1084878 1150476 999362 1127458 1112129 1058186 1161121
3920 1161121 1108854 1036226 1133243 1090322 1002773 1121730 1055770 987988 1015104 1052460 1099510
3909 1099510 1079790 1096595 1104262 1187663 1246559 1211738 1247215 1278010 1240100 1318586 1439329
3898 1439329 1420037 1460393 1557570 1531415 1612638 1682071 1748014 1851356 1898551 1989350 2133187
3887 2133187 2147627 2167890 2266419 2220819 2198415 2234597 2220256 2284134 2348889 2366934 2394173
3876 2394173 2475912 2584300 2595646 2744532 2859326 2884780 2955692 3037913 2986800 2954575 2885210
3865 2885210 2790741 2883098 2871755 2643636 2718401 2646144 2526264 2560980 2351252 2271031 2274109
3854 2274109 2230441 2187708 2199024 2092170 2118549 2108601 1983713 2083973 2131863 2103911 2077567
3843 2077567 2020201 1961320 1916653 1892184 1888451 1796614 1736636 1710061 1650446 1683996 1647056 1657166
3831 1657166 1663440 1650926 1652802 1730754 1669907 1656766 1746684 1757314 1756023 1717646 1784674 1898534
3819 1898534 1914771 1952311 2013724 1972890 1906680 1904423 1876547 1851505 1821195 1817180 1799771 1737576
3807 1737576 1708347 1738670 1690465 1673210 1753333 1716937 1759774 1825649 1802032 1860285 1840775
3796 1840775 1822520 1828444 1778533 1747304 1851301 1811508 1827976 1802423 1792697 1689956 1704733
3785 1704733 1667215 1502740 1517384 1541180 1467232 1436471 1394964 1290733 1325720 1337713 1288142
3774 1288142 1298280 1299619 1203066 1343282 1253894 1157190 1252382 1213254 1292117 1440005 1284979
3763 1284979 1334662 1458311 1327855 1333831 1461432 1353481 1414831 1455688 1440555 1566658 1496726
3752 1496726 1400558 1477536 1490899 1438509 1406884 1355356 1288598 1326589 1313699 1323333 1314909 1303154
3740 1303154 1245467 1373278 1392432 1298567 1381507 1430650 1408293 1477931 1364655 1412695 1450478
3729 1450478 1376115 1411110 1469546 1469497 1427117 1390623 1330303 1342168 1345806 1334911 1349978 1422246
3717 1422246 1415754 1394249 1360069 1363438 1427185 1391779 1409994 1422338 1541598 1520429 1454016 1501716
3705 1501716 1510014 1455897 1409621 1421817 1391443 1400257 1327980 1438720 1453723 1360889 1391714 1364508
3693 1364508 1284479 1284401 1273704 1322307 1370853 1316497 1343632 1407226 1319860 1381973 1450651 1427250
3681 1427250 1492345 1388653 1347113 1593967 1527160 1448631 1613654 1535841 1419749 1476780 1353231
3670 1353231 1392439 1403224 1285195 1307814 1398987 1380863 1435584 1428020 1377221 1489752 1465994
3659 1465994 1423954 1386843 1358679 1368763 1351303 1445493 1391806 1442908 1491584 1428617 1475222
3648 1475222 1437239 1366607 1487011 1527941 1401595 1534630 1584627 1448842 1442761 1392414 1334341
3637 1334341 1409043 1327391 1378570 1499066 1343592 1379866 1502052 1407258 1420206 1425347 1395875
3626 1395875 1487345 1450866 1416696 1438197 1413643 1446363 1496609 1485784 1544588 1558661 1534995
3615 1534995 1526743 1441352 1462681 1555765 1497525 1606670 1670182 1602861 1697913 1621107 1536198
3604 1536198 1575639 1503394 1547629 1688985 1623050 1591362 1643010 1624238 1689468 1763728 1762944 1774867
3592 1774867 1725512 1760996 1852943 1812929 1842518 1872393 1913478 1922495 1927538 1912277 2004076 2035685
3580 2035685 2086301 2027593 1951756 2049897 1994229 2014475 2136023 2068719 2056338 2158512 2073530
3569 2073530 2188756 2190381 2150586 2273389 2304033 2223594 2383631 2345687 2290746 2419167 2276174
3558 2276174 2312508 2464574 2398738 2402162 2472145 2465504 2605755 2625470 2564501 2637902 2598861
3547 2598861 2563850 2652396 2641316 2772587 2836297 2780019 2955734 2900554 2852971 2942807 2939902
3536 2939902 2991306 3050535 3020263 3135137 3198629 3113518 3147707 3212980 3297139 3451780 3498977
3525 3498977 3475283 3529367 3606869 3671889 3732593 3829315 3907526 3893477 4103047 4221412 4318655
3514 4318655 4647052 4847688 5009728 5270869 5391463 5623561 5773937 5704699 5778160 5871828
3504 5871828 5676116 5589519 5459305 5357145 5449500 5389534 5369851 5532752 5505844 5622287
3494 5622287 5784086 5853581 5918514 6006856 6100390 6234616 6386847 6530705 6800980 6943852
3484 6943852 7122946 7400810 7683355 8096621 8574601 9116231 9497333 9841530 10354127 10694103
3474 10694103 10866878 10849177 10728239 10589847 10485584 10194429 10189060 10301576 10335040 10544231
3464 10544231 10689596 10833299 11200312 11520773 11907122 12486498 12988903 13561794 14425656
3455 14425656 15155797 15930412 16990378 18055604 19328347 20725164 22114882 23801060
3447 23801060 25527513 27217967 28996090 30570664 31849869 32818006 33173414 33303492 32941573
3438 32941573 32088401 31088080 30132997 29360079 29260515 29764069 30885927 31801501 31397427
3429 31397427 31342599 32956562 34893145 35005060 34530351 33728948 31422900 28222527 24577516
3420 24577516 21251672 18735703 16975047 15759459 15120593 14499221 14256536 13999305 13851452
3411 13851452 13836487 13964001 14126361 14597988 15033683 15516912 16412116 17696824 19588321
3402 19588321 22986831 27100636 32074671 35611819 35871496 37815650 42757948 47262725
3394 47262725 47481933 47457936 46093994 41797006 35755202 28851129 22810006 18183256 15243444
3385 15243444 13274086 11948311 10913624 10182101 9640756 9400011 9047412 8937668 8913282
3376 8913282 8994784 9191769 9364162 9780319 10538230 11546919 13119602 15122763 17385346
3367 17385346 18883938 19186820 20128008 22482293 24350857 24317727 24285297 23270717 20959816
3358 20959816 17988747 14537949 11624119 9572719 8163260 7275727 6693016 6107600 5766769
3349 5766769 5405562 5060289 4885726 4658617 4521843 4467070 4322979 4304715 4170254 4015007
3339 4015007 4024522 3923114 3786408 3746996 3581690 3552726 3532018 3447680 3453059 3468472 3332330
3328 3332330 3313927 3230098 3202928 3261642 3136371 3131822 3128813 3033855 3047130 3089007 3112008 3012264
3316 3012264 2915179 2889325 2858865 2765366 2814922 2774625 2695264 2741656 2525188 2512825 2634811
3305 2634811 2463170 2463420 2478100 2360302 2500854 2456797 2330032 2449143 2384825 2256870 2374594
3294 2374594 2330977 2303422 2487652 2278600 2246056 2327727 2187819 2187778 2296882 2153537 2166064
3283 2166064 2216706 2055108 2087541 2154646 2009914 2087192 2084477 1978837 2132683 2126685 1988762
3272 1988762 1960535 1927760 1846682 1881654 1903313 1841256 1892796 1889588 1735236 1833269 1824992 1744773
3260 1744773 1810458 1832606 1678282 1781539 1712318 1625764 1823181 1757303 1726473 1808120 1648230
3249 1648230 1670744 1869577 1763495 1810423 1909106 1702452 1829584 1967470 1892526 1925975
3239 1925975 1883639 1761297 1758381 1576033 1525818 1594331 1454533 1414785 1445841 1373495 1391157
3228 1391157 1394925 1386015 1420280 1351457 1337612 1292051 1319695 1395578 1378877 1394818 1467655 1518228
3216 1518228 1567990 1569794 1584520 1592100 1616824 1642428 1607543 1562433 1485667 1453171 1370045 1380480
3204 1380480 1374240 1364675 1418212 1344147 1352453 1413254 1423574 1401711 1437509 1408556 1372957 1470588
3192 1470588 1388238 1413074 1478372 1470404 1479809 1532744 1501948 1494674 1573213 1549073 1622986 1677531
3180 1677531 1599459 1601344 1721542 1647555 1710252 1787614 1785363 1843265 1869554 1801559 1919958
3169 1919958 1880843 1793687 1911480 1918000 1882664 1961795 1901648 1865126 2022617 1958363 1964061
3158 1964061 2106304 1989595 2046531 2217464 2167781 2243230 2271141 2210463 2311320 2440224
3148 2440224 2386589 2510935 2564839 2547736 2690822 2703083 2812031 2976877 3008901 3027439 3210123
3137 3210123 3242593 3250362 3385872 3470341 3592704 3811842 3901122 4004459 4180823 4226272 4273103
3126 4273103 4298684 4297302 4429465 4567693 4609332 4700509 4778010 4836219 4924131 5021892 5041692
3115 5041692 5175752 5355416 5348836 5493252 5707393 5948581 6262703 6523425 6828809 7227888
3105 7227888 7554764 7826073 8182694 8429630 8666526 8829360 8763190 8753655 8574880 8231589
3095 8231589 7989234 7733174 7446298 7242490 7120813 6963256 6915862 6878802 6896705 7003508
3085 7003508 7119902 7203876 7371480 7617460 7796374 8078684 8289570 8495035 8746102 8836151
3075 8836151 8959859 9012856 8925134 8817557 8699821 8514912 8280442 8059369 7764964 7378833
3065 7378833 7025008 6722655 6415003 6133093 5951355 5832966 5752295 5710975 5766196 5740920
3055 5740920 5728798 5842094 5885803 5901306 5843227 5727510 5634210 5498756 5363647 5233681
3045 5233681 4993615 4755150 4529636 4304146 3960988 3772789 3548359 3347004 3273123 2997007
3035 2997007 2833280 2694640 2612865 2556292 2516497 2419109 2338561 2250799 2126613 2158436 2159443
3024 2159443 2083934 2101085 2137304 2022685 1987111 1919683 1763423 1767959 1700829 1490669 1519627
3013 1519627 1476062 1395396 1431680 1316726 1188527 1180172 1123416 1092540 1174835 1113857 1034136
3002 1034136 1033144 949990 1011306 994903 788315 831402 899951 893680 911918 905837 801628 882310
2990 882310 873290 827696 926906 848861 786920 836264 762782 842655 841283 752263 724160 707084
2978 707084 713944 648132 683146 696402 619052 665947 601566 547289 539234 532858 541516 528738
2966 528738 446000 433491 457448 421816 457633 460415 432581 523713 533722 432710 435375 362275
2954 362275 327630 381028 385496 392174 366782 281997 322354 372390 359558 340297 344743 345181 341565
2941 341565 297545 251172 350494 268624 241850 292070 157551 104145 154693 143028 202008
2930 202008 231456 222661 296870 206321 161131 128130 131538 206822 200319 104485 141947 148118
2918 148118 143576 99030 62879 141728 129215 23567 122562 73838 83084 127256 76387 114677
2906 114677 144371 23029 104368 162398 37925 50184 61249 -5059 128761 59048 -18366
2895 -18366 73477 32609 34722 37491 52565 20948 124189 74464 -40366 128969 114819 34351
2883 34351 67586 57695 54601 98248 23967 -17175 64479 -66054 -29099 93041 -32151 9277
2871 9277 65191 -82688 -51862 41637 -22208 106351 183062 47586 80478 111832 26813
2860 26813 18917 36425 -40354 -46002 -25989 -13962 100770 65571 26085 79340 -24077 -99236
2848 -99236 12500 13628 -63443 43727 37388 -28993 70486 4594 -48792 149972 89168 41738
2836 41738 71679 4052 -21324 20259 -797 67517 177485 74877 -9099 84026 6448
2825 6448 34551 64201 -41633 10838 26586 -35207 33707 33061 -24521 4825 -44436 -50100
2813 -50100 16975 -2218 -12075 21161 46265 24530 46523 -2300 -57347 -55863 -26541 96656
2801 96656 85684 -61012 6966 20606 1805 10077 93591 156007 76803 54055 159555 129045
2789 129045 59058 88254 70243 85498 114259 95523 71569 158721 116841 48836 -8704 36104
2777 36104 49221 44170 -11290 -9376 10047 -59893 -85295 -86193 -58286 -75318 -38826 -43335 17595
2764 17595 38596 -79073 -97453 -221 -89148 -42194 7742 -38811 -29354 48246 -48585 -29926
2752 -29926 11237 -59892 -28709 20381 -18442 -12159 -23232 -75247 -36022 -27726 -94554 -23860
2740 -23860 -25135 -109572 -20054 -74181 -110011 -20316 11398 -14832 -23106 -60144 -2491 -6933
2728 -6933 -5113 -45399 -43416 -37206 -59675 -32996 16624 -4360 34030 15800 -18883 -40566 -83384
2715 -83384 -136914 -50018 -44939 -52524 -6272 -21438 -69024 -11886 -35575 -61695 38829 -871
2703 -871 -56423 14417 -22779 -80407 -50257 -116352 -130392 -83790 -32121 -19868 -58753 -116213
2691 -116213 -143791 -26401 11915 -54932 -30959 -60625 559 -1998 -93530 -64245 15091 -44022
2679 -44022 -107087 -4935 -75178 -127438 -98613 -77949 -19105 31175 -143901 -40449 50452
2668 50452 -109078 -79052 -38856 -193778 -116989 -166840 -211725 -48493 -44036 -42370 25646 -38087
2656 -38087 -108476 -69704 -137962 -132164 -86869 -116837 -26764 23986 -90165 -120055 -94922 -84552
2644 -84552 -96211 -57052 -92754 -144215 -93386 -145575 -204792 -112291 -126327 -159475 -57543 -73494
2632 -73494 -195494 -139911 -149595 -127472 -98551 -194288 -79478 -50062 -80232 -56283 -69372 -71011
2620 -71011 -2551 -69906 -148625 -57321 -162716 -122634 -66578 -80161 -118709 -58624 8775 -6964
2608 -6964 -33109 -20594 1749 29357 -51586 -107275 -110488 -117989 -56551 -64818 -144972 -37820
2596 -37820 -3772 -57787 -84304 -69188 8865 34498 16255 54017 -33034 -44892 -40486 -42339
2584 -42339 -47547 -32194 -38717 -24160 -19417 -47635 -9644 18395 11012 -1854 101010 105591 106150
2571 106150 134187 104126 183140 186792 89828 147668 125512 56756 17831 -89780 -82093 -42379
2559 -42379 -22854 -57874 -83916 -7276 65386 24017 456 -74884 -201982 -164378 -79152 10559
2547 10559 -16838 -111098 -105630 -93494 -60477 -60431 -19573 -16341 -13024 -55606 -71539 1871 19246
2534 19246 -64803 -44596 8779 -80734 -23954 1990 3293 -43928 -89308 -57415 -35705 -36572
2522 -36572 -77976 -65297 -76742 -50847 -14585 -79809 -63748 -40719 -114375 -144404 -54812 2798
2510 2798 -7127 30157 -43498 -33991 -63764 -117079 -56667 -69626 -122598 -60955 56948 -99712
2498 -99712 -133727 -67058 -50983 -9816 -26161 -78803 7636 8398 -86860 -46274 -5992 -101606
2486 -101606 -47016 -45010 -64912 -37838 -31721 -65236 26261 49058 -59236 -53240 -9851 -12474
2474 -12474 35990 -28148 40112 57088 29378 20461 -26785 -125090 -102238 -48129 -15475 3664
2462 3664 38397 824 -48476 -35572 -89466 -71528 46717 13972 -34854 3172 55338 -30570
2450 -30570 5679 93760 -9761 70249 -39614 -56131 118814 -8543 -42538 98512 12767
2439 12767 9739 71199 11232 64571 103334 -72846 -39554 49034 28570 68740 92471 54999
2427 54999 54795 98764 68044 132194 170665 5094 6925 61956 -21318 84948 171780 2856
2415 2856 -5661 108557 -13613 66306 134881 28558 129507 150597 75606 183979 75492
2404 75492 -13056 172259 52581 6426 155603 169431 143377 229304 179240 159597 170076
2393 170076 93236 124022 191583 121665 161942 218668 223151 182159 196722 241739 260553 307743
2381 307743 272794 253916 256166 288617 288122 318333 362346 346341 302183 341427 337957 293712
2369 293712 271681 297219 403060 391681 386650 402706 416312 364932 418778 426934 437760 493139
2357 493139 471973 356003 496543 440331 445615 635586 692124 672164 642206 662007 644866
2346 644866 729877 699282 624360 776897 805741 813503 943754 935083 819964 970463 999887
2335 999887 988193 1184216 1281332 1287383 1492189 1442332 1457541 1653750 1725600 1706835 2034267
2324 2034267 2058325 2303297 2682561 2840906 3171458 3639497 3829759 4322904 4671760 4950575
2314 4950575 5401249 5930627 6414907 7384143 8344512 10030582 12950858 17549036 23496163
2305 23496163 30500826 34771575 39914246 45125609 43560295 42516110 39038589 33077804
2297 33077804 26142689 19652981 14271330 10513397 8149455 6508021 5485628 4866753
2289 4866753 4152074 3759668 3593859 3253817 3019232 2839141 2593099 2304120 2155591 1928235
2279 1928235 1774653 1705508 1528202 1330156 1280083 1153423 1081483 1018914 999705 978502 929748
2268 929748 783208 717309 643843 655063 618092 554050 619980 617453 594156 613416 543872 553906
2256 553906 503200 426386 395865 420611 266413 306194 387724 336707 322562 329192 274691 310221
2244 310221 210893 140454 258765 263969 146637 256316 244616 224522 247881 237875 223522
2233 223522 276170 202938 134821 238632 243567 157630 250603 271656 193949 166793 143394 143471
2221 143471 215071 137667 68981 128215 133737 36719 141523 161902 112743 104193 91381 110950
2209 110950 168618 77021 46717 117328 8910 11284 79697 23818 85424 112034 76909 148169
2197 148169 119448 36249 15934 -6794 -54181 -51805 -4729 56739 120359 65628 -25177 -15235
2185 -15235 2757 10257 60545 95081 27964 -41507 -4794 -14152 62477 -31647 -106790 -67300
2173 -67300 2065 -34930 -18878 47233 -2367 -14643 -43673 3681 -20813 -11511 22412 6050
2161 6050 -54241 23948 -37504 -2203 39307 15131 34335 12043 27862 80659 -10944 -53332
2149 -53332 -28438 -83181 -53015 15013 -46673 -2180 41533 618 37076 6493 -54747 -19454
2137 -19454 33619 -28439 -57020 -67939 -36424 49103 23755 -59769 -81360 -95713 -70153 -47776
2125 -47776 -16056 -54767 -13758 -3911 -32518 21553 3750 -47036 8668 5266 -91432 -61476
2113 -61476 43939 -14234 -6988 38469 -80156 18576 31474 -38045 50834 69290 37085 123070
2101 123070 48667 804 46484 -24203 38659 105202 -27982 71059 86238 -6249 9617
2090 9617 -103361 -102069 42441 -19155 -83106 -4821 -60977 -58953 -90036 -27601 -32931 -66448
2078 -66448 -19258 7090 -13076 -17396 -38251 -62603 4553 -61960 -91836 -31259 -440 -92003
2066 -92003 -51127 -35657 -36936 -136505 -130175 -23887 -9204 34023 75871 17726 55047 56489
2054 56489 -56465 -56685 -35397 -70550 -17753 1500 -30790 32625 -2314 -69297 4232 -71880
2042 -71880 -113301 13157 43336 123403 100673 -8204 135658 172535 37535 144265 79851
2031 79851 50249 192359 123238 139557 170884 -24718 8350 29393 -106030 -14464 -3861
2020 -3861 -57964 -7721 -44992 -71519 22544 -1257 -39542 3880 -48513 -1715 -71398 -77876
2008 -77876 38136 -11447 -138974 -109013 -104494 -86207 -82055 -101818 -46456 -84099 -97803 -79147
1996 -79147 -168562 -61573 29363 -68760 -7023 -23686 -4647 48826 -7493 -40316 -47120 -74001
1984 -74001 26943 -45410 -140967 -8903 24083 -44554 -12662 -92964 -77123 56926 -59329
1973 -59329 -142893 -14787 -46836 7441 87908 -70470 10637 -4046 -91972 -769 37835
1962 37835 -120879 -56182 -4856 -45527 38303 1257 -33251 75045 -5688 -89314 13884
1951 13884 -13249 -13322 -28039 -8134 -22268 -96441 -109605 -14821 -8710 -31350 -69398 -67736 -93810
1938 -93810 -109520 12799 38807 56883 82140 -31485 -49735 36493 -53706 -9882 17724
1927 17724 -24322 -7513 -3877 -47402 15143 -84563 -92158 -11307 19787 461 -7977 -59910
1915 -59910 -33146 56816 -116759 -69538 38529 -27715 12159 -14002 -36093 1439 -32617
1904 -32617 -26689 26620 -112012 -122718 -103591 -150178 -99028 -52908 1669 64301 38582 -77229
1892 -77229 -45470 20517 -11365 -88743 -70700 -64019 -40433 -98236 -48366 -27856 -34235 -160698
1880 -160698 -213061 -98320 -63915 -66962 -81967 -69837 57165 47939 -101893 -4210 -9668 -101629
1868 -101629 25416 -28659 -70785 -21243 -102326 -26928 -2473 -76706 -117593 -8754 5440
1857 5440 -44687 -32649 -40097 11078 -66011 -122718 -8788 15254 -29945 -21987 -14561 12791
1845 12791 -12308 14537 -24208 -68347 -90663 -86793 -71837 -5636 51771 -27429 -23084 -24037 -29785
1832 -29785 -50554 -3625 31632 -42310 -76143 -69097 -34017 -70371 -131939 -62576 -13332 -15769
1820 -15769 27042 -33045 21670 39394 -80124 -77828 60094 14777 -73770 -15797 12760 27616
1808 27616 -22158 -30487 15642 47951 -38570 -52160 4812 -18034 4485 47405 39650 29325
1796 29325 28392 39083 83037 5582 -147992 -88410 4879 -69454 8457 6985 -33610 -67878
1784 -67878 -97116 -24691 -47504 7578 -38833 -72766 -32503 -51306 14455 15357 38276 -11234
1772 -11234 -15447 -41169 49732 73260 -46881 -75041 -19082 -25435 -27808 27221 -3412 -46406
1760 -46406 9033 -12212 -2577 60302 -101016 -35360 -50183 -114849 -21188 -40569 -54493 2153
1748 2153 -110396 -89844 -13237 -22125 -34439 -2786 -65568 -99986 -108328 -111682 -87055 -7866
1736 -7866 41264 69137 -1941 -11353 9091 -26015 80020 78319 -62062 22197 52876 32672
1724 32672 16952 -62034 -24967 -25132 -22547 50977 40131 -5976 10070 -85197 -31209 23709
1712 23709 -54001 -95067 -86637 -14633 6041 -33666 18504 -4671 -52848 -33703 -52727 -57603
1700 -57603 10220 -40340 -16890 56656 -35248 -9333 56371 -49550 -43127 -90592 -120578 -4290
1688 -4290 -18537 -89426 9812 24547 -95979 11952 49454 -35400 46336 -51041 -84139 78790
1676 78790 -20146 -15095 26127 6054 -15848 -6855 -22799 56056 40501 -67812 -27987 1540
1664 1540 16694 41986 94842 -1674 -43826 -4580 -87869 35822 129882 68273 -10632 94225
1652 94225 53236 -55826 52006 16663 -11444 -18072 35414 15693 42972 -25425 38492 59624
1640 59624 -25837 31907 12093 -47387 16326 4215 -29980 26696 30316 26058 29566 74120
1628 74120 71340 8275 16083 54454 12809 -63754 12534 -59242 -73253 -21226 -118641 -75971
1616 -75971 -67789 -47148 -34868 -52752 -50709 20861 -33619 -400 79045 -70640 -48328 29911
1604 29911 -69705 -21516 -36165 -114984 -42727 10927 -45990 -108523 -57084 -32708 21467 45029
1592 45029 -49288 -3666 -3518 -84581 -1978 48940 -34070 -61365 14502 -40739 -47134 -38200 -60837
1579 -60837 30479 49569 38877 10612 15568 -14434 32098 35503 7717 -43383 -60207 -31715
1567 -31715 -18426 14958 1390 -26443 -54272 -45829 27944 30192 5795 19629 -44369 -17057
1555 -17057 9492 -80525 -70762 -4655 -105323 -78491 -95106 9636 14913 -66111 42743 -37087
1543 -37087 -80509 4308 39324 72935 8812 -47108 -15060 -4413 -36774 -8673 47312 17859
1531 17859 -2803 47937 23699 28860 6602 -50357 -4055 -14403 -38761 41683 22977 -36599
1519 -36599 -30502 -47603 -22579 -13701 -104351 -70838 27249 -40446 -12145 -11647 -92366 39669
1507 39669 27762 -47395 14311 23838 -40494 -62342 65618 -12113 -54796 -9350 -43552 -72212
1495 -72212 25340 33228 32729 58005 15111 -61174 -99447 -9034 43735 -10901 7323 33306
1483 33306 49959 -24077 -42171 7669 -84342 -51053 14780 55208 45410 -10729 -54356 -40412
1471 -40412 -34601 -59285 -67280 -13365 -42191 -123675 -93617 -93250 -102745 -60348 -100768 -29290 45315
1458 45315 -39339 -27028 33164 11087 -10304 -90493 -78560 80794 -30705 -62532 60711
1447 60711 67388 14858 -2924 31717 58728 -18590 -74298 -39813 -46562 -14460 10378 32046
1435 32046 26959 27467 17036 1709 33459 66093 64137 47497 60570 41342 -34745 9612 -1174
1422 -1174 664 79665 52609 137929 22898 -13904 -36457 -59632 -31673 35880 30549 12941
1410 12941 132307 16937 9149 98752 66433 -5363 37984 43225 103543 51596 25673 76385
1398 76385 17085 -20056 29920 74395 27617 48807 -6006 -48682 -7957 -26810 23740 34076
1386 34076 -24316 -37617 -31043 -6596 20213 -43922 -10544 121782 78127 933 1236 28786
1374 28786 68304 57529 2366 31113 28172 -72281 -50881 27165 -50437 -72947 -93396 -18055
1362 -18055 -14246 -16437 30388 26793 -26388 -78514 -21099 -28481 -77337 -30019 -16377 -36139 -35833
1349 -35833 -7270 -56987 -10345 15060 -51680 68336 63749 -21998 19960 -42077 -82596 -12111
1337 -12111 -70096 -54607 16371 -55512 -9802 10892 -96065 20793 64795 -85413 -23881
1326 -23881 39273 -88809 9363 6454 -26710 61266 48 -11956 9974 -97142 -48846 -10006
1314 -10006 19783 138612 65213 -40549 52851 41535 -42279 -31458 31758 86227 52331
1303 52331 30198 77689 9889 31716 63211 35582 -3958 35841 29475 47196 71376 41940
1291 41940 21956 -27491 -78114 -2318 -48102 -4404 20515 -52482 60076 72418 16865 -8692
1279 -8692 27718 51130 75920 27904 -64223 -22124 -20917 10690 -19698 -12008 95268 -6952
1267 -6952 -37518 61005 -25791 -73056 24430 38129 100154 99039 51660 41997 -16694 -34690
1255 -34690 62065 27513 27398 62697 -4910 -27784 113875 41032 49144 113940 68042 19540
1243 19540 12730 41926 58906 1325 68240 71229 48789 14870 -57948 -20479 14390 3781
1231 3781 13586 133185 6503 -22634 39626 30220 102182 78044 -26800 40567 48668 -30206
1219 -30206 62820 11469 3953 91044 11557 -63427 -26877 -41940 -23022 -50088 -7282 22646
1207 22646 35761 -16972 16278 -4838 -17755 64994 51347 -31763 -95923 -4470 25864 49501
1195 49501 100325 -5473 3136 -14982 -38720 53120 86076 39255 22084 40777 15862 12586
1183 12586 -6776 3057 86604 -14400 -57851 6952 -60739 -49260 -2229 9134 10949 39711
1171 39711 -31898 -46545 62541 -17015 -85516 -2638 39235 13728 -8192 -6906 -31591 -42069
1159 -42069 -131990 -63053 -47191 -56950 -97284 -16433 7300 -35250 -1782 4883 7154 53062
1147 53062 19669 60084 54678 13827 40975 48212 107869 56209 17680 27655 15301 -45243
1135 -45243 -83161 -44585 -30293 29374 38027 -27298 20986 78469 39194 65233 89706 70622
1123 70622 2955 -36366 12628 74147 -69849 -18562 54477 9718 36397 4087 -72865 46966
1111 46966 104625 75951 66059 40032 -61593 3517 6380 -90066 -25165 -45398 -6422 62677
1099 62677 4672 -36151 7434 -66892 8 -20354 -42007 75049 55574 -63210 -15734
1088 -15734 112421 10819 8807 37351 -17518 5757 -79078 -38884 110065 47822 -45017
1077 -45017 -22325 -41334 -28775 46740 -17284 -38663 107147 4666 -38316 57250 -8663
1066 -8663 -58006 53327 39897 9616 24833 31341 -14438 35313 -28711 13316 74112 1166
1054 1166 52110 19393 -41665 49624 13439 3404 763 -64186 -38027 16298 92302 58588
1042 58588 -25513 42765 61493 20831 112326 61158 -39587 44208 27072 -22588 -4777 -91949
1030 -91949 -69941 10024 -90686 -65756 -6105 -75528 -3007 3515 -71694 100398 83672 -53544
1018 -53544 -96 -1636 19846 36085 28172 6863 7668 -4903 17359 -4080 4477 83766 62710
1005 62710 -646 -46985 -54693 28298 29209 20651 64674 -9977 -17011 36649 -71432 -52163 60398
992 60398 13014 60576 94792 8134 187 52386 -25389 34087 47303 -3769 27064 68740
980 68740 114493 97460 59295 -2579 22203 50985 76026 91202 56480 5453 -9597 4943
968 4943 -15061 29984 -17702 -140345 -59124 -40989 -84472 18923 41306 -40841 -10579 5079
956 5079 38866 124350 89465 28866 144031 90887 296 64321 -13017 4987 68255 4745
944 4745 51562 87849 33324 -57419 -7082 -26419 -20986 -35401 -49952 22160 2789 -28584
932 -28584 4722 -20127 46155 32154 17054 22360 -13625 -55653 30733 91461 65216 -21583
920 -21583 -93684 63930 -9776 -69964 43028 4756 -68066 9507 23494 -15834 -11144 -60136
908 -60136 -68545 -2925 -26424 -52845 -57269 42382 -10150 -54732 12516 38098 71302 57077
896 57077 20517 41699 24149 -16925 104664 94887 7770 57609 14147 -11157 98305 -10242
884 -10242 -94122 97784 23983 -76536 77016 78539 -1722 60708 -48568 -25709 58251
873 58251 15660 81151 48862 -47933 6405 23430 -55930 -1982 35378 -45870 1243 15347
861 15347 -17110 24980 48511 -76772 -70559 38155 -34920 -5711 -848 -65225 15786 61202
849 61202 649 66918 23913 -46944 69828 33365 25221 122857 -34895 -34470 12431 9104
837 9104 23408 26518 -48497 -2648 12910 -72411 -34520 17926 28002 -75399 -20002 15767
825 15767 45147 15732 6791 44694 8231 48485 78119 -24607 11638 84379 20118 33638
813 33638 54125 28484 13304 79192 21666 -13491 18373 -598 56535 32642 5934 115542
801 115542 60539 -63008 48470 1998 -50630 15506 -49445 18465 137029 -23008 -15321
790 -15321 -36 -85903 -46313 -49787 -138134 -74625 -43468 -206631 -6990 23487 -88328 -27470
778 -27470 -8970 -39043 7426 32125 -69726 -32813 -40748 -29577 40446 34949 52864 -2420
766 -2420 16939 -15259 -55779 -11778 -42283 -10151 -37248 -34371 -35609 -13588 10614 9147 10307
753 10307 26738 12323 72538 88303 92361 27510 -12255 30277 -12244 -28114 -44418 9573
741 9573 75600 28966 30172 59053 14313 39618 72792 22752 7378 63540 31817 28772 -16199
728 -16199 -25478 -8170 -12636 638 7563 -46485 18531 67794 25339 2716 -6270 37608 37018
715 37018 15714 7223 12131 44576 7851 32688 40366 14098 19860 24451 -34708 -27191 -44376
702 -44376 3304 135194 73686 -25879 49229 78846 16341 73205 48213 23539 37676 -24708
690 -24708 -21093 31159 -10006 -85904 -17876 -29026 -8945 9691 -70570 41923 39093 -13240
678 -13240 41560 9878 7824 42546 52233 43730 1207 -57106 2017 41336 103236 182248 61617
665 61617 92238 129774 22079 -30083 70250 46219 -49542 -69397 -30133 -5938 -21394 17478
653 17478 31540 25314 65067 46873 55720 26830 -3932 -22245 17636 27459 -22347 -73007 -38873
640 -38873 -55442 -109028 -50579 20405 -69408 -23446 -13421 -81543 -19586 -9941 -37015 66414
628 66414 65501 69112 137262 -34243 9687 74333 -21334 9276 85996 -78923 -58669 42059
616 42059 60438 62253 -37216 -64371 55715 41997 -36339 24365 -18924 -49393 -56579 4308
604 4308 30705 31779 55342 51788 78249 17724 -12569 -19003 -19783 -84801 -15745 -3076 4713
591 4713 85763 49904 -61004 -9063 -64209 -87049 46324 20874 38027 56945 -39857 54185
579 54185 45529 -26092 23499 -123 -55302 27107 29383 -16284 69046 15744 -18118 6550
567 6550 -49618 -89773 -17213 12909 50590 81700 -48465 -40379 2759 -40798 -24845 -19367
555 -19367 -41621 -127181 -45888 -4654 700 37896 6389 -31999 4866 -17378 -30279 18307
543 18307 -40749 -120480 -11015 -45707 -25838 15535 -37802 69300 60312 1004 62222 82242
531 82242 17534 63455 66935 -14788 20924 -38596 -69653 19340 -34058 -78867 -7144 30733
519 30733 41484 66161 -46906 -52986 19550 -67309 -61290 -54486 -54842 -10841 19937 -82205 280
506 280 13936 -93738 -42031 -1218 13687 52867 77049 77973 57251 15408 20685 -8204 2112
493 2112 -42227 -37702 17841 59860 51365 40411 -9906 -62058 -81789 -5912 72984 -45286
481 -45286 -76257 -73451 -51078 -21003 -31708 18094 14561 -83165 -10534 9448 -18494 -19615 -58606
468 -58606 -80057 -68662 -44224 -72517 50688 84195 68652 20955 12598 -14340 -120640 -88616
456 -88616 -35895 -47290 45489 25181 -24922 15530 36169 40536 10525 -46923 47853 130066
444 130066 128 53083 64355 -60068 -11629 45466 -61915 -29788 36919 40166 734
433 734 -75926 -19411 41421 -33011 -70297 -21892 -33187 -18637 -45855 -121517 -50340 43431
421 43431 -42601 -13792 43308 3503 -39055 -26581 12762 25331 12110 -23274 -61147 13007
409 13007 15718 -21649 49985 42502 -68384 -32655 71738 62415 38751 3830 2090 71030
397 71030 7442 -76636 -34053 -15503 846 95553 78117 101716 162020 68474 74191 43805
385 43805 -76745 -48619 55994 54585 -7487 19877 -6136 -49898 -66855 -86825 72439 26263
373 26263 -24532 52345 -11590 -17530 87785 45898 2365 60896 92882 27258 7667 7172
361 7172 -3468 85832 76661 59303 53816 39123 26038 27408 15338 -14607 64150 -7226 169
348 169 -1833 -56715 -24331 13186 -20768 -5204 40074 -5252 20146 -23852 -22838 47790 -9770
335 -9770 19528 85192 -32910 45513 65567 -60565 36663 16004 -57048 39219 -12508 -76004
323 -76004 6670 -3552 -76009 -41116 -60228 24469 88183 -11276 54218 113625 4720 36690
311 36690 69696 -2356 19279 48893 41359 52137 69237 -33731 -97386 -1517 21587 -13969
299 -13969 40543 4982 -26112 58470 -43587 -24066 59040 -84913 22326 71600 -53287
288 -53287 17477 61608 -93744 -34226 76387 -4739 71124 24674 -108149 7846 85209
277 85209 96457 81579 128040 75058 49228 31932 18280 48610 98042 26040 -38398 9151
265 9151 18814 3946 40237 11076 42589 117750 -11875 39134 87275 -22995 7280 52833
253 52833 -34477 -6509 10468 -35192 50592 -21948 -68379 -15931 14967 66045 119662 59937
241 59937 -7934 4591 -89277 7009 71950 -8069 -12856 -1720 -38723 12384 32187 -9872
229 -9872 -3959 28968 29955 70227 -15535 -43217 -63707 20461 70414 14946 13849 -2762 -27927
216 -27927 20736 -24578 -36301 12005 -26709 -89853 -342 15688 37863 67510 34164 17214
204 17214 43191 38420 23348 73306 21078 -102628 29362 81481 14654 75710 7763 -11817
192 -11817 718 -57591 -46349 -18771 -35784 -60012 -20752 11986 45356 34648 -543 -20477
180 -20477 -64689 -40686 -60190 27613 -44225 -61024 37337 68414 13206 1172 55059 14155
168 14155 2907 3468 -17213 52856 59449 -2372 -38536 -36257 -86843 34422 31612 16138 32861
155 32861 -24861 -6508 66431 -9968 -39762 63682 131 -9172 86595 -2657 14687 59761
143 59761 -20723 -9959 41231 17362 55397 87539 -11686 -50488 548 10585 83610 134994
131 134994 -14506 9351 90744 46291 65052 -12886 -33512 20913 -5568 -78226 -13100 50268
119 50268 -3596 67686 59491 4983 18845 47511 -54959 60090 94988 -37471 43851 44972
107 44972 19187 78675 21605 -826 42957 -35739 -48865 34124 24761 -33392 22947 -61
95 -61 22628 16627 8463 -2443 -59245 -71883 -55323 -15167 -29171 -28183 -61293 -40180 -21962 -23786
81 -23786 -10226 17252 -19350 -53201 -29915 19530 -24314 -69818 12469 31998 6309 38612
69 38612 -1420 -20171 23989 21544 6965 7322 -4149 42762 14441 -3988 -10302 2399 31477
56 31477 27165 19816 16537 36876 21466 29279 -18466 -32967 67038 32374 22554 44960 -41636
43 -41636 -1540 12321 -61966 46732 34148 -58055 -16719 11062 -2389 19671 -42948 -20698
31 -20698 -24106 -33242 -293 -4973 -11705 46204 58290 23437 28839 20761 57867 27149 8296
18 8296 -6030 -27274 20321 46292 5944 -23960 -4150 -17360 12402 20581 21121 43829 -21297
5 -21297 -72304 -51934 23898 20373 -31076
0 -31076
$$ Imaginary data points
##PAGE= N=2
##DATA TABLE= (X++(I..I)), XYDATA
16383 -754699 -688524 -713979 -709175 -681866 -689445 -643174 -632218 -680915 -666017 -599936 -563660 -519634
16371 -519634 -497195 -485935 -529180 -469873 -447825 -487874 -510640 -412671 -422992 -443368 -450559 -441302
16359 -441302 -377188 -342388 -340826 -323745 -302182 -325948 -293589 -255404 -236892 -277751 -267151 -207781
16347 -207781 -164575 -180521 -213339 -206556 -183850 -124822 -94219 -47673 -39630 -76107 -7685 16765
16335 16765 -27581 17578 53761 51206 97186 146089 101379 142790 190561 121456 178426 130315
16323 130315 119158 213147 218949 177815 222279 190946 139176 259726 308038 350325 391754
16312 391754 372723 473480 488916 394816 404685 425674 384749 462418 479175 411753 440396
16301 440396 549917 518779 517319 528681 534661 583918 636735 646200 672991 644971 631399 671795
16289 671795 724478 714732 737859 697243 683850 722004 765983 783610 765959 774094 750682 767050
16277 767050 790421 777542 816326 860878 802939 860748 880784 858600 906886 882388 861884
16266 861884 952889 960025 888198 920939 948454 934654 1002273 984991 979096 1037253 1012452 1025997
16254 1025997 1102869 1107796 1090738 1086250 1065987 1105393 1165215 1127059 1169652 1191108 1126245 1177946
16242 1177946 1197746 1123314 1080331 1165234 1191133 1210154 1209311 1220767 1232902 1241156 1234878 1240526
16230 1240526 1296468 1269500 1276526 1357609 1319449 1280110 1290101 1293881 1252435 1280109 1350911 1371886
16218 1371886 1417613 1396223 1296631 1297973 1330733 1336481 1439685 1423936 1419269 1436422 1463483 1448309
16206 1448309 1514256 1537935 1457945 1484030 1557956 1456270 1461278 1423389 1424229 1531539 1536848 1454813
16194 1454813 1519014 1523957 1413828 1490925 1492493 1493454 1727029 1675464 1566419 1692648 1588350
16183 1588350 1526371 1676371 1548600 1538657 1663963 1514565 1551558 1609448 1550545 1633904 1706222
16172 1706222 1599350 1619853 1682725 1641484 1681402 1680064 1656426 1672865 1695029 1577534 1564585
16161 1564585 1655871 1663393 1714584 1735858 1626719 1698459 1733557 1655299 1691266 1686894 1604790
16150 1604790 1694221 1715844 1669546 1774118 1764871 1654409 1707253 1695070 1595066 1677884 1645077
16139 1645077 1634678 1744622 1742461 1687081 1796894 1789681 1746974 1737294 1731313 1715887 1695162 1679719
16127 1679719 1672476 1728587 1721085 1711682 1809483 1824096 1809715 1784351 1753111 1707210 1758412 1814594
16115 1814594 1741965 1764848 1831431 1706663 1769066 1777312 1760512 1843026 1815934 1802726 1804054
16104 1804054 1811302 1826823 1838361 1786873 1750251 1792752 1779093 1784451 1779588 1830179 1730252 1745886
16092 1745886 1759739 1776706 1893701 1835171 1844484 1894053 1878566 1862005 1831611 1774309 1798841
16081 1798841 1770471 1788737 1819952 1801232 1846818 1834168 1768005 1807646 1853048 1817170 1839838
16070 1839838 1855143 1874662 1892777 1799000 1830918 1866952 1782997 1830534 1832696 1796664 1861986
16059 1861986 1875226 1814505 1830602 1935344 1835496 1810642 1859270 1759408 1844031 1932202 1836613
16048 1836613 1842128 1869189 1795216 1876940 1877358 1840705 1881922 1815250 1759499 1838380 1839615 1873051
16036 1873051 1939344 1815943 1830420 1936825 1875129 1832749 1895317 1815757 1847379 1828400 1853101
16025 1853101 1936477 1934129 1871313 1966191 1896321 1814566 1957119 1895388 1796871 1856673 1876074
16014 1876074 1844477 1939071 1939825 1890956 1940376 1890939 1781356 1792020 1853730 1963215 1921542
16003 1921542 1803590 1831228 1865387 1890230 1875323 1935845 1871215 1927477 1981405 1945263 1964552
15992 1964552 1975130 1865752 1880893 1919194 1910000 1885689 1890084 1855571 1884707 1887456 1848866 1919238
15980 1919238 1862541 1880258 1888693 1854929 1880315 1905452 1844948 1844402 1884487 1880898 1862389 1852027
15968 1852027 1828606 1845427 1838638 1856564 1837697 1857592 1878052 1907900 1883351 1898456 1851571
15957 1851571 1823429 1867742 1948857 1912554 1873556 1946864 1943757 1914431 1918709 1941889 1929383 1897902
15945 1897902 1929198 1891297 1932267 1913046 1866812 1939046 1875878 1861195 1895474 1906952 1895155
15934 1895155 1925408 1901729 1890028 1841420 1858263 1873085 1871114 1909105 1979476 1912393 1891927
15923 1891927 1873973 1865800 1852644 1889302 1898185 1850088 1905498 1912621 1944566 1905701 1823669 1838499
15911 1838499 1829831 1784719 1923243 1932430 1902428 1910227 1941663 1903919 1909284 1852320 1863961 1930257
15899 1930257 1925557 1928302 1902397 1826892 1818815 1793605 1854773 1838273 1865009 1851710 1813620 1886245
15887 1886245 1877328 1907067 1955611 1876093 1841468 1953939 1927777 1901593 1911009 1906653 1874327 1950705
15875 1950705 1981362 1931727 1954977 1902280 1983858 1909422 1870073 1908782 1837817 1849369 1818903
15864 1818903 1910272 1929862 1918332 1912954 1948103 1916197 1861783 1903437 1959163 1914271 1925753
15853 1925753 1907864 1951085 1994515 1906635 1907049 1868572 1829528 1925401 1973011 1918195 1884183 1834035
15841 1834035 1787059 1880050 1917962 1883992 1909752 1868439 1912395 1952681 1816070 1845353 1909708
15830 1909708 1852474 1893897 1922318 1852904 1853077 1872782 1869643 1939600 1891000 1837783 1936350 1974210
15818 1974210 1903832 1860378 1874995 1846471 1862197 1768450 1791853 1925573 1864527 1954154 1942324
15807 1942324 1906881 1949765 1897848 1889152 1868867 1853648 1967648 1949699 1926359 1880828 1848677
15796 1848677 1937227 1990201 1896824 1898387 1915112 1857534 1930887 1845588 1796536 1909458 1880608
15785 1880608 1845229 1941572 1844403 1945080 1991994 1846045 1881218 1922302 1859483 1975963 2005220
15774 2005220 1865968 1915851 1861609 1872647 1947611 1868733 1892155 1922939 1905391 1891588 1915932
15763 1915932 1933926 1887908 1855650 1899820 1861655 1889708 1909083 1868842 1793328 1891240 1895049
15752 1895049 1825955 1921686 1896522 1916875 1887626 1885619 1996089 1926738 1923409 1972554 1919299
15741 1919299 1925176 1944334 1895927 1930707 1929634 1888855 1961629 1956454 1956590 1988472 1853667 1850845
15729 1850845 1947211 1835432 1889235 1943020 1891425 1918937 1990697 1915718 1924050 2001118 1927671
15718 1927671 1904569 1898086 1888067 1879832 1831341 1807791 1889646 1929887 1821970 1908718 1928010
15707 1928010 1906770 1906444 1830584 1836836 1920364 1924886 1862259 1893210 1845869 1805886 1940802 1866249
15695 1866249 1845737 1963671 1934812 1918149 1973272 1864585 1857843 1870466 1884613 1917168 1949645
15684 1949645 1897473 1974833 2023544 1865666 1878700 1939949 1911536 1959531 1955191 1898694 1956875
15673 1956875 1932168 1793779 1873516 1915727 1866850 1881430 1896915 1921366 1931726 2001896 1936973
15662 1936973 1997650 1929191 1846577 1876222 1938697 1912564 1900385 1857150 1851197 1946656 1922838
15651 1922838 1937242 1955697 1901273 1900819 1915786 1923366 1947882 2015062 2050088 2032687 2023378 2026156
15639 2026156 1999079 1984472 2001930 1994661 1916870 1911833 1981572 1936837 1964768 1895842 1924355 2007243
15627 2007243 1901921 1924595 1934771 1861407 1868170 1900747 1903678 1926685 1993546 1932027 1895938
15616 1895938 1918333 1958311 1967508 1963516 1923942 1889630 1985641 2015397 2033663 1930990 1889470
15605 1889470 1980262 1971626 1858213 1961717 1948841 1865307 1984555 2025373 1894561 1938125 1905920
15594 1905920 1839199 1919624 1966392 1941585 1959266 1942840 1947478 2022014 2004322 1937344 1876584
15583 1876584 1950082 1948019 1930607 1885211 1881486 1968366 1990253 1994244 1975110 1954722 2002013 2037847
15571 2037847 1922316 1865519 1869362 1940032 1978826 1976713 1903072 1911542 1991509 1986326 1985904 1967204
15559 1967204 1964887 1948413 1983374 1934657 1935308 1941213 2016889 2001337 1965376 1938579 1928548 1977555
15547 1977555 1957701 1949398 1975498 1913954 1905205 1930806 1981927 1983152 2062956 1977319 1931483 1956629
15535 1956629 1948303 2004316 1998171 1920862 1896299 2010000 1976842 1918307 1884612 1861674 1892788
15524 1892788 1886875 1807459 1871113 1915538 1940224 1949935 1947346 1960503 1986690 1939069 1990473 2012654
15512 2012654 2032192 1968987 1905824 1992787 1962093 2008708 1989103 1971328 1976599 1972360 1919180 1880842
$$ [...]
##END NTUPLES=NMR SPECTRUM
##END=
