##TITLE=1H_DE-80H_X3
 200.13MHz, d2o
 8 sc
 
 19ns.26.2.2025
##JCAMPDX= 6.0         $$ Bruker NMR JCAMP-DX V2.0
##DATA TYPE= NMR SPECTRUM
##DATA CLASS= NTUPLES
##ORIGIN= UXNMR, Bruker Analytische Messtechnik GmbH
##OWNER= pz
$$ XWIN-NMR		Version 3.5
$$ Wed Dec 24 10:33:09 2025 Russian Standard Time (UT+4h)  Yarkov@DPX200
##.OBSERVE FREQUENCY= 200.1313
##.OBSERVE NUCLEUS= ^1H
##.ACQUISITION MODE= SIMULTANEOUS
##.ACQUISITION SCHEME= undefined
##.AVERAGES= 8
##.DIGITISER RES= 18
##SPECTROMETER/DATA SYSTEM= spect
##.PULSE SEQUENCE= zg30
##.SOLVENT NAME= CDCl3
##.SHIFT REFERENCE= (INTERNAL, CDCl3, 0, 15.4935)
##AUDIT TRAIL= $$ (NUMBER, WHEN, WHO, WHERE, WHAT)
$$ ##TITLE= Audit trail, XWIN-NMR		Version 3.5
$$ ##JCAMPDX= 5.01
$$ ##ORIGIN= Bruker BioSpin GmbH
$$ ##OWNER= Yarkov
$$ C:/Bruker/XWIN-NMR/data/yarkov2/nmr/H-C/1/pdata/1/auditp.txt
$$ ##AUDIT TRAIL=  $$ (NUMBER, WHEN, WHO, WHERE, WHAT)
(   1,<2025-12-24 10:32:21.82 +0400>,<Yarkov>,<DPX200>,
      <created by zg, POWCHK disabled, PULCHK disabled
       configuration hash MD5:
       00 E9 B6 7A A2 85 ED C7 34 08 36 98 17 FE 4E 26
       data hash MD5: 16K
       F2 FD 60 06 54 AA 69 77 D2 79 B3 8F 0D 13 BF 3D>)
(   2,<2025-12-24 10:32:30.48 +0400>,<Yarkov>,<DPX200>,
      <Start of raw data processing
       efp BC_mod = 2 LB = 0.25 FT_mod = 6 PKNL = 1 PHC0 = -5299.955 PHC1 = 10.82193 SI = 16K 
       data hash MD5: 16K
       E3 E8 D4 C2 82 D8 6C 8B 4E A6 A5 2F 61 C0 EA 30>)
$$ ##END=
$$ 
$$ hash MD5
$$ 0D 06 4A 65 1C 80 1F AA AE 16 0D 15 6C 2A DD 29
##$RELAX= 
##$RELAX= 
##$RELAX= 
##$RELAX= 
##$RELAX= 
##$RELAX= 
$$ Bruker specific parameters
$$ --------------------------
##$DU= <C:/Bruker/XWIN-NMR>
##$EXPNO= 1
##$NAME= <H-C>
##$PROCNO= 1
##$TYPE= <nmr>
##$USER= <yarkov2>
##$AMP= (0..31)
100 100 100 100 100 100 100 100 100 100 100 100 100 100 100 100 100 100 
100 100 100 100 100 100 100 100 100 100 100 100 100 100 
##$AQSEQ= 0
##$AQ_mod= 1
##$AUNM= <au_zg>
##$AUTOPOS= <>
##$BF1= 200.13
##$BF2= 200.13
##$BF3= 200.13
##$BF4= 200.13
##$BF5= 200.13
##$BF6= 200.13
##$BF7= 200.13
##$BF8= 200.13
##$BYTORDA= 1
##$CFDGTYP= 0
##$CFRGTYP= 5
##$CHEMSTR= <none>
##$CNST= (0..31)
1 1 145 1 1 1 1 1 1 1 1 1 1 1 1 1 1 1 1 1 1 1 1 1 1 1 1 1 1 1 1 1 
##$CPDPRG= <>
##$CPDPRG1= <>
##$CPDPRG2= <>
##$CPDPRG3= <>
##$CPDPRG4= <mlev>
##$CPDPRG5= <mlev>
##$CPDPRG6= <mlev>
##$CPDPRG7= <mlev>
##$CPDPRG8= <mlev>
##$CPDPRGB= <>
##$CPDPRGT= <>
##$D= (0..31)
0 0.7 0 0 0 0 0 0 0 0 0 0.03 0 0 0 0 0 0 0 0 0 0 0 0 0 0 0 0 0 0 0 0 
##$DATE= 1766557941
##$DBL= (0..7)
120 120 120 120 120 120 120 120 
##$DBP= (0..7)
150 150 150 150 150 150 150 150 
##$DBP07= 0
##$DBPNAM0= <>
##$DBPNAM1= <>
##$DBPNAM2= <>
##$DBPNAM3= <>
##$DBPNAM4= <>
##$DBPNAM5= <>
##$DBPNAM6= <>
##$DBPNAM7= <>
##$DBPOAL= (0..7)
0.5 0.5 0.5 0.5 0.5 0.5 0.5 0.5 
##$DBPOFFS= (0..7)
0 0 0 0 0 0 0 0 
##$DE= 6
##$DECBNUC= <off>
##$DECIM= 32
##$DECNUC= <off>
##$DECSTAT= 4
##$DIGMOD= 1
##$DIGTYP= 9
##$DL= (0..7)
0 120 120 120 120 120 120 120 
##$DP= (0..7)
$$ [...]
##$SUBNAM2= <"">
##$SUBNAM3= <"">
##$SUBNAM4= <"">
##$SUBNAM5= <"">
##$SUBNAM6= <"">
##$SUBNAM7= <"">
##$SUBNAM8= <"">
##$SUBNAM9= <"">
##$SW= 18.0517328524113
##$SWIBOX= (0..15)
0 0 2 0 0 0 0 0 0 0 0 0 0 0 0 0 
##$SW_h= 3612.71676300578
##$TD= 16384
##$TD0= 1
##$TE= 0
##$TE2= 300
##$TE3= 300
##$TEG= 300
##$TL= (0..7)
0 120 120 120 120 120 120 120 
##$TP= (0..7)
150 150 150 150 150 150 150 150 
##$TP07= 0
##$TPNAME0= <>
##$TPNAME1= <>
##$TPNAME2= <>
##$TPNAME3= <>
##$TPNAME4= <>
##$TPNAME5= <>
##$TPNAME6= <>
##$TPNAME7= <>
##$TPOAL= (0..7)
0.5 0.5 0.5 0.5 0.5 0.5 0.5 0.5 
##$TPOFFS= (0..7)
0 0 0 0 0 0 0 0 
##$TUNHIN= 0
##$TUNHOUT= 0
##$TUNXOUT= 0
##$USERA1= <user>
##$USERA2= <user>
##$USERA3= <user>
##$USERA4= <user>
##$USERA5= <user>
##$V9= 5
##$VALIST= <valist>
##$VCLIST= <CCCCCCCCCCCCCCC>
##$VD= 0
##$VDLIST= <DDDDDDDDDDDDDDD>
##$VPLIST= <PPPPPPPPPPPPPPP>
##$VTLIST= <TTTTTTTTTTTTTTT>
##$WBST= 1024
##$WBSW= 4
##$XGAIN= (0..3)
0 0 0 0 
##$XL= 0
##$YL= 0
##$YMAX_a= 167456
##$YMIN_a= -118716
##$ZGOPTNS= <>
##$ZL1= 120
##$ZL2= 120
##$ZL3= 120
##$ZL4= 120
##$ABSF1= 0
##$ABSF2= 0
##$ABSG= 0
##$ABSL= 0
##$ALPHA= 0
##$AQORDER= 0
##$ASSFAC= 0
##$ASSFACI= 0
##$ASSFACX= 0
##$ASSWID= 0
##$AUNMP= <proc_1d>
##$AZFE= 0.1
##$AZFW= 0.1
##$BCFW= 0
##$BC_mod= 2
##$BYTORDP= 0
##$COROFFS= 0
##$CY= -3
##$DATMOD= 1
##$DC= 0
##$DFILT= <>
##$DTYPP= 0
##$F1P= 0
##$F2P= 0
##$FCOR= 1
##$FTSIZE= 16384
##$FT_mod= 6
##$GAMMA= 0
##$GB= 0
##$INTBC= 1
##$INTSCL= 3.241238e-09
##$ISEN= 128
##$LB= 0.25
##$LEV0= 0
##$LPBIN= 0
##$MAXI= 10000
##$MC2= 0
##$MEAN= 0
##$ME_mod= 0
##$MI= 1.114404
##$NCOEF= 0
##$NC_proc= -7
##$NLEV= 6
##$NOISF1= 3.799351
##$NOISF2= 2.8
##$NSP= 0
##$NTH_PI= 0
##$NZP= 0
##$OFFSET= 15.49348
##$PC= 1
##$PHC0= -5299.955
##$PHC1= 10.82193
##$PH_mod= 1
##$PKNL= yes
##$PPARMOD= 0
##$PSCAL= 0
##$PSIGN= 0
##$REVERSE= no
##$SF= 200.130005649856
##$SI= 16384
##$SIGF1= 3
##$SIGF2= 2
##$SINO= 0.751879
##$SIOLD= 32768
##$SREGLST= <19F.Aceton>
##$SSB= 0
##$STSI= 16384
##$STSR= 0
##$SW_p= 3612.71676300578
##$SYMM= 0
##$S_DEV= 0
##$TDeff= 16384
##$TDoff= 0
##$TI= <>
##$TILT= no
##$TM1= 0
##$TM2= 0
##$TOPLEV= 0
##$USERP1= <user>
##$USERP2= <user>
##$USERP3= <user>
##$USERP4= <user>
##$USERP5= <user>
##$WDW= 1
##$XDIM= 16384
##$YMAX_p= 370462761
##$YMIN_p= -626716
$$ End of Bruker specific parameters
$$ ---------------------------------
##NTUPLES= NMR SPECTRUM
##VAR_NAME=  FREQUENCY,     SPECTRUM/REAL,   SPECTRUM/IMAG
##SYMBOL=    X,             R,               I
##VAR_TYPE=  INDEPENDENT,   DEPENDENT,       DEPENDENT
##VAR_FORM=  AFFN,          ASDF,            ASDF
##VAR_DIM=   16384,         16384,           16384
##UNITS=     HZ,            ARBITRARY UNITS, ARBITRARY UNITS
##FACTOR=    0.220516191357247, 1,           1
##FIRST=     3100.71018564041, 0,            0
##LAST=      -512.006577365374, 0,           0
##MIN=       -512.006577365374, -626716,     0
##MAX=       3100.71018564041, 370462761,    0
$$ Real data points
##PAGE= N=1
##DATA TABLE= (X++(R..R)), XYDATA
$$ [...]
$$ plain form
8078 6290 -122885 -63334 -53864 68710 231811 241912 140826 127511 203336 221269 275484
8067 275484 211424 55317 123999 182909 174418 105503 220224 156916 98455 95424 209224
8056 209224 248247 48386 46688 76469 293099 96428 141399 101287 12453 180173 190460
8045 190460 303128 97863 75717 122545 128693 325920 138808 128949 55574 -101376 156961
8034 156961 51251 77597 75680 145185 252222 176881 271395 337237 338627 377916 392243 448032
8022 448032 374327 502352 513844 518282 536473 550981 321295 172366 321835 400267 407220
8011 407220 314783 346685 330845 233921 261531 271940 374776 471673 615788 544122 433653
8000 433653 568287 547526 657953 558671 560099 615493 560063 734167 596757 472231 615681
$$ packed form
8078F290j29175N9551R470J22574J63101J0101j01086j3315P5825J7933N4215
8067B75484o4060j56107O8682N8910q491o8915J14721o3308n8461l031J13800
8056B09224L9023j99861j698K9781K16630j96671M4971m0112q8834J67720J0287
8045A90460J12668k05265k2146M6828O148J97227j87112r859p3375j56950K58337
8034A56961j05710K6346j917O9505J07037p5341R4514O5842J390L9289J4327N5789
8022D48032p3705J28025J1492M438J8191J4508k29686j48929J49469P8432O953
8011D07220r2437L1902j5840r6924K7610J0409J02836R6897J44115p1666j10469
8000D33653J34634k0761J10427r9282J428N5394n5430J74104j37410j24526J43450
$$ plain form
7989 615681 722182 823316 649506 816601 957361 876609 690856 667287 572379 487026
7979 487026 750350 734504 528364 405775 456369 468183 406280 351722 220881 273460 237958
7968 237958 251670 147525 263074 382897 145254 55917 116042 194463 238216 138574 83775
7957 83775 -31296 164797 218582 8866 11898 -27804 40443 -2489 -34145 -34625 -172234 -26940
7945 -26940 -236573 -78711 -93379 -86281 -146558 -271583 -213244 -225989 -188751 -324659 -332287
7934 -332287 -171374 -162580 -78178 24222 2544 -7987 -34653 -25106 -37064 10727 27810 -65648
7922 -65648 -83697 -24704 -3308 132879 34547 -198070 -44941 -116919 -110832 -116737 -120263 105243
7910 105243 -59495 56664 -33779 6211 196451 90192 103030 -56058 4601 -25628 -121519
$$ packed form
7989F15681J06501J01134j73810J67095J40760q0752j85753k3569r4908q5353
7979D87026K63324j5846k06140j22589N0594J1814o1903n4558j30841N2579l5502
7968B37958J3712j04145J15549J19823k37643q9337O0125P8421M3753r9642n4799
7957H3775j15071J96093N3785k09716L032l9702O8247m2932l1656m80j37609J45294
7945b6940k09633J57862j4668P098o0277j25025N8339j2745L7238j35908p628
7934c32287J60913Q794Q4402J02400k1678j0531k6666R547j1958M7791J7083r3458
7922f5648j8049N8993K1396J36187r8332k32617J53129p1978O087n905l526K25506
7910A05243j64738J16159r0443L9990J90240j06259J2838j59088O0659l0229r5891
$$ plain form
7899 -121519 -68717 -115594 -132813 -219673 -21992 -118155 -78199 -110195 -126632 -183759 -160369
7888 -160369 -107049 -123006 -258944 -182412 -139011 -144402 -171371 -145744 -167939 -230545 -210244 -251688
7876 -251688 -237903 -316067 -280290 -341386 -333116 -317555 -194561 -128211 -242797 -105829 -112776
7865 -112776 -254780 -206542 -183313 -118677 -197829 -135839 -177599 -176537 21939 -32368 -44252
7854 -44252 -181900 -128459 -59617 -50102 -181980 -190079 -109373 -116618 12170 41955 -113034 -10980
7842 -10980 25611 27933 13534 -27639 -49920 -22998 -20428 -35942 64717 82839 79466 28830
7830 28830 23494 95681 93343 285667 120812 86854 33622 67708 74709 36923 330390 79899
7818 79899 82760 61906 122383 282489 150098 97542 114033 126458 120926 75379 248410 271743
$$ packed form
7899a21519N2802m6877j7219q6860J97681r6163L9956l1996j6437n7127K3390
7888a60369N3320j5957j35938P6532M3401n391k6969K5627k2195o2606K0301m1444
7876b51688J3785p8164L5777o1096Q270J5561J22994O6350j14586J36968o947
7865a12776j42004M8238K3229O4636p9152O1990m1760J062J98476n4307j1884
7854d4252j37648N3441O8842R515j31878q099Q0706p245J28788K9785j54989J02054
7842a0980L6591K322j4399m1173k2281K6922K570j5514J00659J8122l373n0636
7830B8830n336P2187k338J92324j64855l3958n3232L4086P001l7786K93467k50491
7818G9899K861k0854O0477J60106j32391n2556J6491J2425n532m5547J73031K3333
$$ plain form
7806 271743 263569 664514 1108440 498345 146450 170502 128409 251941 251544 187777 218345
7795 218345 196865 166191 148677 248973 264811 185240 210214 11027 121792 139630 160210
7784 160210 221324 186281 233555 147718 107436 66343 80061 34975 27216 95009 34706 -1163
7772 -1163 -22352 172176 227164 203197 214201 153945 183016 163335 267338 311871 264174 260882
7760 260882 195319 107701 19425 166490 139880 59751 116888 31976 78638 685 -103438
7749 -103438 -89343 -78970 23389 -13146 61890 -22761 -105390 -20111 -226558 -234708 -80311
7738 -80311 -113579 -235109 -255013 -220847 -156662 -325407 -370337 -309871 -286985 -212361 -238074
7727 -238074 -289401 -239282 -347244 -187366 -160822 -159330 -125369 -261079 -263312 -223468 -78396
$$ packed form
7806B71743q174M00945M43926o10095l51895K4052m2093J23532l97o3767L0568
7795B18345k1480l0674j7514J00296J5838p9571K4974j99187J10765J7838K0580
7784A60210O1114l5043M7274q5837m0282m1093J3718m5086p759O7793o0303l5869
7772a163k1189J94528N4988k3967J1004o0256K9071j9681J04003M4533m7697l292
7760B60882o5563q7618q8276J47065k6610q0129N7137q4912M6662p7953j04123
7749a03438J4095J0373J02359l6535P5036q4651q2629Q5279k06447q150J54397
7738h0311l3268j21530j9904L4166O4185j68745m4930O0466K2886P4624k5713
7727b38074n1327N0119j07962J59878K6544J492L3961j35710k233L9844J45072
$$ plain form
7716 -78396 -13233 -201069 -257458 -148642 -71097 -233418 -221633 -132983 -64167 -13452 -75468
7705 -75468 -146247 -44111 -26138 6365 -53421 -126148 -136410 -95664 129195 57204 -85700
7694 -85700 25975 189058 122680 100214 144123 153695 113278 96279 -12529 54898 151076
7683 151076 253256 288718 234387 134207 142644 18278 -69228 -85790 -21489 104039 28829
7672 28829 -54382 -73991 38606 64778 142000 143273 3209 24947 -86285 -64559 -70125 -93973
7660 -93973 -55918 -58750 -12231 -120450 -78022 -27244 -101620 96636 2356 3895 -11071 28410
7648 28410 33883 -111713 -34207 174206 5872 -44432 33294 -65832 -49386 17785 -87284
7637 -87284 -30792 69728 132878 -61514 49346 144446 242854 284284 93658 116940 84340
$$ packed form
7716g8396O5163j87836n6389J08816P7545j62321J1785Q8650O8816N0715o2016
7705g5468p0779J02136J7973L2503n9786p2727j0262M0746K24859p1991j42904
7694h5700J11675J63083o6378k2466M3909R572m0417j6999j08808O7427R6178
7683A51076J02180L5462n4331j00180Q437j24366q7506j6562O4301J25528p5210
7672B8829q3211j9609J12597K6172P7222J273j40064K1738j11232K1726n566k3848
7660i3973L8055k832M6519j08219M2428N0778p4376J98256r4280J539j4966L9481
7648B8410N473j45596P7506K08413j68334n0304P7726r9126J6446O7171j05069
7637h7284N6492J00520O3150j94392J10860R5100R8408M1430j90626K3282l2600
$$ plain form
7626 84340 190836 115653 136129 197970 18227 17606 72290 46362 162427 94130 9387 -96546
7614 -96546 -79085 -74776 -95744 -148233 -145639 -69863 -63164 -41236 -12687 66614 12601 12788 -18957
7601 -18957 -77868 -100625 -122309 -27873 -184262 -209904 -301428 -250495 -54268 -99468 -172913
7590 -172913 -131273 -135016 -136362 -202067 -146923 -151002 -116318 -39145 84187 99683 -41207 -41403
7578 -41403 5549 -127328 -166244 -228026 -83499 31044 -7118 -40305 45849 57600 -86824
7567 -86824 -3858 -51727 -8054 46800 -62934 -92858 -60881 -109771 -44395 30892 58844 9889
7555 9889 -20899 17129 77154 58078 -7552 -65903 26014 -52428 -166512 -31374 -11055 -176893
7543 -176893 -138600 56830 23237 -11726 -34468 -101668 -73616 -25870 -68874 -156776 -203510
$$ packed form
7626H4340J06496p5183K0476O1841j79743o21N4684k5928J16065o8297q4743j05933
7614i6546J7461M309k0968n2489K594P5776O699K1928K8549P9301n4013J87l1745
7601a8957n8911k2757k1684R4436j56389k5642r1524N0933J96227m5200p3445
7590a72913M1640l743j346o5705N5144m079L4684P7173J23332J5496j40890j96
7578d1403M6952j32877l8916o1782J44527J14543l8162l3187Q6154J1751j44424
7567h6824Q2966m7869M3673N4854j09734k9924L1977m8890O5376P5287K7952m8955
7555I889l0788L8028O0025j9076o5630n8351R1917p8442j14084J35138K0319j65838
7543a76893L8293J95430l3593l4963k2742o7200K8052M7746m3004q7902m6734
$$ plain form
7532 -203510 -97759 -89004 22464 -13179 -61535 69274 -61215 -136753 -132053 -73119 -27805
7521 -27805 -22662 -72056 35018 187177 259744 169058 90459 15596 -28489 201159 150995
7510 150995 60413 86646 214730 120758 78351 150513 -5930 3550 36954 -80581 -8475
7499 -8475 13399 30234 123494 154825 126811 122015 246112 151969 22808 206503 257510 161994
7487 161994 250867 157376 296706 239317 150607 291841 123756 34052 31258 104128 -121411
7476 -121411 -128186 -41890 -100839 -126882 -239725 -17877 34800 -3655 36921 -55523 32145
7465 32145 47787 -125541 -37408 -85939 -50117 -39057 273 -39919 -51388 -126978 119
7454 119 21401 -126883 -31146 -94699 -39744 -120441 -32163 27261 48952 109427 -54307 -38048
$$ packed form
7532b03510J05751Q755J11468l5643m8356J30809j30489p5538M700N8934M5314
7521b7805N143m9394J07074J52159P2567r0686p8599p4863m4085K29648n0164
7510A50995r0582K6233J28084r3972m2407P2162j56443R480L3404j17535P2106
7499h475K1874J6835R3260L1331k8014m796J24097r4143j29161J83695N1007r5516
7487A61994Q8873r3491J39330n7389q8710J41234j68085q9704k794P2870k25539
7476a21411o775Q6296n8949k6043j12843K21848N2677l8455M0576r2444Q7668
7465C2145J5642j73328Q8133m8531L5822J1060L9330m0192j1469p5590J27097
7454A19K1282j48284R5737o3553N4955q0697Q8278N9424K1691O0475j63734J6259
$$ plain form
7442 -38048 59112 89092 29466 49336 81217 154100 255062 215410 233237 157859 10289
7431 10289 167059 215937 270677 178834 74768 103761 -32376 6307 14334 81635 -41658
7420 -41658 5957 48299 79565 57210 300 -82398 -131098 -90393 -121518 -22249 -98460 -104819
7408 -104819 -69509 39865 39744 -77237 -164708 -94139 -4414 -23407 -66417 -83823 26882
7397 26882 18028 -90657 -286542 -252466 -186852 -217917 -160915 -247486 -340084 -357130 -263714 -200995
7385 -200995 -244035 -250888 -224829 -282770 -219257 -194540 2619 -44856 -88076 -12198 -39787 -81864
7373 -81864 -115883 -106497 -54933 -136656 -137279 -38472 39873 60060 -6379 75513 -32749 -12490
7361 -12490 -42076 -115326 -26643 42349 29029 19679 10366 106536 4333 46476 -26867 -46475
$$ packed form
7442c8048R7160K9980n9626J9870L1881P2883J00962l9652J7827p5378j47570
7431A0289J56770M8878N4740r1843j04066K8993j36137L8683Q027O7301j23293
7420d1658M7615M2342L1266k2355n6910q2698m8700M0705l1125R9269p6211o359
7408a04819L5310J09374j21j16981q7471P0569Q9725j8993m3010j7406J10705
7397B6882q854j08685j95885L4076O5614l1065N7002q6571r2598j7046R3416O2719
7385b00995m3040o853K6059n7941O3513K4717J97159m7475m3220P5878k7589m2077
7373h1864l4019R386N1564q1723o23R8807P8345K0187o6439Q1892j08262K0259
7361a2490k9586p3250Q8683O8992j3320r350r313R6170j02203M2143p3343j9608
$$ plain form
7349 -46475 9136 -9242 -77697 -90276 -36848 -6795 -91350 -116081 -32133 -62956 -197715 -31482
7337 -31482 -192377 -322654 -91363 -62473 -96407 -275894 -211482 -130457 -146271 -57617 -106536
7326 -106536 -70724 -123139 -286253 -252821 -117664 -214918 -179818 -107971 -173284 -168870 -173333 -36187
7314 -36187 -207940 -128761 -16148 -41620 120126 20303 63433 161577 137945 247954 123092
7303 123092 96294 91376 149076 103152 70304 214542 105655 123763 264189 276453 400172
7292 400172 357098 232340 311698 344787 232803 266570 294774 436734 424349 384786 289882
7281 289882 353149 293309 226961 244357 337783 423829 305276 344854 312230 186892 193970
7270 193970 188181 165444 145183 51198 31262 -65381 -12145 -97473 -104213 40365 50081 -39995
$$ packed form
7349d6475N5611j8378o8455j2579N3428L0053q4555k4731Q3948l0823j34759J66233
7337c1482j60895j30277K31291K8890l3934j79487O4412Q1025j5814Q8654m8919
7326a06536L5812n2415j63114L3432J35157r7254L5100P1847o5313M414m463J37146
7314c6187j71753P9179J12613k5472J61746r9823M3130R8144k3632J10009j24862
7303A23092k6798m918N7700m5924l2848J44238j08887J8108J40426J2264J23719
7292D00172m3074j24758P9358L3089j11984L3767K8204J41960j2385l9563r4904
7281B89882O3267n9840o6348J7396R3426Q6046j18553L9578l2624j25338P078
7270A93970n789k2737k0261r3985j9936r6643N3236q5328o740J44578R716r0076
$$ plain form
7258 -39995 -95060 -251245 -176294 -115837 -67512 -146634 -292587 -295596 -292764 -171014 -105697 -263100
7246 -263100 -124146 -156106 -167096 -159868 -48078 39506 -28676 -39892 -37998 120904 -62719
7235 -62719 -65301 45367 165096 136047 48867 85600 111029 40844 -62549 -16627 123851
7224 123851 47583 33935 168847 211006 -1395 9922 97606 81069 69897 87147 197766
7213 197766 71565 -39828 119610 98771 114288 76106 92101 85062 126745 144503 161585
7202 161585 43582 123114 44769 -79038 -62157 -183761 -35347 -33417 -90032 -73927 -92694
7191 -92694 -74883 -36973 15572 59352 -49648 129228 180182 73316 12854 51359 -90941
7180 -90941 -202431 -6016 2311 65786 187172 76053 -22708 3868 143866 144535 128003
$$ packed form
7258c9995n5065j56185P4951O0457M8325p9122j45953l009K832J21750O5317j57403
7246b63100J38954l1960j0990P228J11790Q7584o8182j1216J894J58902j83623
7235f2719k582J10668J19729k9049q7180L6733K5429p0185j03393M5922J40478
7224A23851p6268j3648J34912M2159k12401J1317Q7684j6537j1172J7250J10619
7213A97766j26201j11393J59438k0839J5517l8182J5995p039M1683J7758J7082
7202A61585j18003P9532p8345j23807J6881j21604J48414J930n6615J6105j8767
7191i2694J7811L7910N2545M3780j09000J78876N0954j06866o0462L8505j42300
7180i0941j11490J96415Q327O3475J21386j11119r8761K6576J39998O69j6532
$$ plain form
7169 128003 146252 31233 143543 262029 161376 241308 251117 317149 214116 311768 370802
7158 370802 285549 271314 154535 234492 257317 189223 305525 238995 327160 327747 397842 397909
7146 397909 427436 517568 436411 552091 636639 772852 1027695 1239558 1476387 1957000
7136 1957000 2202928 2108893 1870315 1546417 1537069 1336677 1305041 1218896 1048292 920297
7126 920297 637096 499758 442686 418311 385086 311405 196528 266482 259180 243588 123081
7115 123081 66000 -26433 936 -96299 -25389 -2998 14714 52190 91523 137155 -14965
7104 -14965 129228 135661 -58587 -84626 26321 90438 -22872 -23734 10008 122149 180201
7093 180201 168475 151663 122562 43740 -38698 -11149 -123569 1624 98250 205230 44722
$$ packed form
7169A28003J8249j15019J12310J18486j00653P9932R809O6032j03033R7652N9034
7158C70802q5253j4235j16779P9957K2825o8094J16302o6530Q8165N87P0095O7
7146C97909K9527R0132q1157J15680Q4548J36213K54843K11863K36829M80613
7136A957000K45928r4035k38578l23898r348k00392l1636q6145j70604j27995
7126I20297k83201j37338n7072k4375l3225p3681j14877O9954p302j5592j20507
7115A23081n7081r2433K7369r7235P0910K2391J7712L7476L9333M5632j52120
7104a4965J44193O433j94248k6039J10947O4117j13310q62L3742J12141N8052
7093A80201j1726j6812k9101p8822q2438K7549j12420J25193R6626J06980j60508
$$ plain form
7082 44722 -93471 190156 55131 54239 135134 193913 231028 112316 247235 262666 183090
7071 183090 303776 155618 206051 25340 55680 218329 168648 162718 38173 -32259 50337
7060 50337 41203 -5007 18770 157340 5063 1517 54347 -34725 89744 173198 171075 11831
7048 11831 29611 221617 179958 132186 170886 126269 174157 123438 235954 268237 323940
7037 323940 159431 213190 220271 156133 156722 226200 248343 15076 192725 136408 181109 245497
7025 245497 169803 264861 187928 227087 158315 199081 183369 210982 252244 150112 359017
7014 359017 216815 328071 351623 263298 358331 251181 264804 174914 222086 253473 326958
7003 326958 293789 135193 112363 -12319 10309 24483 4239 32858 7352 95593 -23505
$$ packed form
7082D4722j38193K83627j35025q92Q0895N8779L7115j18712J34919J5431p9576
7071A83090J20686j48158N0433j80711L0340J62649m9681n930j24545p0432Q2596
7060E0337r134m6210K3777J38570j52277l546N2830q9072J24469Q3454k123j59244
7048A1831J7780J92006m1659m7772L8700m4617M7888n0719J12516L2283N5703
7037C23940j64509N3759P081o4138N89O9478K2143k33267J77649n6317M4701O4388
7025B45497p5694R5058p6933L9159o8772M0766j5712K7613M1262j02132K08905
7014C59017j42202J11256K3552q8325R5033j07150J3623q9890M7172L1387P3485
7003C26958l3169j58596k2830j24682K2628J4174k0244K8619k5506Q8241j19098
$$ plain form
6992 -23505 102660 54252 84616 222381 106607 4750 160655 261447 296411 226253 325242
6981 325242 219789 14250 183133 222017 288407 345622 295252 220465 129454 151152 216035
6970 216035 230463 146048 182501 263077 202216 151062 3812 9360 -35291 75287 125246
6959 125246 950 15037 137824 83404 140393 112168 -108740 -104785 -23528 36916 84910
6948 84910 15647 -99533 -113587 -71321 -106 -157992 -66637 -207463 -183919 -21098 -107263
6937 -107263 -182508 -281362 -118883 -73769 66050 -69172 -91487 -89643 -28321 138353 -112587
6926 -112587 -37828 144983 214692 392977 214224 152971 78420 86062 83053 242849 370675
6915 370675 272567 324243 268784 368318 245639 289653 268233 310456 263541 188402 386335
$$ packed form
6992b3505J26165m8408L0364J37765j15774j01857J55905J00792L4964p0158R8989
6981C25242j05453k05539J68883L8884O6390N7215n0370p4787r1011K1698O4883
6970B16035J4428q4415L6453Q0576o0861n1154j47250N548m4651J10578M9959
6959A25246j24296J4087J22787n4420N6989k8225k20908L955Q1257O0444M7994
6948H4910o9263j15180j4054M2266P1215j57886R1355j40826K3544J62821q6165
6937a07263p5245r8854J62479M5114J39819j35222k2315J844O1322J66674k50940
6926a12587P4759J82811O9709J78285j78753o1253p4551P642l009J59796J27826
6915C70675r8108N1676n5459R9534j22679M4014k1420M2223m6915p5139J97933
$$ plain form
6904 386335 264830 235459 323460 442302 254821 117092 105423 35755 131618 123504 100031
6893 100031 106954 61933 146752 115775 131199 32722 -36479 31714 -81687 -26686 24865 61703
6881 61703 109812 -88981 -40719 -82587 -142894 16131 -196202 -161334 -106630 -103098 21750
6870 21750 -150167 -149032 -145123 -79513 35818 75236 64653 -10200 -126440 -103438 4745
6859 4745 -4958 -35960 21507 -6532 -53442 -56545 -216865 -31951 -9082 20727 -79233 -196644
6847 -196644 -195428 -64223 13271 -109567 -189635 -167607 -40863 -67821 -7077 -148527 -23051
6836 -23051 -86392 -239109 -138536 -276035 -215693 -196832 -137318 -174203 -209816 -290102 -406773
6825 -406773 -254008 -111930 113566 -12366 -96804 -190480 -341714 -250326 -132057 -62739
$$ packed form
6904C86335j21505k9371Q8001J18842j87481j37729j1669o9668R5863q114k3473
6893A00031O923m5021Q4819l0977J5424r8477o9201O8193j13401N5001N1551L6838
6881F1703M8109j98793M8262m1868o0307J59025k12333L4868N4704L532J24848
6870B1750j71917J135L909O5610J15331L9418j0583p4853j16240K3002J08183
6859D745r703l1002N7467k8039m6910l103j60320J84914K2869K9809r9960j17411
6847a96644J216J31205P7494j22838q0068K2028J26744k6958O0744j41450J25476
6836b3051o3341j52717J00573j37499O0342J8861N9514l6885l5613q0286j16671
6825d06773J52765J42078K25496j25932q4438r3676j51234R1388J18269O9318
$$ plain form
6815 -62739 -210410 -1711 33797 -144325 -86680 -15783 115213 -32166 121751 179140 288195
6804 288195 241449 56496 66800 60861 44075 26538 212131 118896 49120 118077 106620
6793 106620 181934 278060 275538 237756 249654 219885 111689 150962 127743 79820 21790 80370
6781 80370 93495 21319 -59338 -77089 62411 -7561 86391 113569 40747 -25189 -21398 136186
6769 136186 138649 246010 59892 21180 39241 76036 57208 104959 145763 21079 12328
6758 12328 59484 130771 113514 102827 176295 154684 167865 94001 237052 132780 29056
6747 29056 78076 65459 323173 351598 284945 233039 277118 251351 235747 255744 109131
6736 109131 241855 -8802 103953 289653 114585 157876 99080 170925 34962 28806 37814
$$ packed form
6815f2739j47671K08699L5508j78122N7645P0897J30996j47379J53917N7389J09055
6804B88195m6746j84953J0304n939j6786j7537J85593r3235o9776O8957j1457
6793A06620P5314R6126k522l7782J1898k9769j08196L9273k3219m7923n8030N8580
6781H0370J3125p2176q0657j7751J39500o9972R3952K7178p2822o5936L791J57584
6769A36186K463J07361j86118l8712J8061L6795j8828M7751M0804j24684q751
6758A2328M7156P1287j7257j0687P3468k1611J3181p3864J43051j04272j03724
6747B9056M9020j2617K57714K8425o6653n1906M4079k5767j5604J9997j46613
6736A09131J32724k50657J12755J85700j75068M3291n8796P1845j35963o156R008
$$ plain form
6725 37814 -70973 -47391 -145698 -93933 -68642 -153279 -194826 -111521 -47774 -146557 -208905 -277134
6713 -277134 -80665 -169888 -75289 10669 -39943 44652 -73149 -126005 -148972 -98470 -152413
6702 -152413 -317052 -314885 -172341 23954 -164106 -118327 -6069 15265 -41182 -179090 -132312
6691 -132312 -25757 42780 -67379 -65947 143271 191124 65308 169104 218920 185923 377764
6680 377764 364822 392838 204051 242516 362292 442434 407503 396099 590695 485065 344693
6669 344693 260788 202780 221501 335624 432031 310255 256871 117474 135799 210867 157684
6658 157684 271660 134432 114227 128866 181398 201942 322963 258499 90440 83263 -140642
6647 -140642 32768 54609 -17813 -25868 -91152 125170 -12099 12820 105270 80047 25784
$$ packed form
6725C7814j08787K3582r8307N1765K5291q4637m1547Q3305O3747r8783o2348o8229
6713b77134J96469q9223R4599Q5958n0612Q4595j17801n2856k2967N0502n3943
6702a52413j64639K167J42544J96295j88060M5779J12258K1334n6447j37908M6778
6691a32312J06555O8537j10159J432K09218M7853j25816J03796M9816l2997J91841
6680C77764j2942K8016j88787L8465J19776Q0142l4931j1404J94596j05630j40372
6669C44693q3905n8008J8721J14123R6407j21776n3384j39397J8325P5068n3183
6658A57684J13976j37228k0205J4639N2532K0544J21021o4464j68059p177k23905
6647a40642J73410K1841p2422q055o5284K16322j37269K4919R2450k5223n4263
$$ plain form
6636 25784 -120879 -151613 -147956 -113191 -66157 -128848 -34473 88096 -25933 -24968 42951 -59861
6624 -59861 4427 -76259 59660 96811 -19416 137875 154945 213151 156040 154568 403307
6613 403307 377942 332173 169492 202715 182052 321839 303913 141852 340868 250280 212960
6602 212960 257355 470982 556797 499965 404819 321597 371840 442980 406244 350522 367307
6591 367307 244439 266552 219953 360009 368270 214189 375596 185442 103551 158845 319205
6580 319205 325799 238155 234828 132379 257913 208995 14157 19527 106238 189587 148513 98995
6568 98995 -115160 -155333 -208134 -273098 -239251 -240768 -124253 -211395 -65346 -5951 -123045
6557 -123045 -118301 -105773 75055 100575 131904 37551 3930 6226 171941 162896 220117 248035
$$ packed form
6636B5784j46663l0734L657L4765M7034o2691R4375J22569j14029R65O7919j02812
6624e9861O4288q0686J35919L7151j16227J57291J7070N8206n7111j472K48739
6613D03307k5365m5769j62681L3223k0663J39787j7926j62061J99016r0588l7320
6602B12960M4395K13627Q5815n6832r5146q3222N0243P1140l6736n5722J6785
6591C67307j22868K2113m6599J40056Q261j54081J61407j90154q1891N5294J60360
6580C19205O594q7644l327j02449J25534m8918j94838N370Q6711Q3349m1074m9518
6568I8995k14155m0173n2801o4964L3847j517J16515q7142J46049N9395j17094
6557a23045M744J2528J80828K5520L1329r4353l3621K296J65715r045N7221K7918
$$ plain form
6545 248035 125593 327945 291533 268079 223536 126867 339601 334723 344839 281908 195555
6534 195555 104920 219408 258828 188543 135968 95844 251676 161337 163027 662 -12677
6523 -12677 51188 193741 295223 217606 122722 174153 106049 56729 26856 113810 -40180
6512 -40180 23239 140032 177127 258903 48003 37397 -1900 59131 -35404 -127457 -71072
6501 -71072 -31962 95012 71847 100961 89195 50290 97849 89410 147320 187699 262114 179770
6489 179770 164357 167183 251648 257019 237712 255233 131708 213517 208873 218875 99252 270669
6477 270669 314299 258307 340466 362212 169165 23072 66925 161895 245813 239349 108357
6466 108357 9983 33223 29781 7737 41541 28397 -23826 -68525 -193130 -37595 74669
$$ packed form
6545B48035j22442K02352l6412k3454m4543r6669K12734m878J0116o2931q6353
6534A95555r0635J14488L9420p0285n2575m0124J55832r0339J690j62365j3339
6523a2677O3865J42553J01482p7617r4884N1431o8104m9320k9873Q6954j53990
6512d0180O3419J16793L7095Q1776k10900j0606l9297O1031r4535r2053N6385
6501g1072L9110J26974k3165K9114j1766l8905M7559q439N7910M0379P4415q2344
6489A79770j5413K826Q4465N371j9307J7521j23525Q1809m644J0002j19623J71417
6477B70669M3630n5992Q2159K1746j93047j46093M3853R4970Q3918o464j30992
6466A08357r8374K3240l442k2044L3804j3144n2223m4699j24605J55535J12264
$$ plain form
6455 74669 166710 151301 138487 126326 193160 125969 -61287 36258 124259 173681 169060 110662
6443 110662 126927 198388 185069 170730 229871 268181 301295 300481 363563 425297 263879 190950
6431 190950 261185 237050 254158 170480 227882 171864 197086 129269 202140 329349 305198
6420 305198 286937 179705 305569 219285 151051 110495 105753 31250 -5664 43019 72040
6409 72040 67915 -19008 38649 -36989 104211 101632 -23476 45110 74487 -62682 -49694 200029
6397 200029 211354 -43451 -46345 34403 59737 13010 -36115 27339 126698 218249 143642 43680
6385 43680 26511 118596 352413 237438 181238 225039 224018 385066 449593 304637 160516
6374 160516 178200 154926 145452 275784 342565 281976 328366 339806 388946 331768 298049 253897
$$ packed form
6455G4669R2041j5409j2814j2161O6834o7191j87256R7545Q8001M9422m621n8398
6443A10662J6265P1461j3319j4339N9141L8310L3114q14O3082O1734j61418p2929
6431A90950P0235k4135J7108q3678N7402n6018K5222o7817P2871J27209k4151
6420C05198j8261j07232J25864q6284o8234m0556m742p4503l6914M8683K9021
6409G2040m125q6923N7657p5638J41200k579j25108O8586K9377j37169J2988K49723
6397B00029J1325k54805k894Q0748K5334m6727m9125O3454R9359R1551p4607r9962
6385D3680j7169R2085K33817j14975n6200M3801j021J61048O4527j44956j44121
6374A60516J7684k3274r474J30332O6781o0589M6390J1440M9140n7178l3719m4152
$$ plain form
6362 253897 198287 146380 150393 113825 69706 103634 -14787 -79385 9578 -79962 17539 9382
6350 9382 -23516 -40957 -57357 -3818 -42721 -104166 -185491 -310940 -328507 -121230 -114678 -191698
6338 -191698 -251407 -250609 -189317 -124878 -60329 -75050 -20737 17680 -86620 44759 -31228 -62451
6326 -62451 -68804 10607 160247 -92449 -83882 -86695 10146 229193 105225 146854 208529 267948
6314 267948 176139 154861 168018 100591 97797 166543 332592 323894 313016 175237 163534 260046
6302 260046 206135 293370 190449 90665 270793 265191 279597 294410 247699 87401 124398
6291 124398 34027 104530 194108 102480 52264 10369 122091 206529 173623 218926 162607
6280 162607 171056 189457 164283 184844 301375 347942 357835 295648 266245 304049 313913 391691
$$ packed form
6362B53897n5610n1907M013l6568m4119L3928j18421o4598Q8963q9540R7501q157
6350I382l2898j7441j6400N3539l8903o1445q1325j25449j7567K07277O552p7020
6338a91698n9709P98O1292O4439O4549j4721N4313L8417j04300J31379p5987l1223
6326f2451o353P9411J49640k52696Q567k813R6841K19047j23968M1629O1675N9419
6314B67948r1809k1278J3157o7427k794O8746J66049q698j0878j37779j1703R6512
6302B60046n3911Q7235j02921r9784J80128n602J4406J4813m6711j60298L6997
6291A24398r0371P0503Q9578r1628n0216m1895J11722Q4438l2906M5303n6319
6280A62607Q449J8401k5174K0561J16531M6567R893o2187k9403L7804R864P7778
$$ plain form
6268 391691 363458 455822 408295 287918 380933 449020 235218 380903 523464 399652 380319
6257 380319 362698 322012 283026 327874 415157 591971 571782 471981 456317 407024 547192
6246 547192 577269 553881 632488 675721 639697 403903 367578 570627 692578 575649 502352
6235 502352 534304 607490 726700 775946 702642 695315 518849 518275 576248 742744 869735
6224 869735 839500 746275 742455 824711 847243 867556 721553 818877 691954 742713 745248 685107
6212 685107 765952 790200 736694 735564 689237 751779 715675 679968 621389 643855 727524 714659
6200 714659 702362 751857 855253 876786 1034232 975628 896612 845379 804751 1056089 970987
6189 970987 931943 1006887 812361 883559 900147 859056 885493 922891 1125170 969392 1046683
$$ packed form
6268C91691k8233R2364m7527j20377R3015O8087k13802J45685J42561j23812j9333
6257C80319j7621m0686l8986M4848Q7283J76814k0189r9801j5664m9293J40168
6246E47192L0077k3388P8607M3233l6024k35794l6325K03049J21951j16929p3297
6235E02352L1952P3186J19210M9246p3304p327j76466n74N7973J66496J26991
6224H69735l0235r3225l820Q2256K2532K0313j46003R7324j26923N0759K535o0141
6212F85107Q0845K4248n3506j130m6327O2542l6104l5707n8579K2466Q3669j2865
6200G14659j2297M9495J03396K1533J57446n8604p9016n1233m0628K51338q5102
6189I70987l9044P4944j94526P1198J6588m1091K6437L7398K02279j55778P7291
$$ plain form
6178 1046683 1161769 1016800 1073275 1022576 1117654 1070036 1080513 1165413 1020079 1126063 1250310
6167 1250310 1195429 1110934 1111282 1242792 1111443 1090478 1206975 1200182 1328055 1325634 1215523
6156 1215523 1238141 1401072 1365465 1349653 1337724 1392558 1273939 1273585 1252458 1182935 1173078 1052023
6144 1052023 1249796 1218257 1181330 1250600 1267451 1256709 1119158 1076040 1073386 1046838 1166992
6133 1166992 1232975 1266428 1182096 1098760 1181374 1105211 1126757 1029454 977439 848195 794214
6122 794214 825177 776298 760133 738855 841411 867652 786016 781530 837929 970807 901925
6111 901925 758290 753684 757988 804973 860928 838192 826119 783148 634278 742694 974730
6100 974730 908550 848247 815242 889859 896694 824065 808267 614181 628317 637014 736340 710964
$$ packed form
6178A046683J15086j44969N6475n0699R5078m7618J0477Q4900j45334J05984J24247
6167A250310n4881q4495L48J31510j31349k0965J16497o793J27873k421j10111
6156A215523K2618J62931l5607j5812j1929N4834j18619l54k1127o9523r857j21055
6144A052023J97773l1539l6927O9270J6851j0742j37551m3118k654k6548J20154
6133A166992O5983L3453q4332q3336Q2614p6163K1546r7303n2015j29244n3981
6122G94214L0963m8879j6165k1278J02556K6241q1636m486N6399J32878o8882
6111I01925j43635m606M304M6985N5955k2736j2073m2971j48870J08416K32036
6100I74730o6180o0303l3005P4617O835p2629j5798j94086J4136Q697R9326k5376
$$ plain form
6088 710964 874981 890091 804490 916184 956134 1021292 875690 928108 1157080 1055901 1197467
6077 1197467 1187003 1096249 1114283 1112008 1014922 1056883 1099915 1098170 1175538 1251152 1084447 1020264
6065 1020264 1006277 994436 1087544 1140366 936047 964249 945621 932432 996498 1075329 1222741
6054 1222741 1199840 1105913 1007394 938480 1010010 894726 822416 848370 719175 835635 625950
6043 625950 678286 710008 639051 821738 880351 909260 804056 735976 822265 1006583 1054684
6032 1054684 986378 940642 1003802 1190105 1228724 1129579 1250996 1297228 1280178 1362333 1453736
6021 1453736 1400238 1273804 1460792 1510544 1416926 1383201 1398836 1475783 1514044 1453254 1284968
6010 1284968 1192172 1251814 1334929 1429571 1534969 1495424 1389271 1458363 1327690 1420339 1362510
$$ packed form
6088G10964J64017J5110q5601J11694L9950O5158j45602N2418K28972j01179J41566
6077A197467j0464r0754J8034k275r7086M1961M3032j745P7368P5614j66705o4183
6065A020264j3987j1841R3108N2822k04319K8202j8628j3189O4066P8831J47412
6054A222741k2901r3927r8519o8914P1530j15284p2310K5954j29195J16460k09685
6043F25950N2336L1722p0957J82687N8613K8909j05204o8080Q6289J84318M8101
6032A054684o8306m5736O3160J86303L8619r9145J21417M6232j7050Q2155R1403
6021A453736n3498j26434J86988M9752r3618l3725J5635P6947L8261o0790j68286
6010A284968r2796N9642Q3115R4642J05398l9545j06153O9092j30673R2649n7829
$$ plain form
5999 1362510 1415792 1635211 1587559 1564214 1516935 1588315 1691641 1532903 1413335 1514911
5989 1514911 1539320 1488354 1478025 1463544 1466660 1556749 1593629 1536581 1412011 1535533 1750526
5978 1750526 1719090 1720556 1618434 1721004 1706887 1886276 1989748 1959860 1951359 1960813 2020804
5967 2020804 2077433 2153532 2252268 2328180 2334973 2358058 2702532 2897308 2828081 2835581 3021587
5956 3021587 3063475 3175841 3274793 3393138 3366752 3454545 3597591 3636780 4014259 4277345
5946 4277345 4463101 4779729 5128211 5376633 5797807 6480900 7511945 8923004 11013186
5937 11013186 14217905 18269207 22609895 25997580 27176149 26244368 24590905 23539182
5929 23539182 22503258 21735420 21109437 19779266 18108451 16448458 15080400 14071592
$$ packed form
5999A362510N3282K19419m7652k3345m7279P1380J03326j58738j19568J01576
5989A514911K4409n0966j0329j4481L116R0089L6880n7048j24570J23522K14993
5978A750526l1436J466j02122J02570j4117J79389J03472k9888q501R454N9991
5967B020804N6629P6099R8736P5912O793K3085L44474J94776o9227P500J86006
5956C021587M1888J12366R8952J18345k6386Q7793J43046L9189L77479K63086
5946D277345J85756L16628L48482K48422M21174O83093J031045J411059K090182
5937A1013186L204719M051302M340688L387685J178569r31781j653463j051723
5929B3539182j035924p67838o25983j330171j670815j659993j368058j008808
$$ plain form
5921 14071592 13202664 12864453 13007512 13884425 15931296 19281612 23691773 27757788 30339166
5912 30339166 30514538 28593548 26567141 25218365 23914076 22912495 21638999 19840952
5904 19840952 17681514 15537802 13733819 12094354 10803647 9672978 8732889 8103429
5896 8103429 7453153 6943298 6774804 6576612 6410166 6172300 6084219 6095486 6047226 5951791
5886 5951791 6021286 6172464 6260362 6425273 6632041 6832779 7182201 7470440 7921314 8487662
5876 8487662 9083572 9641973 10417312 11390127 12799721 14408495 16844068 20656996 26426926
5867 26426926 34110721 42930397 50512930 54609803 54102792 51248143 48445939 46288006
5859 46288006 44584853 42872699 40693848 37566895 34114588 30981084 28528083 26722302
$$ packed form
5921A4071592q68928l38211J43059Q76913K046871L350316M410161M066015K581378
5912C0339166J75372j920990k026407j348776j304289j001581j273496j798047
5904A9840952k159438k143712j803983j639465j290707j130669r40089o29460
5896H103429o50276n09855j68494j98192j66446k37866q8081J1267m8260r5435
5886E951791O9495J51178Q7898J64911K06768K00738L49422K88239M50874N66348
5876H487662N95910N58401P75339R72815J409594J608774K435573L812928N769930
5867B6426926P683795Q819676P582533M096873n07011k854649k802204k157933
5859D6288006j703153j712154k178851l126953l452307l133504k453001j805781
$$ plain form
5851 26722302 25716889 25700168 26810319 29832120 35370848 43097400 51253280 57256490
5843 57256490 59079339 56458409 52648888 49318022 46590735 44218056 41564814 38216632
5835 38216632 34005962 29730605 25894914 22405410 19520354 16928919 14803016 13121007
5827 13121007 11495274 10459027 9650799 8840220 8120286 7488597 7137631 6612840 6154133
5818 6154133 5824737 5493564 5396272 5292398 5312855 5194041 5192699 5187255 5102620 5235295 5208457
5807 5208457 5181521 5081791 4946020 5025110 4853329 4641110 4621530 4608769 4514315 4204140 4281586
5796 4281586 4130442 4069300 4063455 4062613 4072321 3887356 3789095 3763926 3855695 3919364 3930742 3990345
5784 3990345 3989809 4062924 4051670 4037736 4120455 4285668 4258810 4298365 4449324 4401548 4507639
$$ packed form
5851B6722302j005413j6721J110151L021801N538728P726552Q155880O003210
5843E7256490J822849k620930l809521l330866k727287k372679k653242l348182
5835C8216632m210670m275357l835691l489504k885056k591435k125903j682009
5827A3121007j625733j036247q08228q10579p19934o31689l50966n24791m58707
5818F154133l29396l31173r7292j03874K0457j18814j342n444q4635J32675k6838
5807E208457k6936r9730j35771P9090j71781k12219j9580j2761r4454l10175P7446
5796D281586j51144o1142n845q42R708j84965r8261k5169R1769O3669J1378N9603
5784C990345n36P3115j1254j3934Q2719J65213k6858L9555J50959m7776J06091
$$ plain form
5773 4507639 4435849 4458673 4531775 4559249 4677100 4708902 4814031 4779324 4942534 5127638 5403465
5762 5403465 5634606 5597211 5809462 6017518 6117379 6453346 6743970 7175910 7540144 8107454
5752 8107454 8691836 9342551 10237061 11213714 12434820 14492199 17464780 21819908 27754861
5743 27754861 34693354 41640665 47001234 49603130 49584763 48011304 45470069 43161858
5735 43161858 41129988 38924086 36329726 33067706 29746671 26540954 23654977 21339800
5727 21339800 19420214 17829122 16502667 15584587 14954388 14587084 14459164 14616756 14933268
5718 14933268 15437709 16400773 17944333 20458795 24511353 30184060 37298539 44901869
5710 44901869 51090819 54475640 54777237 52978666 50255083 47706457 45329791 42673105
$$ packed form
5773D507639p1790K2824P3102K7474J17851L1802J05129l4707J63210J85104K75827
5762E403465K31141l7395K12251K08056R9861L35967K90624M31940L64234N67310
5752H107454N84382O50715Q94510R76653J221106K057379K972581M355128N934953
5743B7754861O938493O947311N360569K601896j8367j573459k541235k308211
5735D3161858k031870k205902k594360l262020l321035l205717k885977k315177
5727B1339800j919586j591092j326455r18080o30199l67304j27920J57592L16512
5718A4933268N04441R63064J543560K514462M052558N672707P114479P603330
5710D4901869O188950L384821L01597j798571k723583k548626k376666k656686
$$ plain form
5702 42673105 39799599 36382814 32549270 28656176 25083780 22025041 19407087 17066802
5694 17066802 15121996 13391532 12082578 11078559 10455878 9901159 9354435 8889895 8634956
5685 8634956 8512785 8277782 8154787 8179041 8391347 8546367 8903789 9668193 10760565 12509639
5675 12509639 14986759 18067861 21546942 24519291 26272501 26491345 25578991 24329200
5667 24329200 23016239 22033866 21036399 19983371 18412641 16734395 15041102 13486465
5659 13486465 12233950 11072060 10116764 9514169 9116492 8701216 8466802 8310709 8318282
5650 8318282 8301674 8416879 8782410 9394952 10529861 12299047 14850629 18239497 22229521
5641 22229521 25972161 28448828 29185263 28557726 27263538 25623678 24326302 22977730
$$ packed form
5702D2673105k873506l416785l833544l893094l572396l058739k617954k340285
5694A7066802j944806j730464j308954j004019o22681n54719n46724m64540k54939
5685H634956j22171k35003j22995K4254K12306J55020L57422P64404J092372J749074
5675A2509639K477120L081102L479081K972349J753210K18844r12354j249791
5667B4329200j312961r82373r97467j053028j570730j678246j693293j554637
5659A3486465j252515j161890r55296o02595l97677m15276k34414j56093P573
5650H318282j6608J15205L65531O12542J134909J769186K551582L388868L990024
5641B2229521L742640K476667P36435o27537j294188j639860j297376j348572
$$ plain form
5633 22977730 21433588 19807995 17824976 15905847 13971617 12282926 10829849 9312429
5625 9312429 8232826 7410830 6551110 5882685 5430400 5202942 4949828 4649370 4343270
5616 4343270 4115733 3920372 3885360 3681716 3639806 3558534 3236588 3341453 3229058 3113568
5606 3113568 2955597 2864579 2859124 2946712 3135766 3036314 3186965 3023955 2924379 2810882 2806686
5595 2806686 2854462 2774913 2826282 2895220 2852605 2849999 2876203 2947671 2936672 2853910 2789322 2896865
5583 2896865 2763023 2582276 2757464 2801364 2841695 2614417 2544573 2572408 2476230 2346302
5573 2346302 2214979 2040610 2101800 2102679 2118485 2091587 2136228 2004653 1967555 2162944 2369543
5562 2369543 2321980 2377706 2293745 2274315 2115936 2104964 1965683 1921367 2097688 2117163 2001628
$$ packed form
5633B2977730j544142j625593j983019j919129j934230j688691j453077j517420
5625I312429j079603q21996q59720o68425m52285k27458k53114l00458l06100
5616D343270k27537j95361l5012k03644m1910q1272l21946J04865j12395j15490
5606C113568j57971r1018n455Q7588J89054r9452J50651j63010r9576j13497m196
5595B806686M7776p9549N1369O8938m2615k606K6204P1468j0999q2762o4588J07543
5583B896865j33842j80747J75188M3900M0331k27278o9844K7835r6178j29928
5573B346302j31323j74369O1190Q79J5806k6898M4641j31575l7098J95389K06599
5562B369543m7563N5726q3961j9430j58379j0972j39281m4316J76321J9475j15535
$$ plain form
5551 2001628 1943797 2056514 1980182 1954499 1880605 1934272 2015281 2000764 1906295 2095157 2213275
5540 2213275 2133043 2027724 1916041 1908426 1743941 1763803 1824263 1786185 1955557 1967268 1926589
5529 1926589 1898965 1959587 2037979 2008545 2106265 2000438 1857131 1885972 1919428 2003099 1897112
5518 1897112 1954575 1959283 1782130 1697836 1709413 1819203 1644074 1684546 1529518 1648581 1790127
5507 1790127 1624753 1560307 1463762 1409460 1325980 1301932 1319578 1304986 1252156 1396537 1527395
5496 1527395 1440696 1371857 1321153 1516052 1544288 1499631 1462645 1269549 1438996 1428935 1523653
5485 1523653 1541903 1697175 1622037 1460442 1530600 1498235 1515913 1338851 1243528 1314829 1409601
5474 1409601 1490145 1315663 1302521 1242856 1185819 1241180 1422859 1482013 1420532 1381883 1465027
$$ packed form
5551B001628n7831J12717p6332k5683p3894N3667Q1009j4517r4469J88862J18118
5540B213275q0232j05319j11683p615j64485J9862O0460l8078J69372J1711m0679
5529A926589k7624O0622P8392k9434R7720j05827j43307K8841L3456Q3671j05987
5518A897112N7463M708j77153q4294J1577J09790j75129M0472j55028J19063J41546
5507A790127j65374o4446r6545n4302q3480k4048J7646j4592n2830J44381J30858
5496A527395q6699o8839n0704J94899K8236m4657l6986j93096J69447j0061R4718
5485A523653J8250J55272p5138j61595P0158l2365J7678j77062r5323P1301R4772
5474A409601Q0544j74482j3142n9665n7037N5361J81679N9154o1481l8649Q3144
$$ plain form
5463 1465027 1509312 1304803 1338631 1346041 1282256 1303410 1236344 1357327 1271140 1356585 1397115
5452 1397115 1288774 1471772 1379744 1381899 1389118 1369470 1372016 1393441 1537213 1430122 1351896
5441 1351896 1325305 1436830 1334269 1405695 1317920 1523263 1569803 1653053 1821100 1611876
5431 1611876 1721874 1785550 1982883 1682455 1755434 1930089 2056276 2313333 2278494 2565506
5421 2565506 2698712 3002557 3015767 3039078 3165069 3061026 3032859 2967240 2895423 2876997 2651024
5410 2651024 2523231 2560010 2398811 2382057 2377744 2497942 2508433 2668052 2639625 2736115 2711086
5399 2711086 2796951 2792523 2901833 2900055 2861852 2734769 2735756 2817726 2674294 2880910 2858811
5388 2858811 2708541 2584465 2377427 2513879 2545587 2520313 2323046 2323789 2421196 2278010 2355682
$$ packed form
5463A465027M4285k04509L3828P410o3785K1154o7066J20983q6187Q5445M0530
5452A397115j08341J82998r2028K155P219j9648K546K1425J43772j07091p8226
5441A351896k6591J11525j02561P1426q7775K05343M6540Q3250J68047k09224
5431A611876J09998O3676J97333l00428P2979J74655J26187K57057l4839K87012
5421B565506J33206L03845J3210K3311J25991j04043k8167o5619p1817j8426k25973
5410B651024j27793L6779j61199j6754m313J20198J0491J59619k8427R6490k5029
5399B711086Q5865m428J09310j778l8203j27083R87Q1970j43432K06616k2099
5388B858811j50270j24076k07038J36452L1708k5274j97267P43R7407j43186P7672
$$ plain form
5377 2355682 2378985 2273793 2220889 2361905 2372548 2323344 2388469 2473655 2430151 2404082 2252159
5366 2252159 2227199 2330182 2300729 2320100 2423914 2415768 2414935 2263449 2483671 2375539 2344901
5355 2344901 2356784 2360944 2563246 2413059 2549084 2558106 2661038 2768026 2781365 2907142 2724792
5344 2724792 2771315 2788835 2814451 2729073 2742662 2922447 2950150 3087427 3269218 3351965 3491957
5333 3491957 3927427 4617353 5192241 5814543 6399970 6757293 7314066 7773364 8044836 8120807
5323 8120807 7932365 7935959 7952000 7954438 8234575 8135247 7960623 7675783 7451738 7071285 6756017
5312 6756017 6727239 6782399 6970081 7080805 7714610 8919871 10362081 12010853 13338905
5303 13338905 14426162 15179063 16141635 16856050 16561803 16015007 15267334 14700108 14049893
$$ packed form
5377B355682K3303j05192n2904J41016J0643m9204O5125Q5186m3504k6069j51923
5366B252159k4960J02983k9453J9371J03814q146q33j51486K20222j08132l0638
5355B344901J1883M160K02302j50187J36025R022J02932J06988J3339J25777j82350
5344B724792M6523J7520K5616q5378J3589J79785K7703J37277J81791Q2747J39992
5333C491957M35470O89926N74888O22302N85427L57323N56773M59298K71472P5971
5323H120807j88442L594J6041K438K80137r9328j74624k84840k24045l80453l15268
5312F756017k8778N5160J87682J10724O33805J205261J442210J648772J328052
5303A3338905J087257P52901R62572P14415k94247n46796p47673n67226o50215
$$ plain form
5294 14049893 13663247 13562539 13693337 13960192 14043520 13923113 13376650 12922443 12819166 13303352
5284 13303352 14289702 15604788 16866998 17773704 18425721 19752253 22666327 26666738 30868240
5275 30868240 33822882 34416535 33874773 33642410 34771108 36563196 38466826 39525574 39444911
5266 39444911 38819325 37791299 36117827 33492355 31413488 30073990 28839557 27517186
5258 27517186 25993277 23940959 21952113 20569818 19666272 19248892 19465197 19936543 20316740
5249 20316740 20352806 19938904 18985479 17954034 17133548 16618304 16299941 15975350 15820553
5240 15820553 15527577 14955330 14013292 13599244 13619651 13713248 13652999 13546400 13096986 12341860
5230 12341860 12236056 12347022 12689819 13665500 14983047 16934737 18956158 20522843 20960187
$$ packed form
5294A4049893l86646j00708J30798K66855Q3328j20407n46463m54207j03277M84186
5284A3303352R86350J315086J262210R06706O52017J326532K914074M000411M201502
5275C0868240K954642N93653n41762k32363J128698J792088J903630J058748q0663
5266C9444911o25586j028026j673472k625472k078867j339498j234433j322371
5258B7517186j523909k052318j988846j382295r03546m17380K16305M71346L80197
5249B0316740L6066m13902r53425j031445q20486n15244l18363l24591j54797
5240A5820553k92976n72247r42038m14048K0407R3597o0249j06599m49414p55126
5230A2341860j05804J10966L42797R75681J317547J951690K021421J566685M37344
$$ plain form
5221 20960187 20410993 19855746 19315807 19254130 19279499 19629058 20093735 20648875 21662701 22912971
5211 22912971 23860737 24234665 24554933 25171377 26801093 28770117 31045280 32939656 33620841
5202 33620841 33648352 32842061 31768370 31108884 31180318 31429812 32311321 34282862 36917396
5193 36917396 39816726 42057090 42988010 42390324 41028776 40118320 40005656 40535542 41240817
5184 41240817 41616112 40988014 39983804 39326150 38957780 38230080 37287877 37054288 37946202
5175 37946202 39891082 42339433 44416827 44699886 43249329 41143198 38876639 37177137
5167 37177137 35753784 34747831 34219918 33987579 34239508 34509479 34570268 33769881 32646713
5158 32646713 31460670 30282012 29761986 29865728 30105128 29711649 29024005 27661429 26260751
$$ packed form
5221B0960187n49194n55247n39939o1677K5369L49559M64677N55140J013826J250270
5211B2912971R47766L73928L20268O16444J629716J969024K275163J894376O81185
5202C3620841K7511q06291j073691o59486P1434K49494Q81509J971541K634534
5193C6917396K899330K240364R30920n97686j361548r10456j12664N29886P05275
5184D1240817L75295o28098j004210o57654l68370p27700r42203k33589Q91914
5175C7946202J944880K448351K077394K83059j450557k106131k266559j699502
5167C7177137j423353j005953n27913k32339K51929K69971O0789q00387j123168
5158C2646713j186043j178658n20026J03742K39400l93479o87644j362576j400678
$$ plain form
5149 26260751 25271261 24788223 24421095 24574238 25501690 26841887 28329539 29095843 29104562
5140 29104562 28182514 26256130 24320851 22824773 21821642 20367367 18981657 17567693
5132 17567693 15991656 14621714 13195652 12123112 11098124 10299331 9629837 9135160 8668778
5123 8668778 8472069 8495087 8829394 9337331 9711221 9920136 9989028 9887765 9905442 10274609
5113 10274609 10916112 11448119 12052234 12232481 12255125 12017361 12039094 12761904 13972163 16023566
5103 16023566 18665493 20842263 21947743 21010408 19467340 18320887 17745823 17280272 16952114
5094 16952114 16622253 15779498 15113590 15068678 16036286 17675625 19435378 20856391 20699174
5085 20699174 19321107 17971069 17253447 17127212 16918536 16756396 16377172 15487238 14399169
$$ packed form
5149B6260751r89490m83038l67128J53143R27452J340197J487652P66304Q719
5140B9104562r22048j926384j935279j496078j003131j454275j385710j413964
5132A7567693j576037j369942j426062j072540j024988p98793o69494m94677m66382
5123H668778j96709K3018L34307N07937L73890K08915O8892j01263J7677L69167
5113A0274609O41503N32007O04115J80247K2644k37764K1733P22810J210259K051403
5103A6023566K641927K176770J105480r37335j543068j146453n75064m65551l28158
5094A6952114l29861q42755o65908m4912R67608J639339J759753J421013j57217
5085B0699174j378067j350038p17622j26235k08676j62140l79224q89934j088069
$$ plain form
5076 14399169 13407402 12574611 11964196 11470523 11449074 11300655 11276402 10841133 10411340 10112675
5066 10112675 9853137 9776377 9719296 9630210 9375104 9305524 9372796 9328354 9646361 9847263
5056 9847263 10119088 10807420 12016730 13647707 15439167 17279210 19026769 19905794 20854832
5047 20854832 22177929 23643474 24686848 25102738 25238559 24757758 24350686 24340979 24746624
5038 24746624 25280955 25896214 26573646 27026792 27637999 28909245 30499842 32992232 36001298
5029 36001298 38657751 40024021 39853297 40566075 41950454 43686030 45476366 47561790
5021 47561790 50112032 53063203 56799154 61201606 66712818 73772424 83706077 100213766
5013 100213766 128580107 172821960 231158081 294462989 347289471 370462761 370255009
$$ packed form
5076A4399169r91767q32791o10415m93673k1449j48419k4253m35269m29793k98665
5066A0112675k59538p6760n7081q9086k55106o9580O7272m4442L18007K00902
5056I847263K71825O88332J209310J630977J791460J840043J747559Q79025R49038
5047B0854832J323097J465545J043374M15890J35821m80801m07072r707M05645
5038B4746624N34331O15259O77432M53146O11207J271246J590597K492390L009066
5029C6001298K656453J366270j70724P12778J384379J735576J790336K085424
5021D7561790K550242K951171L735951M402452N511212P059606R933653J6507689
5013A00213766K8366341M4241853N8336121O3304908N2826482K3173290k07752
$$ plain form
5006 370255009 349662966 321350154 301079425 286250560 270363171 249145161 224644796
4999 224644796 195586391 166214609 140688485 118810365 99956491 84161973 70989921
4992 70989921 60850029 52794595 46565719 41516479 37136885 33434336 30494233 27848324
4984 27848324 25806170 23905202 22627077 21571089 20814309 20281776 19765016 19345599 19042101
4975 19042101 18782681 18688169 18439976 18445176 18362208 18475357 18611282 18752341 18911824 19106083
4965 19106083 19469547 19941823 20530090 21028521 21801218 22810077 23753904 25051147 26564799
4956 26564799 28319493 30283631 32549712 35317277 38686628 43065641 48311298 55357395
4948 55357395 65193910 80466030 105871672 144593877 194601677 248537960 297137323
$$ packed form
5006C70255009k0592043k8312812k0270729j4828865j5887389k1218010k4500365
4999B24644796k9058405k9371782k5526124k1878120j8853874j5794518j3172052
4992G0989921j0139892q055434o228876n049240m379594l702549k940103k645909
4984B7848324k042154j900968j278125j055988p56780n32533n16760m19417l03498
4975A9042101k59420r4512k48193N200q2968J13149J35925J41059J59483J94259
4965A9106083L63464M72276N88267M98431P72697J008859R43827J297243J513652
4956B6564799J754694J964138K266081K767565L369351M379013N245657P046097
4948E5357395R836515J5272120K5405642L8722205N0007800N3936283M8599363
$$ plain form
4941 297137323 324292382 336572704 338162654 317990770 293302502 276536042 260989547
4934 260989547 240123823 218622371 195837584 168696514 142407741 119686058 100390239
4927 100390239 84216245 70911837 59805701 50957902 44226631 38794100 34203068 30307026
4919 30307026 27183653 24473301 22150626 20395017 18833613 17663954 16726505 15993625
4911 15993625 15413939 14874120 14318506 13677149 13217883 12751355 12221200 11877595 11442761
4902 11442761 11183415 10912830 10625528 10369521 10166066 9888125 9634205 9428564 9371146 9047938
4892 9047938 8713515 8556480 8320655 8207632 7836561 7609777 7335437 7003814 6741961 6555428
4882 6555428 6616085 6652364 6686465 6418264 6511269 6523547 6349974 6372602 6302086 6152952 5969650
$$ packed form
4941B97137323K7155059J2280322J589950k0171884k4688268j6766460j5546495
4934B60989547k0865724k1501452k2784787k7141070k6288773k2721683j9295819
4927A00390239j6173994j3304408j1106136q847799o731271n432531m591032l896042
4919C0307026l123373k710352k322675j755609j561404j169659r37449p32880
4911A5993625n79686n39819n55614o41357m59266m66528n30155l43605m34834
4902A1442761k59346k70585k87302k56007k03455k77941k53920k05641n7418l23208
4892I047938l34423j57035k35825j13023l71071k26784k74340l31623k61853j86533
4882F555428O0657L6279L4101k68201R3005J2278j73573K2628p0516j49134j83302
$$ plain form
4871 5969650 5823823 5741061 5737127 5553736 5322691 5110607 4961773 4741129 4682594 4780838
4861 4780838 4722795 4653549 4543729 4489278 4673788 4667759 4600523 4576429 4776568 4627287 4512852
4850 4512852 4445222 4185403 4304137 4178892 4008893 4061707 3965708 3895054 3847507 3787420 3671858
4839 3671858 3566775 3359052 3235804 3250457 3098142 3040296 2871895 2942634 3025269 3106828
4829 3106828 3081585 2862075 3137885 3240663 3242620 3048100 3165438 3108523 3018601 3110561 3036066
4818 3036066 3035562 2948550 2829651 2805893 2817569 2933083 2812778 2912614 2977849 2962374 2941946
4807 2941946 2942573 3033164 3087837 3036445 3048498 2979834 2985852 2910592 2816399 2941989 2980431 3096782
4795 3096782 3086412 3063367 2972239 2843214 2890492 2999881 3081273 3200613 3236481 3284697 3293704
$$ packed form
4871E969650j45827q2762l934j83391k31045k12084j48834k20644n8535R8244
4861D780838n8043o9246j09820n4451J84510o029o7236k4094K00139j49281j14435
4850D512852o7630k59819J18734j25245j69999N2814r5999p0654m7547o0087j15562
4839C671858j05083k07723j23248J4653j52315n7846j68401P0739Q2635Q1559
4829C106828k5243k19510K75810J02778J957j94520J17338n6915q9922R1960p4495
4818C036066n04q7012j18899k3758J1676J15514j20305R9836O5235j5475k0428
4807B941946O27R0591N4673n1392J2053o8664O018p5260r4193J25590L8442J16351
4795C096782j0370k3045r1128j29025M7278J09389Q1392J19340L5868M8216R007
$$ plain form
4784 3293704 3443328 3450686 3474235 3456772 3438000 3431877 3598636 3668275 3597511 3724833 3813484
4773 3813484 3798404 3808829 3810059 3821699 3950298 4047376 4019084 4238708 4287010 4405643 4545465
4762 4545465 4569324 4893339 5061721 5236064 5470367 5817066 6149995 6307322 6719700 7038747
4752 7038747 7529699 7905557 8576154 9391328 10346816 11542262 13086640 15638823 19488206
4743 19488206 24876638 31312649 37932997 42840457 44659567 43970580 41800146 40074193
4735 40074193 39110328 38158292 37255940 35768119 34165823 32486955 31446749 31289661 32429748
4726 32429748 35279465 40464225 47990190 57507367 68149378 78119862 86755430 92779568
4718 92779568 95543485 94633884 91247310 86996503 83219978 80288820 77762303 74978335
$$ packed form
4784C293704J49624P358K3549j7463j8772o123J66759O9639p0764J27322Q8651
4773C813484j5080J0425J230J1640J28599R7078k8292K19624M8302J18633J39822
4762D545465K3859L24015J68382J74343K34303L46699L32929J57327M12378L19047
4752G038747M90952L75858O70597Q15174R55488J195446J544378K552183L849383
4743A9488206N388432O436011O620348M907460J819110o88987k170434j725953
4735D0074193r63865r52036r02352j487821j602296j678868j040206j57088J140087
4726C2429748K849717N184760P525965R517177J0642011R970484Q635568O024138
4718I2779568K763917r09601l386574m250807l776525k931158k526517k783968
$$ plain form
4710 74978335 71412406 66167745 59738444 54268553 50682146 48913509 49313681 52120734
4702 52120734 56789907 62194693 66155528 67346370 65822658 62475915 59380079 57046397
4694 57046397 55067134 52996543 50405091 47497038 44722982 41930761 39157546 35999423
4686 35999423 32261681 28717344 25789797 23413428 21303175 19543157 17713793 15860587
4678 15860587 14045490 12530151 11371819 10270766 9397716 8429312 7762363 7339589 6939185
4669 6939185 6452227 6300678 5945490 5497830 5546364 5217664 4919150 4802539 4598726 4352984
4659 4352984 4207671 4202742 4123085 4041945 3819545 3616883 3499849 3390675 3367958 3161854
4649 3161854 3027637 3046595 3024885 2999446 2928852 2827942 2820052 2700692 2664964 2579949 2426801
$$ packed form
4710G4978335l565929n244661o429301n469891l586407j768637M00172K807053
4702E2120734M669173N404786L960835J190842j523712l346743l095836k333682
4694E7046397j979263k070591k591452k908053k774056k792221k773215l158123
4686C5999423l737742l544337k927547k376369k110253j760018j829364j853206
4678A5860587j815097j515339j158332j101053q73050r68404o66949m22774m00404
4669F939185m86958j51549l55188m47660M8534l28700k98514j16611k03813k45742
4659D352984j45313m929p9657q1140k22400k02662j17034j09174k2717k06104
4649C161854j34217J8958k1710k5439p0594j00910p890j19360l5728q5015j53148
$$ plain form
4638 2426801 2318646 2326485 2387266 2430844 2416128 2535795 2401416 2455727 2615956 2913130 3140867
4627 3140867 3301481 3570221 3747657 3716342 3651026 3447459 3368407 3187177 3272646 3097163
4617 3097163 2938541 2756053 2589754 2421578 2090339 1979893 1980459 1948901 1939516 1915643 1756754
4606 1756754 1752398 1786156 1753206 1688343 1701675 1660163 1465590 1529218 1506782 1542342 1555357
4595 1555357 1446725 1502719 1408210 1442816 1480019 1520943 1438234 1340002 1396729 1286903 1279716
4584 1279716 1305402 1339609 1243260 1189878 1185602 1141882 1205863 1094411 1279353 1383269 1275320
4573 1275320 1196031 1235698 1246723 1251835 1197917 1134801 1239637 1167977 1195736 1175512 1218249
4562 1218249 1234926 1273103 1399793 1423384 1369409 1214294 1444413 1320832 1300186 1272228 1261224
$$ packed form
4638B426801j08155P839O0781M3578j4716J19667j34379N4311J60229K97174K27737
4627C140867J60614K68740J77436l1315o5316k03567p9052j81230Q5469j75483
4617C097163j58622j82488j66299j68176l31239j10446N66l1558r385k3873j58889
4606A756754m356L3758l2950o4863J3332m1512j94573O3628k2436L5560J3015
4595A555357j08632N5994r4509L4606L7203M0924q2709r8232N6727j09826p187
4584A279716K5686L4207r6349n3382m276m3720O3981j11452J84942J03916j07949
4573A275320p9289L9667J1025N112n3918o3116J04836p1660K7759k0224M2737
4562A218249J6677L8177J26690K3591n3975j55115K30119j23581k0646k7958j1004
$$ plain form
4551 1261224 1319885 1278825 1146233 1184921 1207462 1337111 1117967 1270397 1289862 1310309 1272838
4540 1272838 1189002 1394565 1264747 1149695 1186075 1309262 1506642 1421269 1375795 1310783
4530 1310783 1316072 1370373 1476480 1577437 1625916 1654738 1657435 1669332 1606849 1701627 1720774
4519 1720774 1810592 1754568 1852893 1953429 1975641 1913267 1806456 2007218 2061029 2152775 2151937
4508 2151937 2117380 2171370 2094942 2132655 2117560 2081105 2245884 2268356 2268405 2175183 2286281 2457159
4496 2457159 2399429 2536598 2453963 2510525 2575446 2497705 2412040 2548110 2668000 2742407 2715114
4485 2715114 2945610 2933978 2992890 2958969 3112452 3302839 3286736 3474906 3635913 3846370
4475 3846370 4089324 4381567 4729291 5027492 5451982 5792226 6315616 6966173 7593845 8246323
$$ packed form
4551A261224N8661m1060j32592L8688K2541J29649k19144J52430J9465K0447l7471
4540A272838q3836K05563j29818j15052L6380J23187J97380q5373m5474o5012
4530A310783N289N4301J06107J00957M8479K8822K697J1897o2483R4778J9147
4519A720774Q9818n6024R8325J00536K2212o2374j06811K00762N3811R1746q38
4508B151937l4557N3990p6428L7713j5095l6455J64779K2472M9r3222J11098J70878
4496B457159n7730J37169q2635N6562O4921p7741q5665J36070J19890P4407k7293
4485B715114K30496j1632N8912l3921J53483J90387j6103J88170J61007K10457
4475C846370K42954K92243L47724K98201M24490L40244N23390O50557O27672O52478
$$ plain form
4465 8246323 8957950 10033325 11577728 13618644 16532430 20804208 27034231 35026875
4457 35026875 42804931 48382560 49929366 48459377 46553076 45336669 45158401 45715157
4449 45715157 46762869 48767571 51674480 55973111 60220640 62536905 61249673 57547373
4441 57547373 54239322 52372022 52165644 53742806 56792028 60215528 62682108 63309870
4433 63309870 60622727 56080484 51912335 48701722 46708446 45483178 45185694 45661126
4425 45661126 47511868 50257520 52791794 53069067 50279366 45867366 41751971 38635639
4417 38635639 36165804 33966123 31286417 28114170 24738151 21408494 18561431 16057527
4409 16057527 13983278 12278838 10792564 9496194 8705391 8117574 7344567 6731367 6348804
$$ packed form
4465H246323P11627J075375J544403K040916K913786M271778O230023P992644
4457C5026875P778056N577629J546806j469989j906301j216407j78268N56756
4449D5715157J047712K004702K906909M298631M247529K316265j287232l702300
4441E7547373l308051j867300k06378J577162L049222L423500K466580O27762
4433F3309870k687143m542243m168149l210613j993276j225268k97484M75432
4425D5661126J850742K745652K534274K77273k789701m412000m115395l116332
4417C8635639k469835k199681k679706l172247l376019l329657k847063k503904
4409A6057527k074249j704440j486274j296370p90803n87817p73007o13200l82563
$$ plain form
4400 6348804 5823301 5529714 5264375 5008410 4800503 4753232 4550289 4266349 4120081 4032647
4390 4032647 3910021 3755184 3678273 3652371 3590507 3682420 3577028 3454588 3402855 3201028
4380 3201028 3219881 3232302 3315758 3429961 3708257 4325989 4858126 5196060 5241464 5096726
4370 5096726 4817317 4452801 4313702 4151495 3956773 3739899 3619152 3535970 3052889 2802471
4360 2802471 2762825 2571217 2491336 2504612 2327146 2112629 2026795 1969255 1945067 1830864 1825056
4349 1825056 1732853 1667603 1609062 1506408 1371834 1430017 1467832 1389825 1244812 1387869 1459792
4338 1459792 1592727 1568019 1571220 1418151 1355153 1339568 1254205 1229322 1296876 1337989 1174607
4327 1174607 1178226 1050707 986907 1214150 1016911 1130915 1236432 1335317 1467211 1429011
$$ packed form
4400F348804n25503k93587k65339k55965k07907m7271k02943k83940j46268q7434
4390D032647j22626j54837p6911k5902o1864R1913j05392j22440n1733k01827
4380C201028J8853J2421Q3456J14203K78296O17732N32137L37934M5404j44738
4370E096726k79409l64516j39099j62207j94722k16874j20747q3182m83081k50418
4360B802471l9646j91608p9881J3276j77466k14517q5834n7540k4188j14203n808
4349A825056r2203o5250n8541j02654j34574N8183L7815p8007j45013J43057P1923
4338A459792J32935k4708L201j53069o2998j5585q5363k4883O7554M1113j63382
4327A174607L619j27519o3800K27243j97239J14004J05517R8885J31894l8200
$$ plain form
4317 1429011 1568067 1579638 1603985 1445664 1487038 1639838 1725894 1850751 2009241 2241940
4307 2241940 2638293 3088467 3512356 3854958 4235389 4329735 4358240 4574594 4778021 4960582
4297 4960582 5070846 4728824 4428053 4016160 3651725 3458666 3258223 3034629 2747044 2510001
4287 2510001 2308369 2032544 2014815 1844436 1659022 1602989 1589546 1412466 1305583 1177405
4277 1177405 1143008 1134896 1222558 1046578 1048532 1111090 926314 924603 832003 971761 800600
4266 800600 834842 865559 763016 901629 877685 751359 855166 696326 691469 675203 721177
4255 721177 488709 475851 606590 455260 373728 398947 443987 404679 406691 392423 428455
4244 428455 448784 457339 495186 455235 452481 430606 456186 383794 407210 396518 284926 259694
$$ packed form
4317A429011J39056J1571K4347j58321M1374J52800Q6056J24857J58490K32699
4307B241940L96353M50174M23889L42602L80431R4346K8505K16354K03427J82561
4297D960582J10264l42022l00771m11893l64435j93059k00443k23594k87585k37043
4287B510001k01632k75825j7729j70379j85414n6033j3443j77080j06883j28178
4277A177405l4397q112Q7662j75980J954O2558j84776j711r2600J39758j71161
4266H00600L4242L0717j02543J38613k3944j26326J03807j58840m857j6266M5974
4255G21177k32468j2858J30739j51330q1532K5219M5040l9308K012j4268L6032
4244D28455K0329Q555L7847l9951k754k1875K5580p2392K3416j0692j11592k5232
$$ plain form
4232 259694 214181 485346 481730 447502 542167 561449 573810 410649 495953 446527 456255 618681
4220 618681 474283 572687 503467 360702 515736 491179 554013 525736 432262 643423 704509
4209 704509 778271 547373 680710 761260 660870 645830 354295 532932 631606 614212 501193
4198 501193 392940 506218 561984 597147 528317 426964 527366 456703 553689 454204 394882
4187 394882 369418 387811 408767 416468 503129 438762 524131 579142 595897 523514 632073 679458
4175 679458 652647 719654 658832 706817 579068 569831 605407 547874 636644 551588 646813 678504
4163 678504 639513 609758 652318 877472 701187 520002 548893 684736 789915 490895
4153 490895 510739 552234 537073 591676 536052 594368 503718 561289 523431 546424 691436
$$ packed form
4232B59694m5513K71165l616l4228R4665J9282J2361j63161Q5304m9426R728J62426
4220F18681j44398R8404o9220j42765J55034k4557O2834k8277r3474K11161O1086
4209G04509P3762k30898J33337Q0550j00390j5040k91535J78637R8674j7394j13019
4198E01193j08253J13278N5766L5163o8830j01353J00402p0663R6986r9485n9322
4187C94882k5464J8393K0956P701Q6661o4367Q5369N5011J6755p2383J08559M7385
4175F79458k6811O7007o0822M7985j27749r237L5576n7533Q8770q5056R5225L1691
4163F78504l8991k9755M2560K25154j76285j81185K8891J35843J05179k99020
4153D90895J9844M1495j5161N4603n5624N8316r0650N7571l7858K2993J45012
$$ plain form
4142 691436 579369 668525 721038 733622 721134 797883 802161 794281 855123 786798 746886 836948
4130 836948 738189 730714 741546 928423 907988 835891 751822 942419 921282 791451 764169
4119 764169 841782 964202 958452 878762 952661 849146 898731 801397 826525 763838 700296
4108 700296 738934 725970 953468 834065 834876 790170 836878 818784 762187 870764 909822
4097 909822 991856 961926 851094 904513 844971 944936 1088604 1051379 1005093 783922 837760
4086 837760 967867 954201 856656 750510 838452 873788 1014101 1004893 1136126 1011343 1120578
4075 1120578 1121977 1145338 1298421 1412354 1232554 1112794 1189914 1250353 1306595 1463597 1447044
4064 1447044 1465469 1595256 1732205 1793723 1748291 1759746 1676102 1699140 1811315 1775744 1814579
$$ packed form
4142F91436j12067Q9156N2513J2584j2488P6749M278p880O0842o8325l9912R0062
4130H36948r8759p475J0832J86877k0435p2097q4069J90597k1137j29831k7282
4119G64169P7613J22420n750p9690P3899j03515M9585r7334K5128o2687o3542
4108G00296L8638j2964K27498j19403Q11m4706M6708j8094n6597J08577L9058
4097I09822Q2034k9930j10832N3419n9542R9965J43668l7225m6286k21171N3838
4086H37760J30107j3666r7545j06146Q7942L5336J40313r208J31233j24783J09235
4075A120578J399K3361J53083J13933j79800j19760P7120O0439N6242J57002j6553
4064A447044J8425J29787J36949O1518m5432J1455q3644K3038J12175l5571L8835
$$ plain form
4053 1814579 1990347 1948858 1807992 1907187 2103530 2182642 2230048 2248532 2375887 2491967
4043 2491967 2463650 2616349 2697985 2779266 2811983 2928637 3070064 3285018 3525870 3738781
4033 3738781 3974836 4145238 4407611 4677676 5185036 5684906 6075593 6841927 7891555
4024 7891555 9180105 10843010 12842155 15213913 17464901 19185512 20253862 20496976
4016 20496976 20249636 19762340 18993583 18038336 17077499 15847439 14603266 13257039 11912581
4007 11912581 10599303 9348696 8294054 7399823 6689937 6033359 5441572 5044612 4636985
3998 4636985 4166631 3894699 3784478 3449737 3418581 3251424 3042605 3036725 2830286 2845484
3988 2845484 2650326 2640241 2617115 2343348 2371099 2362234 2546321 2438679 2239637 2164962 2074226
$$ packed form
4053A814579J75768m1489j40866R9195J96343P9112M7406J8484J27355J16080
4043B491967k8317J52699Q1636Q1281L2717J16654J41427K14954K40852K12911
4033C738781K36055J70402K62373K70065N07360M99870L90687P66334J049628
4024G891555J288550J662905J999145K371758K250988J720611J068350K43114
4016B0496976k47340m87296p68757r55247r60837j230060j244173j346227j344458
4007A1912581j313278j250607j054642q94231p09886o56578n91787l96960m07627
3998D636985m70354k71932j10221l34741l1156j67157k08819n880k06439J5198
3988B845484j95158j0085k3126k73767K7751q865J84087j07642j99042p4675r0736
$$ plain form
3977 2074226 2187776 2214645 2296956 2206538 2275960 2223165 2011444 1997182 1987434 2108536 2239669
3966 2239669 2011803 2028826 1908572 2003370 2112726 2083977 1818081 1701976 1841168 1834045
3956 1834045 1813133 1886960 1809669 1834477 1766907 1894850 1847562 1773572 1804269 1866143 1875541
3945 1875541 1847843 1935709 2001906 1948882 1931402 1983927 1842235 1939270 1973248 1874582 1998499
3934 1998499 1937734 1886829 1883794 1954077 2118834 2068205 2199317 2254663 2279962 2283406 2169843
3923 2169843 2402474 2279534 2275501 2355210 2332330 2464740 2579038 2577350 2444080 2495845 2624664
3912 2624664 2679475 2677365 2555329 2659831 2690770 2877044 3011744 2994703 3057915 2883334 2981280
3901 2981280 2946516 3147549 3189056 3174985 3142524 3129185 3313495 3202590 3442775 3432980 3450268
$$ packed form
3977B074226J13550K6869Q2311r0418O9422n2795k11721j4262r748J21102J31133
3966B239669k27866J7023j20254R4798J09356k8749k65896j16105J39192p123
3956A834045k0912P3827p7291K4808o7570J27943m7288p3990L0697O1874R398
3945A875541k7698Q7866O6197n3024j7480N2525j41692R7035L3978r8666J23917
3934A998499o0765n0905l035P0283J64757n0629J31112N5346K5299L444j13563
3923B169843K32631j22940m033P9709k2880J32410J14298j688j33270N1765J28819
3912B624664N4811k110j22036J04502L0939J86274J34700j7041O3212j74581R7946
3901B981280l4764K01033M1507j4071l2461j3339J84310j10905K40185r795J7288
$$ plain form
3890 3450268 3518452 3374770 3493567 3369031 3610225 3568992 3449473 3553729 3583468 3661029
3880 3661029 3591697 3619850 3734834 3722469 3713418 3565879 3566672 3687091 3635176 3576203 3583223 3684029
3868 3684029 3821879 3640807 3588756 3584064 3712740 3762931 3782822 3661803 3583083 3835277 3694000
3857 3694000 3530974 3635164 3620771 3658068 3664823 3570073 3684441 3714941 3732865 3726103 3749239
3846 3749239 3732244 3772655 3821288 3830217 3707488 3733245 3903902 3955725 3898255 3868776 3901933
3835 3901933 3861822 3980812 3893835 3917175 3954919 3870094 3886539 3885365 3879391 4026680 4101642
3824 4101642 4051982 4001673 4038703 4069524 4215891 4048744 3950616 3965143 3814008 3823276 3773581
3813 3773581 3853326 3785494 3660409 3731024 3823823 3871873 3779675 3820019 3734919 3875950 3795701
$$ packed form
3890C450268O8184j43682J18797j24536K41194m1233j19519J04256K9739P7561
3880C661029o9332K8153J14984j2365r051j47539P93J20419n1915n8973P020J00806
3868C684029J37850j81072n2051m692J28676N0191J9891j21019p8720K52194j41277
3857C694000j63026J04190j4393L7297O755r4750J14368L0500J7924o762K3136
3846C749239j6995M0411M8633Q929j22729K5757J70657N1823n7470k9479L3157
3835C901933m0111J18990q6977K3340L7744q4825J6445j174n974J47289P4962
3824D101642m9660n0309L7030L0821J46367j67147r8128J4527j51135R268m9695
3813C773581P9745o7832j25085P0615R2799M8050r2198M0344q5100J41031q0249
$$ plain form
3802 3795701 3726514 3852610 3775664 3732665 3688506 3717450 3721601 3713393 3830800 3694631 3744827
3791 3744827 3709438 3661098 3563161 3668428 3725377 3644431 3817954 3687301 3709895 3854821 3748526
3780 3748526 3805320 3739183 3647598 3757869 3611658 3543159 3502625 3654319 3837032 3851517 3764122
3769 3764122 3724007 3716580 3856366 3775121 3784243 3856867 4030828 3928070 3887411 3895494 3987487
3758 3987487 3936031 3836862 3968253 3904659 3877237 3957703 3953988 4103525 4018887 3984900 4074977
3747 4074977 4105202 4153450 4151021 4214605 4082388 4061105 4057440 4156323 4238287 4192593 4114415 4185776
3735 4185776 4439966 4407610 4404569 4286687 4404902 4412079 4218719 4397606 4412767 4533301 4479056
3724 4479056 4333226 4338777 4468239 4661276 4471362 4472245 4388286 4410616 4331704 4303223 4309028
$$ packed form
3802C795701o9187J26096p6946m2999m4159K8944M151q208J17407j36169N0196
3791C744827l5389m8340r7937J05267N6949q0946J73523j30653K2594J44926j06295
3780C748526N6794o6137r1585J10271j46211o8499m0534J51694J82713J4485q7395
3769C764122m0115p427J39786q1245R122P2624J73961j02758m0659Q083R1993
3758C987487n1456r9169J31391o3594k7422Q0466l715J49537q4638l3987R0077
3747D074977L0225M8248k429O3584j32217k1283l665R8883Q1964m5694p8178P1361
3735D185776K54190l2356l041j17882J18215P177j93360J78887J5161J20534n4245
3724D479056j45830N551J29462J93037j89914Q83q3959K2330p8912k8481N805
$$ plain form
3713 4309028 4322959 4255811 4201802 4396284 4458368 4429190 4515193 4484039 4545887 4480050 4419936
3702 4419936 4544273 4518709 4633229 4668652 4699240 4767963 4810920 4793800 4709519 4668417 4809911
3691 4809911 4758216 4728007 4642702 4621145 4799461 4686668 4667200 4798455 4724285 4624541 4699901
3680 4699901 4799164 4643572 4734543 4756498 4716901 4755962 4810643 4973365 4944136 4986242 4817535
3669 4817535 4828648 4971482 5066576 5029013 4911416 5004183 5068715 5045511 4984251 5094829 5051546
3658 5051546 5015658 5014899 4996364 4954104 4947529 4918217 4950398 5087720 5045088 5098656 5181639 4950987
3646 4950987 5107022 5102780 5230363 5255202 5133414 5218801 5230524 5254814 5281097 5389545 5258090
3635 5258090 5276592 5422568 5396161 5369311 5230601 5186085 5303565 5339910 5338312 5366970 5347870
$$ packed form
3713D309028J3931o7148n4009J94482O2084k9178Q6003l1154O1848o5837o0114
3702D419936J24337k5564J14520L5423L0588O8723M2957j7120q4281m1102J41494
3691D809911n1695l0209q5305k1557J78316j12793j9468J31255p4170r9744P5360
3680D699901R9263j55592R0971K1955l9597L9061N4681J62722k9229M2106j68707
3669D817535J1113J42834R5094l7563j17597R2767O4532k3204o1260J10578m3283
3658E051546l5888p59j8535m2260o575k9312L2181J37322m2632N3568Q2983k30652
3646D950987J56035m242J27583K4839j21788Q5387J1723K4290K6283J08448j31455
3635E258090J8502J45976k6407k6850j38710m4516J17480L6345j598K8658j9100
$$ plain form
3624 5347870 5361158 5275089 5333187 5410746 5391869 5457732 5512996 5552368 5532057 5544519 5550588 5708442
3612 5708442 5797367 5613197 5671453 5760903 5887192 5904794 5798986 5784152 5835051 6066185 6073972
3601 6073972 6103423 6095497 6066875 6339801 6346185 6368304 6487321 6415970 6635831 6656319 6647876
3590 6647876 6585115 6728236 6830362 6805383 6911248 7042002 7182717 7188069 7302971 7274604
3580 7274604 7426956 7416366 7511452 7555138 7598073 7680373 7781551 8059328 7913513 8067277
3570 8067277 8129109 8119445 8202338 8022692 8247879 8341065 8505264 8731820 8725418 8691655 8633824
3559 8633824 8806564 9094548 9185644 9183704 9202957 9292675 9301864 9486296 9547689 9781901 9822844
3548 9822844 9865216 10046262 10217455 10418934 10436097 10568943 10644368 10830554 10951200 11009479
$$ packed form
3624E347870J3288q6069N8098P7559j8877O5863N5264L9372k0311J2462O069J57854
3612E708442Q8925j84170N8256Q9450J26289J7602j05808j4834N0899K31134P787
3601F073972K9451p926k8622K72926O384K2119J19017p1351K19861K0488q443
3590F647876o2761J43121J02126k4979J05865J30754J40715N352J14902k8367
3580G274604J52352j0590R5086M3686M2935Q2300J01178K77777j45815J53764
3570H067277O1832r664Q2893j79646K25187R3186J64199K26556o402l3763n7831
3559H633824J72740K87984R1096j940J9253Q9718R189J84432O1393K34212M0943
3548I822844M2372J81046J71193K01479J7163J32846P5425J86186J20646N8279
$$ plain form
3538 11009479 11208435 11232077 11352569 11481325 11702724 11907505 12206665 12328329 12465822 12802265
3528 12802265 12921668 13351889 13602295 13766781 13942318 14155653 14226875 14618473 14898719 15030793
3518 15030793 15302570 15622858 15902849 16228887 16603583 16898794 17097502 17427716 17572870
3509 17572870 17962656 18169290 18375739 18615757 18936473 19220348 19463678 19893695 20226395
3500 20226395 20556004 20936835 21392651 21703462 21918684 22529857 23045358 23499636 23948292
3491 23948292 24501025 25157997 25687407 26315219 26794778 27371590 28100596 28843400 29569405
3482 29569405 30433907 31689667 32706856 34067370 35403396 36675975 38105300 39698696
3474 39698696 41579356 43586844 46142440 48901878 51996266 55301585 59018862 63178447
$$ packed form
3538A1009479J98956K3642J20492J28756K21399K04781K99160J21664J37493L36443
3528A2802265J19403M30221K50406J64486J75537K13335P1222L91598K80246J32074
3518A5030793K71777L20288K79991L26038L74696K95211J98708L30214J45154
3509A7572870L89786K06634K06449K40018L20716K83875K43330M30017L32700
3500B0226395L29609L80831M55816L10811K15222O11173N15501M54278M48656
3491B3948292N52733O56972N29410O27812M79559N76812P29006P42804P26005
3482B9569405Q64502J255760J017189J360514J336026J272579J429325J593396
3474C9698696J880660K007488K555596K759438L094388L305319L717277M159585
$$ plain form
3466 63178447 67987492 73244417 78841565 84484957 89687044 93583038 96133552 97699782
3458 97699782 98147212 97509435 96091728 93970424 91348722 88220048 84587848 80743716
3450 80743716 77027343 73462219 70054042 66856338 63604227 60590532 57811688 55212010
3442 55212010 53137924 51132257 49329740 47759394 46499954 45397085 44314118 43295227
3434 43295227 42214060 41343406 40590071 39781279 38939233 38126775 37138392 36434809 35782766
3425 35782766 35184516 34431705 33678719 32970174 32191515 31580657 30965840 30396410 29652286
3416 29652286 29006365 28470568 27786434 27211520 26595775 26028608 25416964 24918437 24588961
3407 24588961 24145874 24046991 23733808 23435654 23097569 22621034 22172410 21691186 21375882 20890168
$$ packed form
3466F3178447M809045N256925N597148N643392N202087L895994K550514J566230
3458I7699782M47430o37777j417707k121304k621702l128674l632200l844132
3450H0743716l716373l565124l408177l197704l252111l013695k778844k599678
3442E5212010k074086k005667j802517j570346j259440j102869j082967j018891
3434D3295227j081167q70654p53335q08792q42046q12458r88383p03583o52043
3425C5782766n98250p52811p52986p08545p78659o10858o14817n69430p44124
3416B9652286o45921n35797o84134n74914o15745n67167o11644m98527l29476
3407B4588961m43087r8883l13183k98154l38085m76535m48624m81224l15304m85714
$$ plain form
3397 20890168 20373407 20064888 19764594 19346899 18939721 18588922 18242971 18053424 17604109
3388 17604109 17408350 17219916 16949508 16739503 16473482 16228154 15911821 15848831 15809950 15545127
3378 15545127 15514028 15224255 15125928 14881912 14682889 14592643 14438732 14397016 14182353 13948680
3368 13948680 13790315 13782006 13629498 13547664 13547991 13232188 13151433 13152956 12956447 12975817 12880160
3357 12880160 12700065 12613080 12574700 12474387 12264983 12153657 12121520 12013007 11980803 11853183
3347 11853183 11946887 11918040 11847639 11787001 11450795 11419179 11419760 11280679 11125986 10988168 10911981
3336 10911981 10796110 10702923 10576123 10607878 10489156 10392857 10444743 10427945 10293134 10159572
3326 10159572 10083162 9911024 9889839 9732304 9679280 9600215 9519258 9443178 9415619 9473368 9317219
$$ packed form
3397B0890168n16761l08519l00294m17695m07178l50799l45951j89547m49315
3388A7604109j95759j88434k70408k10005k66021k45328l16333o2990l8881k64823
3378A5545127l1099k89773r8327k44016j99023r0246j53911m1716k14663k33673
3368A3948680j58365q309j52508q1834L27l15803q0755J523j96509J9370r5657
3357A2880160j80095q6985l8380j00313k09404j11326l2137j08513l2204j27620
3347A1853183R3704k8847p0401o0638l36206l1616N81j39081j54693j37818p6187
3336A0911981j15871r3187j26800L1755j18722r6299N1886j6798j34811j33562
3326A0159572p6410j72138k1185j57535n3024p9065q0957p6080k7559N7749j56149
$$ plain form
3315 9317219 9249340 9356943 9304339 9156190 9109844 8899059 8825334 8819501 8945086 8878922 8950383
3304 8950383 8832703 8803889 8560048 8588358 8627592 8577276 8655025 8685500 8592927 8461687 8523282
3293 8523282 8536733 8596448 8532319 8363411 8386573 8377075 8334508 8217626 8107517 8113403 8010718
3282 8010718 7956563 8081020 8076363 7897047 7935656 7819890 7693745 7714487 7655124 7633747 7613134
3271 7613134 7564095 7538343 7505400 7524162 7415345 7314758 7283459 7220442 7146101 7114555 7142517
3260 7142517 7144899 6976679 6836134 6736040 6725420 6662285 6512032 6433050 6349221 6217337 6269215
3249 6269215 6268308 6118119 5958148 5918039 5864746 5626359 5558962 5715315 5619776 5511693 5432607
3238 5432607 5414645 5640695 5514349 5405542 5520543 5655196 5610320 5503756 5590299 5462496
$$ packed form
3315I317219o7879J07603n2604j48149m6346k10785p3725n833J25585o6164P1461
3304H950383j17680k8814k43841K8310L9234n0316P7749L0475r2573j31240O1595
3293H523282J3451N9715o4129j68908K3162r498m2567j16882j10109N886j02685
3282H010718n4155J24457m657j79316L8609j15766j26145K0742n9363k1377k0613
3271G613134m9039k5752l2943J8762j08817j00587l1299o3017p4341l1546K7962
3260G142517K382j68220j40545j00094j0620o3135j50253p8982q3829j31884N1878
3249F269215r07j50189j59971m0109n3293k38387o7397J56353r5539j08083p9086
3238E432607j7962K26050j26346j08807J15001J34653m4876j06564Q6543j27803
$$ plain form
3228 5462496 5583047 5654801 5639354 5735706 5753043 5720579 5683159 5679229 5719841 5631161 5851258
3217 5851258 5855992 5698223 5853239 5980944 5966521 6035299 6115261 6105506 6106735 6084754 6259666
3206 6259666 6240023 6400351 6504824 6530535 6537008 6484635 6597823 6679875 6782911 6849547 7017962
3195 7017962 7214583 7359864 7574192 7422038 7564779 7684333 7615553 7759351 7825776 7909575
3185 7909575 7874248 7930963 7970807 7866888 7852376 7880975 7831912 8008664 8185134 8257363 8274346
3174 8274346 8450424 8589983 8735018 8886828 8891269 8996538 9158512 9392073 9520101 9855174
3164 9855174 10312056 10465222 10660114 10998288 11389820 11833184 12138767 12283550 12646017 13129979
3154 13129979 13708047 14137763 14575471 14984665 15309038 15805489 16358375 16835029 17022779
$$ packed form
3228E462496J20551P1754j5447R6352J7337l2464l7420l930M0612q8680K20097
3217E851258M734j57769J55016J27705j4423O8778P9962r755J229k1981J74912
3206F259666j9643J60328J04473K5711O473n2373J13188Q2052J03036O6636J68415
3195G017962J96621J45281K14328j52154J42741J19554o8780J43798O6425Q3799
3185G909575l5327N6715L9844j03919j4512K8599m9063J76752J76470P2229J6983
3174H274346J76078J39559J45035J51810M441J05269J61974K33561J28028L35073
3164I855174M56882J53166J94892L38174L91532M43364L05583J44783L62467M83962
3154A3129979N78068M29716M37708M09194L24373M96451N52886M76654J87750
$$ plain form
3145 17022779 17315666 17558478 17768824 18016885 18006669 18284617 18631703 18722581 18986979 19246695
3135 19246695 19512723 19824187 20204514 20629751 21203936 21971575 22702614 23533158 24663027
3126 24663027 25776800 27178931 28501164 30210450 31880209 33358990 34775735 35513536
3118 35513536 35951114 36126904 36004340 35557472 34821487 34100269 33360059 32522266 31757102
3109 31757102 31135141 30686662 30109969 29761704 29586293 29739737 30054314 30503757 31129796
3100 31129796 31632456 32342214 33294349 34289033 35395228 36518360 37538852 38606368 39258681
3091 39258681 39631994 39631231 39399461 39088834 38274814 37426654 36384451 35203615 33834838
3082 33834838 32703818 31641508 30536310 29605646 28654622 28028870 27463379 26960311 26766417
$$ packed form
3145A7022779K92887K42812K10346K48061j0216K77948L47086R0878K64398K59716
3135A9246695K66028L11464L80327M25237N74185P67639P31039Q30544J129869
3126B4663027J113773J402131J322233J709286J669759J478781J416745P37801
3118C5513536M37578J75790j22564m46868p35985p21218p40210q37793p65164
3109C1757102o21961m48479n76693l48265j75411J53444L14577M49443O26039
3100C1129796N02660P09758R52135R94684J106195J123132J020492J067516O52313
3091C9258681L73313p63k31770l10627q14020q48160j042203j180836j368777
3082C3834838j131020j062310j105198r30664r51024o25752n65491n03068j93894
$$ plain form
3073 26766417 26612697 26695333 26713019 26702088 26696048 26644233 26496945 26367841 25982577 25452062
3063 25452062 24932813 24271794 23429015 22492645 21491990 20761334 20029009 19151033 18113036
3054 18113036 17309198 16589770 15769164 15145664 14475273 13992800 13405820 13072613 12507884
3045 12507884 12116322 11939774 11713076 11376660 11196280 10913274 10499414 10350108 10046921
3036 10046921 9715846 9477792 9203025 8894287 8700979 8489636 8133737 7977964 7707106
3027 7707106 7491884 7301056 7063462 6878863 6603446 6435852 6218110 6065166 5862954 5752235
3017 5752235 5620664 5446445 5441697 5333579 5329872 5195438 4997165 4841620 4856319 4874488 4685822
3006 4685822 4613643 4621636 4691542 4633094 4642364 4834499 4805017 4537160 4453902 4363340 4185583
$$ packed form
3073B6766417j53720Q2636J7686j0931o040n1815j47288j29104l85264n30515
3063B5452062n19249o61019q42779r36370j000655p30656p32325q77976j037997
3054A8113036q03838p19428q20606o23500o70391m82473n86980l33207n64729
3045A2507884l91562j76548k26698l36416j80380k83006m13860j49306l03187
3036A0046921l31075k38054k74767l08738j93308k11343l55899j55773k70858
3027G707106k15222j90828k37594j84599k75417j67594k17742j52944k02212j10719
3017E752235j31571j74219m748j08118l707j34434j98273j55545J4699J8169j88666
3006D685822p2179P993O9906n8448R270J92135k9482k67857q3258r0562j77757
$$ plain form
2995 4185583 4254529 4137295 4067800 4028638 3921617 3868922 3771755 3735265 3607930 3542695 3627352
2984 3627352 3638471 3580488 3418181 3360847 3266169 3174377 3073202 3038305 3012078 2960047 3036142
2973 3036142 3110065 2925331 2814248 2703325 2707988 2575437 2453222 2534522 2587153 2525868 2535748
2962 2535748 2428127 2340327 2328664 2261882 2210012 2233362 2094817 2001827 1909046 1780614 1800891
2951 1800891 1840742 1816026 1727330 1762571 1622817 1708009 1846252 1786122 1471608 1439048 1386327
2940 1386327 1472175 1466154 1468010 1514417 1483859 1471529 1571345 1582165 1538190 1472464 1470952 1420537
2928 1420537 1371011 1317184 1273275 1284103 1398443 1439252 1438764 1339203 1410355 1276499 1167403
2917 1167403 1210249 1107316 1294515 1243686 1181237 1236307 1222214 1212164 989000 974452 1127450
$$ packed form
2995D185583O8946j17234o9495l9162j07021n2695r7167l6490j27335o5235Q4657
2984C627352J1119n7983j62307n7334r4678r1792j01175l4897k6227n2031P6095
2973C036142P3923j84734j11083j10923M663j32551j22215Q1300N2631o1285R880
2962B535748j07621q7800j1663o6782n1870K3350j38545r2990r2781j28432K0277
2951A800891L9851k4716q8696L5241j39754Q5192J38243o0130l14514l2560n2721
2940A386327Q5848o021J856M6407l0558j2330R9816J0820m3975o5726j512n0415
2928A420537m9526n3827m3909J0828J14340M0809m88r9561P1152j33856j09096
2917A167403M2846j02933J87199n0829o2449N5070j4093j0050k23164j4548J52998
$$ plain form
2906 1127450 1232925 1194462 980657 1096366 1113314 1051754 1039966 1077841 1059937 981867 949340
2895 949340 912631 856328 907340 998876 977983 972470 966983 980177 839539 866595 762471 781029
2883 781029 948086 901514 909244 818264 825006 1153922 1041840 1035094 909651 907345 949031 822768
2871 822768 822412 656461 708001 805354 829624 896394 891163 856243 803896 645412 835099 859423
2859 859423 753505 751987 649490 755361 725392 712927 680969 684053 794643 650236 794196
2848 794196 780374 717927 737571 726748 917310 874799 752915 678544 625432 824360 693761
2837 693761 641404 626943 611828 625837 722653 768163 720228 636063 704644 754624 833202 799170
2825 799170 809906 710375 663709 624086 702477 794979 568923 518779 679352 740568 762427
$$ packed form
2906A127450J05475l8463k13805J15709J6948o1560j1788L7875j7904p8070l2527
2895I49340l6709n6303N1012R1536k0893n513n487J3194j40638K7056j04124J8558
2883G81029J67057m6572P730r0980O742L28916j12082o746j25443k306M1686j26263
2871H22768l56j65951N1540R7353K4270O6770n231l4920n2347j58484J89687K4324
2859H59423j05918j518j02497J05871k9969j2465l1958L084J10590j44407J43960
2848G94196j3822o2447J9644j0823J90562m2511j21884p4371n3112J98928j30599
2837F93761n2357j4461j5115J4009R6816M5510m7935q4165O8581M9980P8578l4032
2825G99170J0736r9531m6666l9623P8391R2502k26056n0144J60573O1216K1859
$$ plain form
2814 762427 808076 743705 811589 812031 811766 737035 711406 769189 600387 595543 711231 739229
2802 739229 828662 797600 702490 547882 634750 613928 636302 783307 798942 807050 805314 795695
2790 795695 595340 613055 698748 581521 534795 493850 594674 763113 712371 710427 736995
2779 736995 637458 543826 667968 688988 716303 736004 675625 750330 695128 523675 629073
2768 629073 514472 376598 302982 379418 553686 580970 598042 549546 488881 428302 369278
2757 369278 374260 370373 353312 389543 422215 408258 377834 271732 253360 233051 283343 231935
2745 231935 312318 366562 288734 337559 297871 234931 356440 374812 156060 227088 316683
2734 316683 353301 321405 367691 430248 458284 415001 323187 286897 254903 223725 217863 330606
$$ packed form
2814G62427M5649o4371O7884M42k65p4731k5629N7783j68802m844J15688K7998
2802G39229Q9433l1062r5110j54608Q6868k0822K2374J47005J5635Q108j736r619
2790G95695k00355J7715Q5693j17227m6726m0945J00824J68439n0742j944K6568
2779G36995r9537r3632J24142K1020K7315J9701o0379P4705n5202j71453J05398
2768F29073j14601j37874p3616P6436J74268K7284J7072m8496o0665o0579n9024
2757C69278M982l887j7061L6231L2672j3957l0424j06102j8372k0309N0292n1408
2745B31935Q0383N4244p7828M8825l9688o2940J21509J8372k18752P1028Q9595
2734C16683L6618l1896M6286O2557K8036m3283r1814l6290l1994l1178n862J12743
$$ plain form
2722 330606 385406 333779 259193 312414 452876 447682 498890 504403 585482 514307 601035 479699
2710 479699 522189 526468 317576 330544 415486 456720 539201 427701 453605 450278 391509 367978
2698 367978 451646 391964 397459 476389 504605 400431 530766 490848 341177 202590 286300
2687 286300 441495 402495 251506 259461 265421 300709 422765 405411 348995 264325 360924
2676 360924 312095 180614 252422 404190 388840 380757 313886 438885 371523 211216 271336
2665 271336 372530 361669 292722 294157 342593 241050 381111 390210 378471 434848 362159
2654 362159 308127 380759 441802 571431 540091 580815 625300 468964 437216 383855 414075
2643 414075 457474 375221 372167 290355 282309 278287 300786 290969 218033 223151 183549 115938 182997
$$ packed form
2722C30606N4800n1627p4586N3221J40462n194N1208N513Q1079p1175Q6728j21336
2710D79699M2490M279k08892J2968Q4942M1234Q2481j11500K5904l327n8769k3531
2698C67978Q3668n9682N495P8930K8216j04174J30335l9918j49671j38587Q3710
2687B86300J55195l9000j50989P955N960L5288J22056j7354n6416q4670R6599
2676C60924m8829j31481P1808J51768j5350q083o6871J24999o7362j60307O0120
2665B71336J01194j0861o8947J435M8436j01543J40061R099j1739N6377p2689
2654C62159n4032P2632O1043J29629l1340M0724M4485j56336l1748n3361L0220
2643D14075M3399q2253l054q1812q046m022K2499r817p2936N118l9602o7611O7059
$$ plain form
2630 182997 138786 188191 151273 162039 105971 28751 5725 -80414 -43576 -53453 -50795 -84387
2618 -84387 -221582 -57442 -127490 -114343 -43467 -93104 -77262 87976 80413 -16547 126303
2607 126303 227300 244578 -4028 11145 70982 104845 38585 108445 162263 135529 237097
2596 237097 246461 314017 381917 275660 494961 645757 872233 801387 869213 945282 699857
2585 699857 670472 607861 745102 613030 520622 538842 286251 299054 425113 403170 442334
2574 442334 282639 230172 252320 253788 182235 213643 148989 80831 65970 109760 232060
2563 232060 141374 220268 189446 178193 197526 205358 67369 93551 109424 5570 160439
2552 160439 102785 100045 36737 -70331 24205 140439 246855 149168 -15376 -11725 -169872
$$ packed form
2630A82997m4211M9405l6918J0766n6068p7220k3026q6139L6838r877K658l3592
2618h4387j37195J64140p0048J3147P0876m9637J5842J65238p563r6960J42850
2607A26303J00997J7278k48606J5173N9837L3863o6260O9860N3818k6734J01568
2596B37097R364O7556O7900j06257K19301J50796K26476p0846O7826P6069k45425
2585F99857k9385o2611J37241j32072r2408J8220k52591J2803J26059k1943L9164
2574D42334j59695n2467K2148J468p1553L1408o4654o8158j4861M3790J22300
2563B32060r0686P8894l0822j1253J9333P832j37989K6182J5873j03854J54869
2552A60439n7654k740o3308j07068R4536J16234J06416r7687j64544L651j58147
$$ plain form
2541 -169872 -7067 -59303 -36226 -76924 -117332 -234744 -195668 25325 -91284 -73569 39326
2530 39326 -44689 -69164 -28853 1678 29741 -30429 120177 31176 6970 -15293 136883
2519 136883 37224 -1771 137794 -118737 -116899 -158420 -57140 47316 -15911 -104495 2798
2508 2798 84505 49810 -39217 -117556 -20240 55615 41305 53108 140861 121589 286843 265736
2496 265736 300324 108640 207524 281790 283598 344285 278600 283796 412501 462136 395461 355150
2484 355150 170598 76672 175525 209722 225280 354392 338010 201105 164320 198620 133770
2473 133770 122766 127050 124729 224755 248573 48002 18088 105214 24858 -28320 -111073 -39345
2461 -39345 17598 79646 127422 191608 193977 147816 194907 229222 204218 341011 257911 262091
$$ packed form
2541a69872J62805n2236K3077m0698m0408j17412L9076K20993j16609J7715J12895
2530C9326q4015k4475M0311L0531K8063o0170J50606q9001k4206k2263J52176
2519A36883r9659l8995J39565k56531J838m1521J01280J04456o3227q8584J07293
2508B798Q1707l4695q9027p8339R7316P5855j4310J1803Q7753j9272J65254k1107
2496B65736L4588j91684R8884P4266J808O0687o5685N196J28705M9635o6675m0311
2484C55150j84552r3926R8853L4197J5558J29112j6382j36905l6785L4300o4850
2473A33770j1004M284k321J00026K3818k00571k9914Q7126q0356n3178q2753P1728
2461c9345N6943O2048M7776O4186K369m6161M7091L4315k5004J36793q3100M180
$$ plain form
2449 262091 303565 294786 217360 132261 240214 377539 559980 548395 485001 632452 485939
2438 485939 457352 479964 523828 637901 501589 507455 572113 669125 711801 605828 512977
2427 512977 480142 681792 627139 526825 492682 618522 865798 813252 669958 654815 744378
2416 744378 963867 732296 705402 679192 628342 751739 669848 673465 762642 895674 758297
2405 758297 720388 634363 620958 584784 659210 757478 843630 865523 829867 958587 1117555
2394 1117555 1066257 1009723 1097000 1018186 921557 948858 903410 1048987 1232818 1254196 1073992
2383 1073992 1311342 1290713 1329154 1308764 1227224 1203521 1160338 1160775 1281237 1403199 1579249
2372 1579249 1603891 1459547 1446090 1651738 1475535 1559833 1570935 1749057 1748473 1802416 1943332
$$ packed form
2449B62091M1474q779p7426q5099J07953J37325J82441j1585o3394J47451j46513
2438D85939k8587K2612M3864J14073j36312N866O4658R7012M2676j05973r2851
2427E12977l2835K01650n4653j00314l4143J25840K47276n2546j43294j5143Q9563
2416G44378K19489k31571k6894k6210n0850J23397q1891L617Q9177J33032j37377
2405G58297l7909q6025j3405l6174P4426R8268Q6152K1893l5656J28720J58968
2394A117555n1298n6534Q7277p8814r6629K7301m5448J45577J83831K1378j80204
2383A073992K37350k0629L8441k0390q1540k3703m3183M37J20462J21962J76050
2372A579249K4642j44344j3457K05648j76203Q4298J1102J78122n84N3943J40916
$$ plain form
2361 1943332 1855691 2004645 2066017 2205491 2341266 2417590 2655180 2703315 2924728 3056851
2351 3056851 3397905 3495480 3608200 3834693 4161239 4515801 4848453 5193636 5796633 6382493
2341 6382493 7309178 8314461 9740994 10832008 11955226 12456207 13079396 13992434 15321800
2332 15321800 16867972 19073628 21757630 25577420 31095631 41193377 58439240 85611876
2324 85611876 114787104 138508788 146353782 129865000 116775375 109796185 104790944 100015484
2316 100015484 96511320 88968778 75686726 63787177 54025552 45997657 39394737 33669892
2308 33669892 28749111 24733418 20946606 18360834 16348000 14550110 12928322 11550730
2300 11550730 10328770 9260923 8086632 7294286 6708225 6205055 5696893 5352129 5086244
$$ packed form
2361A943332q7641J48954O1372J39474J35775P6324K37590M8135K21413J32123
2351C056851L41054R7575J12720K26493L26546L54562L32652L45183O02997N85860
2341F382493R26685J005283J426533J091014J123218N00981O23189R13038J329366
2332A5321800J546172K205656K684002L819790N518211J0097746J7245863K7172636
2324H5611876K9175228K3721684P844994j6488782j3089625o979190n005241m775460
2316A00015484l504164p542542j3282052j1899549r761625q027895o602920n724845
2308C3669892m920781m015693l786812k585772k012834j797890j621788j377592
2300A1550730j221960j067847j174291p92346n86061n03170n08162l44764k65885
$$ plain form
2291 5086244 4801977 4537839 4387827 4100673 4026616 3810987 3685579 3494619 3354917 3210226
2281 3210226 2960481 2738026 2678914 2719999 2591177 2495489 2483362 2230442 2162915 1928468
2271 1928468 1887341 1807841 1769859 1816897 1740316 1677416 1567576 1630050 1623994 1308594 1362346
2260 1362346 1324303 1295980 1156164 1110464 1132121 1225572 1141351 962772 832335 905703 862365
2249 862365 847836 883391 856625 687221 720776 708376 732765 664820 713027 608103 582532
2238 582532 594732 509862 567893 581271 644618 558699 545820 789464 703086 472610 379858
2227 379858 325431 513688 589399 501663 436033 308873 362256 501817 425380 310995 199244
2216 199244 278785 403735 282684 225517 248779 274364 245358 186797 331761 233854 251699
$$ packed form
2291E086244k84267k64138j50012k87154p4057k15629j25408j90960j39702j44691
2281C210226k49745k22455n9112M1085j28822r5688j2127k52920o7527k34447
2271A928468m1127p9500l7982M7038p6581o2900j09840O2474o056l15400N3752
2260A362346l8043k8323j39816m5700K1657R3451q4221j78579j30437P3368m3338
2249H62365j4529L5555k6766j69404L3555j2400K4389o7945M8207j04924k5571
2238E82532J2200q4870N8031J3378O3347q5919j2879K43644q6378k30476r2752
2227C79858n4427J88257P5711q7736o5630j27160N3383J39561p6437j14385j11751
2216A99244P9541J24950j21051n7167K3262K5585k9006n8561J44964r7907J7845
$$ plain form
2205 251699 308918 349563 458136 613055 494314 442545 297109 397992 382542 303925 392045
2194 392045 342476 322234 223681 309042 203440 302117 238790 198285 256252 255238 391738
2183 391738 347401 300754 205750 63682 83790 243791 264385 182739 133413 -12340 12168
2172 12168 272970 294371 241420 129306 308728 140569 83173 191843 206705 291149 154134
2161 154134 159884 221891 147439 182274 283267 171851 13501 84801 127954 214626 26788
2150 26788 -2774 176955 147031 109121 11826 48949 29615 158944 211063 120098 183246
2139 183246 171648 167760 25465 11109 -44716 -58960 115748 9060 118157 -54785 30774
2128 30774 54235 6489 218972 149800 142055 67520 142930 128408 109421 87597 191945 169805
$$ packed form
2205B51699N7219M0645J08573J54919j18741n1769j45436J00883j5450p8617Q8120
2194C92045m9569k0242r8553Q5361j05602R8677o3327m0505N7967j014J36500
2183C91738m4337m6647r5004j42068K0108J60001K0594q1646m9326j45753K4508
2172A2168K60802K1401n2951j12114J79422j68159n7396J08670J4862Q4444j37015
2161A54134N750O2007p4452L4835J00993j11416j58350P1300M3153Q6672j87838
2150B6788k9562J79729k9924l7910r7295L7123j9334J29329N2119r0965O3148
2139A83246j1598l888j42295j4356n5825j4244J74708j06688J09097j72942Q5559
2128C0774K3461m7746K12483o9172p745p4535P5410j4522j8987k1824J04348k2140
$$ plain form
2116 169805 99322 158604 159399 72659 130415 186124 13169 30089 47203 163491 125322 -22899
2104 -22899 36102 -136439 -3106 129168 118473 209646 46306 174596 131608 56277 163607
2093 163607 107046 56244 29400 88880 101663 25726 124814 122297 146087 127753 145885 114339
2081 114339 40958 40389 200663 127760 8942 35836 167505 219996 168587 201283 52844
2070 52844 107845 185141 84821 231278 298021 392433 286677 263820 287072 154187 295337
2059 295337 252727 294423 291251 537877 704056 620814 818971 821439 783133 730957 707757
2048 707757 732549 574420 559087 601317 564630 460264 430577 393409 313189 261603 239495
2037 239495 130412 75438 40002 -11597 29231 -124989 -225293 -247133 -285649 -193273 -195010
$$ packed form
2116A69805p0483N9282P95q6740N7756N5709j72955J6920J7114J16288l8169j48221
2104b2899N9001j72541J33333J32274j0695R1173j63340J28290m2988p5331J07330
2093A63607n6561n0802k6844N9480J2783p5937R9088k517K3790j8334J8132l1546
2081A14339p3381n69J60274p2903j18818K6894J31669N2491n1409L2696j48439
2070E2844N5001P7296j00320J46457O6743R4412j05756k2857K3252j32885J41150
2059B95337m2610M1696l172K46626J66179q3242J98157K468l8306n2176k3200
2048G07757K4792j58129j5333M2230l6687j04366k9687l7168q0220n1586k2108
2037B39495j09083n4974l5436n1599M0828j54220j00304k1840l8516R2376j737
$$ plain form
2026 -195010 -81541 -215806 -268577 -272422 -223031 -62706 -130953 -139961 -48799 -78047 -30418
2015 -30418 -372 -63630 6499 -83257 -146561 -160822 -130662 -54501 -914 -63487 -195040 -189642
$$ packed form
2026a95010J13469j34265n2771l845M9391J60325o8247r008R1162k9248M7629
2015c0418L0046o3258P0129q9756o3304j4261L0160P6161N3587o2573j31553N398
$$ [...]
##END NTUPLES=NMR SPECTRUM
##END=
