##TITLE=1H_DE-80H_X3
 200.13MHz, d2o
 8 sc
 
 19ns.26.2.2025
##JCAMPDX= 6.0         $$ Bruker NMR JCAMP-DX V2.0
##DATA TYPE= NMR SPECTRUM
##DATA CLASS= NTUPLES
##ORIGIN= UXNMR, Bruker Analytische Messtechnik GmbH
##OWNER= pz
$$ XWIN-NMR		Version 3.5
$$ Wed Dec 24 10:45:03 2025 Russian Standard Time (UT+4h)  Yarkov@DPX200
##.OBSERVE FREQUENCY= 200.1313
##.OBSERVE NUCLEUS= ^1H
##.ACQUISITION MODE= SIMULTANEOUS
##.ACQUISITION SCHEME= undefined
##.AVERAGES= 8
##.DIGITISER RES= 18
##SPECTROMETER/DATA SYSTEM= spect
##.PULSE SEQUENCE= zg30
##.SOLVENT NAME= CDCl3
##.SHIFT REFERENCE= (INTERNAL, CDCl3, 0, 15.4803)
##AUDIT TRAIL= $$ (NUMBER, WHEN, WHO, WHERE, WHAT)
$$ ##TITLE= Audit trail, XWIN-NMR		Version 3.5
$$ ##JCAMPDX= 5.01
$$ ##ORIGIN= Bruker BioSpin GmbH
$$ ##OWNER= Yarkov
$$ C:/Bruker/XWIN-NMR/data/yarkov2/nmr/H-C/1/pdata/1/auditp.txt
$$ ##AUDIT TRAIL=  $$ (NUMBER, WHEN, WHO, WHERE, WHAT)
(   1,<2025-12-24 10:44:07.81 +0400>,<Yarkov>,<DPX200>,
      <created by zg, POWCHK disabled, PULCHK disabled
       configuration hash MD5:
       00 E9 B6 7A A2 85 ED C7 34 08 36 98 17 FE 4E 26
       data hash MD5: 16K
       59 30 23 01 46 C5 14 DB 46 AB 83 57 0F 16 7C A6>)
(   2,<2025-12-24 10:44:13.95 +0400>,<Yarkov>,<DPX200>,
      <Start of raw data processing
       efp BC_mod = 2 LB = 0.25 FT_mod = 6 PKNL = 1 PHC0 = -5299.955 PHC1 = 10.82193 SI = 16K 
       data hash MD5: 16K
       5F BC 0F 28 EF 9B 23 E1 BC 9B DE E1 54 37 F3 DE>)
$$ ##END=
$$ 
$$ hash MD5
$$ F9 45 3E 1F 93 BD 07 A3 B8 47 BC D2 1F AB B8 1B
##$RELAX= 
##$RELAX= 
##$RELAX= 
##$RELAX= 
##$RELAX= 
##$RELAX= 
$$ Bruker specific parameters
$$ --------------------------
##$DU= <C:/Bruker/XWIN-NMR>
##$EXPNO= 1
##$NAME= <H-C>
##$PROCNO= 1
##$TYPE= <nmr>
##$USER= <yarkov2>
##$AMP= (0..31)
100 100 100 100 100 100 100 100 100 100 100 100 100 100 100 100 100 100 
100 100 100 100 100 100 100 100 100 100 100 100 100 100 
##$AQSEQ= 0
##$AQ_mod= 1
##$AUNM= <au_zg>
##$AUTOPOS= <>
##$BF1= 200.13
##$BF2= 200.13
##$BF3= 200.13
##$BF4= 200.13
##$BF5= 200.13
##$BF6= 200.13
##$BF7= 200.13
##$BF8= 200.13
##$BYTORDA= 1
##$CFDGTYP= 0
##$CFRGTYP= 5
##$CHEMSTR= <none>
##$CNST= (0..31)
1 1 145 1 1 1 1 1 1 1 1 1 1 1 1 1 1 1 1 1 1 1 1 1 1 1 1 1 1 1 1 1 
##$CPDPRG= <>
##$CPDPRG1= <>
##$CPDPRG2= <>
##$CPDPRG3= <>
##$CPDPRG4= <mlev>
##$CPDPRG5= <mlev>
##$CPDPRG6= <mlev>
##$CPDPRG7= <mlev>
##$CPDPRG8= <mlev>
##$CPDPRGB= <>
##$CPDPRGT= <>
##$D= (0..31)
0 0.7 0 0 0 0 0 0 0 0 0 0.03 0 0 0 0 0 0 0 0 0 0 0 0 0 0 0 0 0 0 0 0 
##$DATE= 1766558647
##$DBL= (0..7)
120 120 120 120 120 120 120 120 
##$DBP= (0..7)
150 150 150 150 150 150 150 150 
##$DBP07= 0
##$DBPNAM0= <>
##$DBPNAM1= <>
##$DBPNAM2= <>
##$DBPNAM3= <>
##$DBPNAM4= <>
##$DBPNAM5= <>
##$DBPNAM6= <>
##$DBPNAM7= <>
##$DBPOAL= (0..7)
0.5 0.5 0.5 0.5 0.5 0.5 0.5 0.5 
##$DBPOFFS= (0..7)
0 0 0 0 0 0 0 0 
##$DE= 6
##$DECBNUC= <off>
##$DECIM= 32
##$DECNUC= <off>
##$DECSTAT= 4
##$DIGMOD= 1
##$DIGTYP= 9
##$DL= (0..7)
0 120 120 120 120 120 120 120 
##$DP= (0..7)
$$ [...]
##$SUBNAM2= <"">
##$SUBNAM3= <"">
##$SUBNAM4= <"">
##$SUBNAM5= <"">
##$SUBNAM6= <"">
##$SUBNAM7= <"">
##$SUBNAM8= <"">
##$SUBNAM9= <"">
##$SW= 18.0517328524113
##$SWIBOX= (0..15)
0 0 2 0 0 0 0 0 0 0 0 0 0 0 0 0 
##$SW_h= 3612.71676300578
##$TD= 16384
##$TD0= 1
##$TE= 0
##$TE2= 300
##$TE3= 300
##$TEG= 300
##$TL= (0..7)
0 120 120 120 120 120 120 120 
##$TP= (0..7)
150 150 150 150 150 150 150 150 
##$TP07= 0
##$TPNAME0= <>
##$TPNAME1= <>
##$TPNAME2= <>
##$TPNAME3= <>
##$TPNAME4= <>
##$TPNAME5= <>
##$TPNAME6= <>
##$TPNAME7= <>
##$TPOAL= (0..7)
0.5 0.5 0.5 0.5 0.5 0.5 0.5 0.5 
##$TPOFFS= (0..7)
0 0 0 0 0 0 0 0 
##$TUNHIN= 0
##$TUNHOUT= 0
##$TUNXOUT= 0
##$USERA1= <user>
##$USERA2= <user>
##$USERA3= <user>
##$USERA4= <user>
##$USERA5= <user>
##$V9= 5
##$VALIST= <valist>
##$VCLIST= <CCCCCCCCCCCCCCC>
##$VD= 0
##$VDLIST= <DDDDDDDDDDDDDDD>
##$VPLIST= <PPPPPPPPPPPPPPP>
##$VTLIST= <TTTTTTTTTTTTTTT>
##$WBST= 1024
##$WBSW= 4
##$XGAIN= (0..3)
0 0 0 0 
##$XL= 0
##$YL= 0
##$YMAX_a= 314757
##$YMIN_a= -255597
##$ZGOPTNS= <>
##$ZL1= 120
##$ZL2= 120
##$ZL3= 120
##$ZL4= 120
##$ABSF1= 0
##$ABSF2= 0
##$ABSG= 0
##$ABSL= 0
##$ALPHA= 0
##$AQORDER= 0
##$ASSFAC= 0
##$ASSFACI= 0
##$ASSFACX= 0
##$ASSWID= 0
##$AUNMP= <proc_1d>
##$AZFE= 0.1
##$AZFW= 0.1
##$BCFW= 0
##$BC_mod= 2
##$BYTORDP= 0
##$COROFFS= 0
##$CY= -3
##$DATMOD= 1
##$DC= 0
##$DFILT= <>
##$DTYPP= 0
##$F1P= 0
##$F2P= 0
##$FCOR= 1
##$FTSIZE= 16384
##$FT_mod= 6
##$GAMMA= 0
##$GB= 0
##$INTBC= 1
##$INTSCL= 3.241238e-09
##$ISEN= 128
##$LB= 0.25
##$LEV0= 0
##$LPBIN= 0
##$MAXI= 10000
##$MC2= 0
##$MEAN= 0
##$ME_mod= 0
##$MI= 1.114404
##$NCOEF= 0
##$NC_proc= -6
##$NLEV= 6
##$NOISF1= 3.799351
##$NOISF2= 2.8
##$NSP= 0
##$NTH_PI= 0
##$NZP= 0
##$OFFSET= 15.48026
##$PC= 1
##$PHC0= -5299.955
##$PHC1= 10.82193
##$PH_mod= 1
##$PKNL= yes
##$PPARMOD= 0
##$PSCAL= 0
##$PSIGN= 0
##$REVERSE= no
##$SF= 200.130008294737
##$SI= 16384
##$SIGF1= 3
##$SIGF2= 2
##$SINO= 0.751879
##$SIOLD= 32768
##$SREGLST= <19F.Aceton>
##$SSB= 0
##$STSI= 16384
##$STSR= 0
##$SW_p= 3612.71676300578
##$SYMM= 0
##$S_DEV= 0
##$TDeff= 16384
##$TDoff= 0
##$TI= <>
##$TILT= no
##$TM1= 0
##$TM2= 0
##$TOPLEV= 0
##$USERP1= <user>
##$USERP2= <user>
##$USERP3= <user>
##$USERP4= <user>
##$USERP5= <user>
##$WDW= 1
##$XDIM= 16384
##$YMAX_p= 366180608
##$YMIN_p= -547602
$$ End of Bruker specific parameters
$$ ---------------------------------
##NTUPLES= NMR SPECTRUM
##VAR_NAME=  FREQUENCY,     SPECTRUM/REAL,   SPECTRUM/IMAG
##SYMBOL=    X,             R,               I
##VAR_TYPE=  INDEPENDENT,   DEPENDENT,       DEPENDENT
##VAR_FORM=  AFFN,          ASDF,            ASDF
##VAR_DIM=   16384,         16384,           16384
##UNITS=     HZ,            ARBITRARY UNITS, ARBITRARY UNITS
##FACTOR=    0.220516191357247, 1,           1
##FIRST=     3098.06454125602, 0,            0
##LAST=      -514.652221749762, 0,           0
##MIN=       -514.652221749762, -547602,     0
##MAX=       3098.06454125602, 366180608,    0
$$ Real data points
##PAGE= N=1
##DATA TABLE= (X++(R..R)), XYDATA
$$ [...]
11974a74763k1076P897L585O079L7691q0649L1273L5046L1448k4374m766l0823
$$ -174763 -195839 -187942 -184357 -178278 -140587 -221236 -189963 -154917 -123469 -147843 -152609 -183432
11962a83432k0770L6933Q0966k8463L533J422j2966N2896k4986J4697q2194K1072
$$ -183432 -204202 -167269 -86303 -114766 -111233 -109811 -122777 -69881 -94867 -80170 -162364 -141292
11950a41292n164L8185n2410j4181j0265l83P5691l1682J520K5014m3825M8319
$$ -141292 -146456 -108271 -160681 -174862 -185127 -185510 -109819 -141501 -139981 -114967 -158792 -110473
11938a10473O0366n8949N0294l6161j09110M1154R4694q5313n998M1674N5108
$$ -110473 -50107 -109056 -58762 -94923 -204033 -162879 -68185 -153498 -159496 -117822 -62714
11927f2714m7229j13673k2273N8442R585O026l4325l5681O1081L1691K5439m9130
$$ -62714 -109943 -223616 -245889 -187447 -177862 -171836 -206161 -241842 -180761 -149070 -123631 -172761
11915a72761M0586J4753k8081J9938J06743j12547n9487K597O8070L7824k1983
$$ -172761 -132175 -117422 -145503 -125565 -18822 -131369 -190856 -188259 -120189 -82365 -104348
11904a04348Q307p5328O3817l025O7693m9023j20q9822L3972J855P1712j2741
$$ -104348 -96041 -171369 -107552 -110577 -42884 -91907 -92027 -181849 -147877 -146022 -74310 -87051
11892h7051r0238o0672l2641R5123P4598M799k7727K0345J3299M5107j4190k5658
$$ -87051 -177289 -237961 -270602 -175479 -100881 -96082 -123809 -103464 -90165 -45058 -59248 -84906
11880h4906q3888K416O1192L2939j5041L4226q9160J8467Q9932k3783j32630R179
$$ -84906 -168794 -166378 -105186 -72247 -87288 -53062 -142222 -123755 -33823 -57606 -190236 -181057
11868a81057N8720N5723L5587m0939o7513j1838j698m2562M4809p3622L6261L6739
$$ -181057 -122337 -66614 -31027 -71966 -139479 -151317 -153015 -195577 -150768 -224390 -188129 -151390
11856a51390O6418o5522l364j4395k6010O5096n605L6705n1375K6191N1233Q0938
$$ -151390 -84972 -150494 -153858 -168253 -194263 -129167 -134772 -98067 -149442 -123251 -72018 8920
11844H920p5977k7890p7421J3746k175J7051K1951L4250j3818R798l9251j8027
$$ 8920 -67057 -94947 -172368 -158622 -160797 -143746 -121795 -87545 -101363 -91565 -130816 -148843
11832a48843O7932o5766J3864J5491l127M0042J0808l084j6905J8673q456P1394
$$ -148843 -80911 -146677 -132813 -117322 -120449 -80407 -69599 -72683 -89588 -70915 -79371 -7977
11820g977K0268p2917m5698n6754N5086j3384k655L5638m7444l2465K2147L3768
$$ -7977 12291 -60626 -106324 -163078 -107992 -121376 -124031 -88393 -135837 -168302 -146155 -112387
11808a12387k4457O3786m1649J3805J4538J3258l7365n3610k6538j8774Q9303
$$ -112387 -136844 -73058 -114707 -100902 -86364 -73106 -110471 -164081 -190619 -209393 -120090
11797a20090Q285N4610l7339n2922k7709J05559k8936k7828j03881O339l2477
$$ -120090 -111805 -57195 -94534 -147456 -175165 -69606 -98542 -126370 -230251 -223912 -256389
11786b56389J03724O8036j06137j5571J8142N3221N6034L9655q9257n7803r975
$$ -256389 -152665 -84629 -190766 -206337 -188195 -134974 -78940 -39285 -128542 -186345 -196320
11775a96320M5627O0100O738r9530m0003O0978J3559l0960j8994k7759Q647P1400
$$ -196320 -150693 -90593 -83855 -183385 -223388 -162410 -148851 -179811 -198805 -226564 -217917 -146517
11763a46517K8713k8322k5155N6520N8398n0201k8916O9446m2108m3364l2602
$$ -146517 -117804 -146126 -171281 -114761 -56363 -106564 -135480 -66034 -108142 -151506 -184108
11752a84108N4755l7814K7599k0849M7446Q121m1304N8603j8436O4799m6583n6633
$$ -184108 -129353 -167167 -139568 -160417 -112971 -104850 -146154 -87551 -105987 -41188 -87771 -144404
11740a44404k431M5337k2869Q5857o3284l3477L4465j9184k4666N4990k3865p0492
$$ -144404 -146835 -101498 -124367 -38510 -101794 -135271 -100806 -119990 -144656 -89666 -113531 -184023
11728a84023k3902j5996L2474J20045M575j32113k0987l7034O7398P4377k7427
$$ -184023 -207925 -223921 -191447 -71402 -66827 -198940 -219927 -256961 -189563 -115186 -142613
11717a42613J5478k8013o1843P9557N300m6457R9385j986k2986O9629o6156k9206
$$ -142613 -127135 -155148 -216991 -137434 -132134 -178591 -79206 -81192 -104178 -34549 -100705 -129911
11705a29911k1660N3477O6666j08900n283n0312P5073J3354J8217l9462L8380
$$ -129911 -151571 -98094 -31428 -140328 -145611 -195923 -120850 -107496 -89279 -128741 -90361
11694i0361O6310m8628l0101r824Q450j1508P521k8952R7358o9056K6901M290
$$ -90361 -24051 -72679 -102780 -112604 -104154 -115662 -108141 -137093 -39735 -108791 -81890 -77600
11682g7600j2654o6910l6324K7873K1339l4495M2507N4952r9233K2034N5624k0100
$$ -77600 -90254 -157164 -193488 -165615 -144276 -178771 -136264 -81312 -180545 -158511 -102887 -122987
11670a22987o1843L6036k4363L5552O8788L1344l0519q860r8988K9185o788K4869
$$ -122987 -184830 -148794 -173157 -137605 -68817 -37473 -67992 -76852 -175840 -146655 -153443 -128574
11658a28574L1965K5090j6983j02776J05k9038K4709K037L4899n9461N9182l2052
$$ -128574 -96609 -71519 -88502 -191278 -191173 -220211 -195502 -193465 -158566 -218027 -158845 -190897
11646a90897K7225J3265o1422K8133J02145P233l2455j8170m8803K0550l506P0658
$$ -190897 -163672 -150407 -211829 -183696 -81551 -74318 -106773 -124943 -173746 -153196 -156702 -86044
11634h6044m5628k6377k8219P4654J3918Q6622J0779q4434j21248p5984J44955
$$ -86044 -131672 -158049 -186268 -111614 -97696 -11074 -295 -84729 -205977 -281961 -137006
11623a37006N8885P1401j45795Q389J7786J0224R600L4950p7115J9133P0287l080
$$ -137006 -78121 -6720 -152515 -144126 -126340 -116116 -106516 -71566 -148681 -129548 -59261 -62341
11611f2341r2159j1264K9118L4802K1763M2190j4072p3381R7521k9651k5045k4078
$$ -62341 -154500 -165764 -136646 -101844 -80081 -37891 -51963 -125344 -27823 -57474 -82519 -106597
11599a06597k8933l6279m7338K4103P1222l1418J6402L57J5686K3892n1170k5534
$$ -106597 -135530 -171809 -219147 -195044 -123822 -155240 -138838 -138481 -122795 -98903 -150073 -175607
11587a75607N4578J3393R632Q0664q8999p3479p4787J73871J0184j5412o4340
$$ -175607 -121029 -107636 -98004 -17340 -106339 -179818 -254605 -80734 -70550 -85962 -150302
11576a50302p7217K3269O4572M5682j00413P7145j1986J2968j8154j3608p1864
$$ -150302 -227519 -204250 -139678 -93996 -194409 -117264 -129250 -116282 -134436 -148044 -219908
11565b19908J38383n1382L4957K3287j6352M345q948q489n044k803J2327k0941
$$ -219908 -81525 -132907 -97950 -74663 -91015 -86670 -95618 -104107 -109151 -111954 -99627 -120568
11553a20568L0200l4570m0108L2596l7075L0671k977n5678m0069J00583k3705
$$ -120568 -90368 -124938 -165046 -132450 -169525 -138854 -141831 -197509 -237578 -136995 -160700
11542a60700M7411n127K865J9780p5254m6127J0168M3727K8484O2132j5941l118
$$ -160700 -113289 -118416 -115551 -95771 -171025 -217152 -206984 -163257 -134773 -72641 -88582 -91700
11530i1700k6012K0703o5272n481o490R8439o2491k6299j8896K3931M4647q1584
$$ -91700 -117712 -97009 -162281 -167762 -174252 -75813 -138304 -164603 -183499 -159568 -114921 -196505
11518a96505J1920K1063N7462n0057k5362r770L2167Q492P628o3741M8468K4205
$$ -196505 -184585 -163522 -106060 -156117 -181479 -191249 -159082 -150590 -142962 -206703 -158235 -134030
11506a34030K1180K7100L493o012o3167j8470m664K8179P6864j4380l3499K6625
$$ -134030 -112850 -85750 -82257 -88269 -151436 -169906 -174570 -146391 -69527 -83907 -117406 -90781
11494i0781K1167M1631m0624p4122j3343k5931P3139N9288n7980L6424l1379O7841
$$ -90781 -69614 -27983 -68607 -142729 -156072 -182003 -108864 -49576 -107556 -71132 -102511 -34670
11482c4670O2960j15133m8433j5601J7113n3167K3132l6346j6510J1398P4314
$$ -34670 28290 -86843 -135276 -150877 -133764 -186931 -163799 -200145 -216655 -205257 -130943
11471a30943P192M4563j02577o6435L3866L3463Q1323p1439o2962j9347P3099
$$ -130943 -123751 -79188 -181765 -248200 -214334 -180871 -99548 -170987 -233949 -253296 -180197
11460a80197P4972j1881o3304O0111n9925P7140N3108j1305o4682k2437N7746
$$ -180197 -105225 -117106 -180410 -120299 -180224 -103084 -49976 -61281 -125963 -148400 -90654
11449i0654J6256M1843p3284O886m3780l3147m242J0704j6521N3197j3293l0599
$$ -90654 -74398 -32555 -105839 -98953 -142733 -175880 -180122 -169418 -185939 -132742 -146035 -176634
11437a76634O7895M0080J4650m1813l5134K3683M5385J7260p8222m2493o8241
$$ -176634 -108739 -68659 -54009 -95822 -130956 -107273 -61888 -44628 -122850 -165343 -233584
11426b33584N0066N2632j5039L9103m3620m4281m0403J23508J1506J2142Q592
$$ -233584 -183518 -130886 -145925 -106822 -150442 -194723 -235126 -111618 -100112 -87970 -79378
11415g9378j4413K746P3309J0237j21741p169l703J06215n7847M2740p8888j6567
$$ -79378 -93791 -91045 -17736 -7499 -129240 -136409 -140112 -33897 -91744 -49004 -127892 -144459
11403a44459j8344l834J8532L0823J157j2232K2651m1338O0713j4264o2335n9158
$$ -144459 -162803 -166637 -148105 -117282 -116125 -128357 -105706 -147044 -86331 -100595 -162930 -222088
11391b22088O8282m8944j6241Q2497O3844j14757K8649O1326l5532k694O6673
$$ -222088 -153806 -202750 -218991 -136494 -72650 -187407 -158758 -97432 -132964 -135658 -68985
11380f8985j6259J0682L2029k6209j5937J2261j21q0194j8559N6255O7312k4219
$$ -68985 -85244 -74562 -42533 -68742 -84679 -72418 -72539 -152733 -171292 -115037 -47725 -71944
11368g1944Q5952j16581n0284j2037q926J21339K9861p4643j4016k6756K4071
$$ -71944 14008 -102573 -152857 -164894 -173820 -52481 -22620 -97263 -111279 -138035 -113964
11357a13964Q5280j40427k8465j7288J03035K7250N9578j41365k7245K3959N0205
$$ -113964 -28684 -169111 -197576 -214864 -111829 -84579 -25001 -166366 -193611 -169652 -119447
11346a19447M2604l3066m7615j32660O7485Q8673P7733m3169j541K214k6426O6936
$$ -119447 -76843 -109909 -157524 -290184 -222699 -134026 -56293 -99462 -101003 -98789 -125215 -58279
11334e8279L7108O813o8421n0398K0409k9892Q954l0502j9739l2807Q7792L9523
$$ -58279 -21171 -14358 -82779 -133177 -112768 -142660 -133706 -164208 -183947 -216754 -128962 -89439
11322h9439l7672K0442R750k8971l8303K7672L1271N0051n7139k4147o9668M2331
$$ -89439 -127111 -106669 -96919 -125890 -164193 -136521 -105250 -55199 -112338 -136485 -206153 -163822
11310a63822O9605M6414j01628l4804j9441K5439R8430n0456R661j36481J8084
$$ -163822 -94217 -47803 -149431 -184235 -203676 -178237 -79807 -130263 -120602 -257083 -238999
11299b38999J16120J28289j2208m4900r1564j1110M0990J15601l3634j51683j6409
$$ -238999 -122879 5410 -6798 -51698 -143262 -154372 -113382 2219 -31415 -183098 -199507
11288a99507L0621Q6378M0245r0262q2849K5639j2840Q5166j5502o1061m0661
$$ -199507 -168886 -82508 -42263 -132525 -215374 -189735 -202575 -117409 -132911 -193972 -234633
11277b34633N8602P9488N1397M5597o9411j37858K4447Q98L6139J500k5557M7729
$$ -234633 -176031 -96543 -45146 451 -68960 -206818 -182371 -181473 -145334 -143834 -169391 -121662
11265a21662n5274J6264r868N5594m2121Q914m5454k3685o501J03827J13353p4958
$$ -121662 -176936 -160672 -170540 -114946 -157067 -148153 -193607 -217292 -223793 -119966 -6613 -81571
11253h1571j10940k3194J9006L9879R6486K1569r4716q2329Q9689M5294J9511
$$ -81571 -192511 -215705 -196699 -156820 -60334 -38765 -133481 -215810 -126121 -80827 -61316
11242f1316n9429n5695j0569R6196K4981l1869m9624p3409L3458O0780Q1267j7764
$$ -61316 -120745 -176440 -187009 -90813 -65832 -97701 -147325 -220734 -187276 -126496 -45229 -62993
11230f2993k26114m4237Q1670J24072M3165p625M130j46286J3265J03152J19983
$$ -62993 -289107 -333344 -251674 -127602 -84437 -92062 -87932 -234218 -220953 -117801 2182
11219B182j07966o8648j8980Q480R2412R274n310l4433l5438j7428L7402N0509
$$ 2182 -105784 -174432 -193412 -184932 -92520 -83246 -88556 -122989 -158427 -175855 -138453 -87944
11207h7944n5122p8306L8250q829M2502l4475O1185j520l6164n4105N818N8572
$$ -87944 -143066 -221372 -183122 -191951 -149449 -183924 -122739 -124259 -160423 -214528 -208710 -150138
11195a50138m3860j4470n3760O0608M8754L4621m3634l3861N249J4386N5125R168
$$ -150138 -193998 -208468 -262228 -201620 -152866 -118245 -161879 -195740 -190491 -176105 -120980 -111812
11183a11812L1196o5724j5958K7190K9700L234k2249o0208j9164M2439N6096L2690
$$ -111812 -80616 -146340 -162298 -135108 -105408 -102174 -124423 -184631 -203795 -161356 -105260 -72570
11171g2570R572m4469P570K3447P333j1543k1387K6806l3005p380m5873P1678
$$ -72570 -62998 -107467 -99897 -76450 -69117 -80660 -102047 -75241 -108246 -115626 -161499 -89821
11159h9821j9723R0997q5898l5469k2353k4059L4563L8323j7468n0283J231P3871
$$ -89821 -109544 -18547 -104445 -139914 -162267 -186326 -151763 -113440 -130908 -181191 -179960 -106089
11147a06089N1286P8271o4920j43828J1017M7940R8243r816n4990j30421L8901
$$ -106089 -54803 23468 -41452 -185280 -174263 -126323 -28080 -37896 -92886 -223307 -184406
11136a84406P6577J19071o6838m2038q8117P2105J57189K777r3800j81091L7118
$$ -184406 -107829 11242 -55596 -97634 -185751 -113646 43543 46320 -47480 -228571 -191453
11125a91453L7551M3139K8974n1833j35082N9202M2535R2986l3105k5722q4199
$$ -191453 -153902 -110763 -81789 -133622 -268704 -209502 -166967 -73981 -107086 -132808 -217007
11114b17007M0960O2687m168j0837l6674j1049M7981M5477j2000q6005j9724O0551
$$ -217007 -176047 -113360 -117528 -128365 -165039 -176088 -128107 -82630 -94630 -180635 -200359 -139808
11102a39808P462J01206p0841n5581p8063O5794O9972L1305K5049M327o5578n3017
$$ -139808 -132346 -31140 -101981 -157562 -235625 -169831 -99859 -68554 -43505 -39178 -104756 -157773
11090a57773M5700N4930m1423J4250r4095M5748L8904k100J9316j29139K7652
$$ -157773 -112073 -57143 -98566 -84316 -178411 -132663 -93759 -95859 -76543 -205682 -178030
11079a78030L3493J0396K2937p4212O2582n9532M5951K6213n2736M2597j2614
$$ -178030 -144537 -134141 -111204 -185416 -122834 -182366 -136415 -110202 -162938 -120341 -132955
11068a32955k4412K2712N6653j1199p8421j903O9313n38k7138n0719p9295L6992
$$ -132955 -157367 -134655 -78002 -89201 -167622 -169525 -100212 -100750 -127888 -178607 -257902 -220910
11056b20910J11017N8911K4799M2151o7140n8186N7835N40k7927m7380q4411N2857
$$ -220910 -109893 -50982 -26183 15968 -51172 -109358 -51523 -50983 -78910 -126290 -210701 -157844
11044a57844K3036Q6526m0359j15063L5319J8008M3616J1998o9730L670k8321
$$ -157844 -134808 -48282 -88641 -203704 -168385 -150377 -106761 -94763 -164493 -160823 -189144
11033a89144L5115P7340N8961n8685m6557p3336P9419N0872p4290K1000o5839
$$ -189144 -154029 -76689 -17728 -76413 -122970 -196306 -116887 -66015 -140305 -119305 -185144
11022a85144q149K7884N789p7367R6365n1832P1251m4871L0274m2873J6320j1672
$$ -185144 -193293 -165409 -159620 -236987 -140622 -192454 -121203 -166074 -135800 -178673 -162353 -174025
11010a74025j1712K3599J3615J4930L9637M2399j1209n4988j6096M9581m6510
$$ -174025 -185737 -162138 -148523 -133593 -93956 -51557 -62766 -117754 -133850 -84269 -130779
10999a30779K5507k3761l429O68N861k7082j8686o4824O4729k8885J3696P9174
$$ -130779 -105272 -129033 -132462 -131794 -125933 -153015 -171701 -236525 -171796 -200681 -186985 -107811
10987a07811J1581j03816m1422K8564R1413K2890k4852M472r0487J12407j2415
$$ -107811 -96230 -200046 -241468 -212904 -121491 -98601 -123453 -118981 -209468 -97061 -109476
10976a09476J3791j3489j3110r5635J9534R8845K9436M3245q6645q881K4167K1813
$$ -109476 -95685 -109174 -122284 -217919 -198385 -99540 -70104 -26859 -113504 -122385 -98218 -76405
10964g6405k2924j6905o4372r223N8102N0990L2548m9674p5452n6542K2401J9748
$$ -76405 -99329 -116234 -180606 -189829 -131727 -80737 -48189 -97863 -173315 -229857 -207456 -187708
10952a87708M2195J0862o5916J4010Q4189N7465k29o511j13517q3653O5332J21861
$$ -187708 -145513 -134651 -200567 -186557 -102368 -44903 -45132 -51643 -165160 -248813 -183481 -61620
10940f1620J6299m3713k1221o5603Q4249J9699l6082j26112l2071R6332J8377
$$ -61620 -45321 -89034 -110255 -175858 -91609 -71910 -107992 -234104 -266175 -169843 -151466
10929a51466P9490m8665p1596J9027N0325L6967K2783o0873k3573N61L8897K9837
$$ -151466 -71976 -120641 -192237 -173210 -122885 -85918 -63135 -124008 -147581 -147020 -108123 -78286
10917g8286l4624p1920m2774P8106J0608k0481Q296K7531k5470J21974o8864m2501
$$ -78286 -112910 -184830 -227604 -149498 -138890 -159371 -151075 -123544 -149014 -27040 -95904 -138405
10905a38405k7962L8040j6587k1186M040n0115j4673J01426P1738n2204k225j11433
$$ -138405 -166367 -128327 -144914 -166100 -162060 -212175 -226848 -125422 -53684 -105888 -108113 -219546
10893b19546K0313Q7925L2285p3539k9407k3669J40333L1712o7565n9358n6916
$$ -219546 -199233 -111308 -79023 -152562 -181969 -205638 -65305 -33593 -101158 -160516 -217432
10882b17432M3104J02758O9136n2074n9765m8304K4845J3460J9450j29582j2272
$$ -217432 -174328 -71570 -2434 -54508 -114273 -162577 -137732 -124272 -104822 -234404 -246676
10871b46676o0490P8464J56312o5r3143n8031K2977O0956L1901l6809m4474m9714
$$ -246676 -307166 -228702 -72390 -72455 -165598 -223629 -200652 -139696 -107795 -144604 -189078 -238792
10859b38792L9163O4536O4084j05167j4677m6936P1393L9815L5958j6599o64n6622
$$ -238792 -199629 -135093 -71009 -176176 -190853 -237789 -166396 -126581 -90623 -107222 -107886 -164508
10847a64508k0605R175M4190J3116k3927l0991Q8953O1735n5957n7676n1149J6306
$$ -164508 -185113 -175938 -131748 -118632 -142559 -173550 -84597 -22862 -78819 -136495 -187644 -171338
10835a71338Q211K1710M9991j2862o1482n1011L654Q6167n991L8869J0144j8808
$$ -171338 -163127 -141417 -91426 -104288 -165770 -216781 -213127 -126960 -132951 -94082 -83938 -102746
10823a02746N828n9592O9188k8736k1729p0379q188Q6236K310J956o4534O150
$$ -102746 -96918 -156510 -87322 -116058 -137787 -208166 -216354 -130118 -127808 -125852 -190386 -184236
10811a84236M3573K2481q236k9743K0426O9618K9231n6754n3790L3708l0629K4190
$$ -184236 -140663 -118182 -126418 -156161 -135735 -66117 -36886 -93640 -147430 -113722 -144351 -120161
10799a20161L9657q1749Q394N0157k1615l0584l5590j511P6963J2613L4192j4285
$$ -120161 -80504 -162253 -153859 -103702 -125317 -155901 -191491 -193002 -116039 -103426 -69234 -83519
10787h3519k1904n6823n3372k2059J16987K2519j2227q5911L0321J22680m3605
$$ -83519 -105423 -162246 -215618 -237677 -120690 -98171 -110398 -196309 -165988 -43308 -86913
10776h6913o1713o1917j6946N9480O8564L283r5202m6916Q6415J02584K9296p9627
$$ -86913 -148626 -210543 -227489 -168009 -99445 -96162 -191364 -238280 -151865 -49281 -19985 -99612
10764i9612k4092k7891N6221k3263N3921k8148p3399r136l0463J00038J10096
$$ -99612 -123704 -151595 -95374 -118637 -64716 -92864 -166263 -175399 -205862 -105824 4272
10753D272r1280j13017l4144Q0340L718M521M2525k9340l3463L2936l2838N0088
$$ 4272 -87008 -200025 -234169 -153829 -150111 -145590 -103065 -132405 -165868 -132932 -165770 -115682
10741a15682j8592q4777j0645J21200N5970j241J0118j2944m2014j470q215K341
$$ -115682 -134274 -219051 -229696 -108496 -52526 -53767 -43649 -56593 -98607 -100077 -108292 -105951
10729a05951n4413J09839J2300m6545k9616K670n9232n2939j1661M1059R4654
$$ -105951 -160364 -50525 -38225 -84770 -114386 -111716 -170948 -223887 -235548 -194489 -99835
10718i9835l4637K1527q5120K9960P2545M8368K7133p1662m3252k6461J1023N6262
$$ -99835 -134472 -112945 -198065 -168105 -95560 -47192 -20059 -91721 -134973 -161434 -150411 -94149
10706i4149m0438p2755M0634M3934N2901l7831n4335p8035P9140K5952O185O153
$$ -94149 -134587 -207342 -166708 -122774 -69873 -107704 -162039 -240074 -160934 -134982 -128797 -122644
10694a22644l9716n4411O541N7945o256Q992L1484P0638q5721j9088K2797n7988
$$ -122644 -162360 -216771 -210230 -152285 -158541 -149549 -118065 -47427 -133148 -152236 -129439 -187427
10682a87427k220L3342O0338P9625q6796j00507k5510Q6712J01071l2307m9844
$$ -187427 -189647 -156305 -95967 -16342 -103138 -203645 -229155 -142443 -41372 -73679 -123523
10671a23523j7769n725J900K193m2092l4412l0534N5864Q3972N7522p6119m5687
$$ -123523 -141292 -147017 -145117 -142924 -185016 -219428 -249962 -194098 -110126 -52604 -128723 -174410
10659a74410L1608K0628J8963k6270K7821k352k8390M9189j8827J7044k1161p1547
$$ -174410 -142802 -122174 -103211 -129481 -101660 -104012 -132402 -83213 -102040 -84996 -106157 -177704
10647a77704M5417m9360M7039k7798O1783j2386m1120j6421O0945J5783N6503
$$ -177704 -132287 -181647 -134608 -162406 -100623 -113009 -154129 -170550 -109605 -93822 -37319
10636c7319k2763m5203k7977P140p521k5347J7113J4239j0909P916j9284O3143
$$ -37319 -60082 -105285 -133262 -126122 -133643 -158990 -141877 -127638 -138547 -130631 -149915 -86772
10624h6772k3686k8493M6948K5202p2825J7196L0097n2770k1039q89k0775M6000
$$ -86772 -110458 -138951 -92003 -66801 -139626 -122430 -92333 -145103 -166142 -167031 -187806 -141806
10612a41806O4271L7186o5671l2857k8144l3652L3332J1052j088K0494J9871P3001
$$ -141806 -77535 -40349 -106020 -138877 -167021 -200673 -167341 -156289 -157377 -136883 -117012 -44011
10600d4011m0481n0679k7851K1639M6740K0136j6511q8850K3873L7856p604L1328
$$ -44011 -84492 -135171 -163022 -141383 -94643 -74507 -91018 -179868 -155995 -118139 -125743 -94415
10588i4415K9458r3448O129J7347K8309L966L0718K9708k5970o802n040p3664
$$ -94415 -64957 -158405 -152276 -134929 -106620 -102654 -71936 -42228 -68198 -75000 -80040 -153704
10576a53704l5362k96L3347L6719j4499O370k5537K5060J9003J0371j0943P807
$$ -153704 -189066 -189362 -156015 -119296 -133795 -127425 -152962 -127902 -108899 -98528 -109471 -101664
10564a01664P587l3387O2762N0074k748n5344r1233R094K6752j5283N3677k1123
$$ -101664 -94077 -127464 -64702 -14628 -17376 -72720 -163953 -154859 -128107 -143390 -89713 -110836
10552a10836l719K7821J3986m6858J6479p5589M658L1310j3708J2695O898J9970
$$ -110836 -114555 -86734 -72748 -119606 -103127 -178716 -174058 -142748 -156456 -143761 -136863 -116893
10540a16893J9620n3564j2069L197l5243Q6623O9519j5998r986m419j2901q093
$$ -116893 -97273 -150837 -162906 -159709 -194952 -108329 -38810 -54808 -64794 -69213 -82114 -90207
10528i0207O5875o1392k5577l5291M8021j8610M3647m0450o5760l2145n79O9958
$$ -90207 -24332 -85724 -111301 -146592 -98571 -117181 -73534 -113984 -179744 -211889 -212468 -142510
10516a42510M4585o16l1727j2822q926O1647N1043o1815q1105J1171L2129K634
$$ -142510 -97925 -98541 -130268 -143090 -152016 -90369 -39326 -101141 -182246 -171075 -138946 -136312
10504a36312P2121J7200l8144k5619o421K6934m5350m496R163L837j7476J8028
$$ -136312 -64191 -46991 -85135 -110754 -117175 -90241 -135591 -140087 -130924 -127087 -144563 -126535
10492a26535K5536m8736R458J3023K6584p052M6066r1669n6455m8381Q6773Q5871
$$ -126535 -100999 -149735 -140277 -127254 -100670 -107722 -61656 -153325 -209780 -258161 -171388 -85517
10480h5517q7962m245J0852L980O2364K7087p2755n9391q412M8419L505o553r653
$$ -85517 -173479 -177724 -166872 -162892 -100528 -73441 -146196 -205587 -213999 -165580 -162075 -168628 -178281
10467a78281j7888J4663J27810P0986n3042j44992k4158Q073R9822k2621k699
$$ -178281 -196169 -181506 -53696 17290 -35752 -180744 -204902 -196829 -97007 -119628 -122327
10456a22327l8710J1333J9749N4251N6579j06645j6870L7792L8915N6851j2182
$$ -122327 -161037 -149704 -129955 -75704 -19125 -125770 -142640 -104848 -65933 -9082 -21264
10445b1264q9701J5097K0339O5781J7032r0880j29841j9453J02795n5326m8390
$$ -21264 -110965 -95868 -75529 -9748 7284 -83596 -213437 -232890 -130095 -185421 -233811
10434b33811N0832R1816j00281J3164N2039M4223k2002j27195Q5429N1497j8073
$$ -233811 -182979 -91163 -191444 -178280 -126241 -82018 -104020 -231215 -145786 -94289 -112362
10423a12362r540q4603j4373O9902O2353J7262L8411k1571l3075J27M6610l7663
$$ -112362 -121902 -206505 -220878 -150976 -88623 -71361 -32950 -54521 -87596 -87469 -40859 -78522
10411g8522o0726k1836O663L0450J0254q7833o8674K5276N0469M5212N3120k227
$$ -78522 -139248 -161084 -154421 -123971 -113717 -201550 -270224 -244948 -194479 -149267 -96147 -98374
10399i8374K2136L0128j3756N6726n080r0899r2080j2768P6868P7001k5931j05073
$$ -98374 -76238 -46110 -59866 -3140 -8220 -99119 -191199 -203967 -127099 -50098 -76029 -181102
10387a81102l4310k8446O0245L3874L5036P9792j00086l4059j8739M5421n3956
$$ -181102 -215412 -243858 -183613 -149739 -114703 -34911 -134997 -169056 -187795 -142374 -196330
10376a96330K4263R8143l725O5482r6894p2569j2059r363M4381N4112L463p252
$$ -196330 -172067 -73924 -77649 -12167 -109061 -181630 -193689 -203052 -158671 -104559 -101096 -108348
10364a08348j962K7857k3409r691o2973M4202L890J5159N6563n8776r370j5000
$$ -108348 -110310 -82453 -105862 -115553 -178526 -134324 -130434 -115275 -58712 -117488 -126858 -141858
10352a41858m738L4853m02o60k4562M3606R143n2430J1136l8110l076K0891j8676
$$ -141858 -146596 -111743 -112145 -112805 -137367 -93761 -84618 -137048 -125912 -164022 -167098 -146207 -164883
10339a64883k8176n3845k4935O6100j8821Q7758P409P807m152n2584Q4800P9808
$$ -164883 -193059 -246904 -271839 -205739 -224560 -136802 -129393 -121586 -125738 -178322 -93522 -13714
10327a3714n4564m2399k7770J512J6145M6937J6967q9155o7155k5880N6506M9713
$$ -13714 -68278 -110677 -138447 -136935 -120790 -73853 -56886 -146041 -213196 -239076 -182570 -132857
10315a32857m4149k7534J2182K6598Q3557K9620n5245l5755q8089O9532R6777
$$ -132857 -177006 -204540 -192358 -165760 -82203 -52583 -107828 -143583 -231672 -162140 -65363
10304f5363l5583p6208m6516j4886J3120N6403Q3732j3175n994m4264l6772N1872
$$ -65363 -100946 -177154 -223670 -238556 -225436 -169033 -85301 -98476 -104470 -148734 -185506 -133634
10292a33634M9K5117J3455O427o2818j6195N7541L9568j0967j03733K0024K5078
$$ -133634 -133585 -108468 -95013 -88586 -151404 -167599 -110058 -70490 -81457 -185190 -165166 -140088
10280a40088J5245l4206L001j4183M7506k5736N442M1980l035j8298j12059M9688
$$ -140088 -124843 -159049 -156048 -170231 -122725 -148461 -143019 -101039 -104074 -122372 -234431 -184743
10268a84743R7120N6891K2484j165n9490l4096M2216R190m2093j19547j368k1265
$$ -184743 -87623 -30732 -8248 -9413 -68903 -102999 -60783 -51593 -93686 -213233 -214601 -235866
10256b35866P496J11413N2457p7769l3950K5317k2261L5515l709j0937J6465m6587
$$ -235866 -228370 -116957 -64500 -142269 -176219 -150902 -173163 -137648 -141357 -152294 -135829 -182416
10244a82416K1973R9539k6001m5188P943j5517Q0158R475J747j02088j0122K3929
$$ -182416 -160443 -60904 -86905 -132093 -124150 -139667 -59509 -50034 -48287 -150375 -160497 -136568
10232a36568L7378R7840p1274p1864o0878R4291P8040K7261j5312j07409j01375
$$ -136568 -99190 -1350 -72624 -144488 -205366 -111075 -33035 -5774 -21086 -128495 -229870
10221b29870M7912P6918P5309l3275j07400k2366N8260N4375K5569K9552j0643
$$ -229870 -181958 -105040 -29731 -63006 -170406 -192772 -134512 -80137 -54568 -25016 -35659
10210c5659n8938m0262K3624O9951J9188n9985J771J7684M7487K7251n7890l7795
$$ -35659 -94597 -134859 -111235 -41284 -22096 -82081 -80310 -62626 -15139 12112 -45778 -83573
10198h3573j047L9162J2822n7580l5740k6411Q048j1973L7766J3359J6381Q1847
$$ -83573 -84620 -45458 -32636 -90216 -125956 -152367 -144319 -156292 -118526 -105167 -88786 -6939
10186f939m9261J5193l5099k3785q9557K381j0096k0575L4384j2432K4126J4329
$$ -6939 -56200 -41007 -76106 -99891 -189448 -187067 -197163 -217738 -183354 -195786 -171660 -157331
10174a57331P118L337k7583J3324M0278K4869j1887K8824n7847m4367L6281R9533
$$ -157331 -150213 -146876 -174459 -161135 -120857 -95988 -107875 -79051 -136898 -181265 -144984 -45451
10162d5451k6236p3141K5926J07290M5982o562j16452r8796K7132N2929M5189
$$ -45451 -71687 -144828 -118902 -11612 34370 27808 -88644 -187440 -160308 -107379 -62190
10151f2190k1734j691n4032k6070J26271J0667j33508p579L2234L1070N5179K5180
$$ -62190 -83924 -85615 -139647 -165717 -39446 -28779 -162287 -169866 -137632 -106562 -51383 -26203
10139b6203j4260j37841l7483M0447R6738N1024m5213m5995m8763O3636N4521
$$ -26203 -40463 -178304 -215787 -175340 -78602 -27578 -72791 -118786 -167549 -103913 -49392
10128d9392L5780m340p0221o8447l0022Q5263O3776J7114j08102j6216J1581J4198
$$ -49392 -13612 -17952 -88173 -156620 -186642 -101379 -37603 -20489 -128591 -144807 -133226 -119028
10116a19028O110L209r744q6343l4476P4683P5854j6846r0411j6459J23740O4057
$$ -119028 -112918 -109709 -119453 -205796 -240272 -165589 -89735 -106581 -196992 -213451 -89711 -25654
10104b5654k0991R271p7185j3467K7807Q0906M1411j08544j28421J0177J22550
$$ -25654 -46645 -37374 -114559 -128026 -100219 -19313 22098 -86446 -214867 -204690 -82140
10093h2140K6218K5775q2178m2772j5943N0122J4582O1486o6785o6910N6187L8543
$$ -82140 -55922 -30147 -112325 -155097 -171040 -120918 -106336 -44850 -111635 -178545 -122358 -83815
10081h3815L5499O103r2786l2341k6230L4484K0278o135K4313P1772m0752k0498
$$ -83815 -48316 -42213 -134999 -167340 -193570 -159086 -138808 -144943 -120630 -48858 -89610 -110108
10069a10108l6191K5553N9217K3115j15391l710p4284j1178Q8547L1432j0317
$$ -110108 -146299 -120746 -61529 -38414 -153805 -157515 -231799 -242977 -154430 -122998 -133315
10058a33315r6664N9058N2982K8023K1509j6438R64J5094N2766M4889n6270j00126
$$ -133315 -229979 -170921 -117939 -89916 -68407 -84845 -83881 -68787 -16021 28868 -27402 -127528
10046a27528j1369P40P5033J6055k6282j11099n7245L9396O1675K2298p2746n4843
$$ -127528 -138897 -138157 -63124 -47069 -73351 -184450 -241695 -202299 -140624 -118326 -191072 -245915
10034b45915M0767Q2360L6263O4761p6617j11862N0272L4781L5456r953j10032
$$ -245915 -205148 -122788 -86525 -21764 -98381 -210243 -159971 -125190 -89734 -99687 -209719
10023b09719M7879m5249O8411M3627r931k6209j4975N4318k6671l7653j0005K542
$$ -209719 -161840 -207089 -138678 -95051 -104982 -131191 -146166 -91848 -118519 -156172 -166177 -163635
10011a63635r6331Q8736Q1628P6573K8749r6954o0815p315K0559J3527k523j8421
$$ -163635 -259966 -171230 -89602 -13029 15720 -81234 -142049 -149364 -128805 -115278 -117801 -136222
9999a36222q5886q470Q2827M3055l0955n2865N2267M3581N3750J8423k0983o4046
$$ -136222 -222108 -230578 -147751 -104696 -135651 -188516 -136249 -92668 -38918 -20495 -41478 -105524
9987a05524l4782p1391K5739J8178M3708q3386K6716Q1122R353k5625K392Q6539
$$ -105524 -140306 -211697 -185958 -167780 -124072 -207458 -180742 -99620 -90267 -115892 -113500 -26961
9975b6961l7017L598p4319O847r807L710N8603K0029l441o5273K9856j7402m8585
$$ -26961 -63978 -60380 -134699 -127852 -137659 -133949 -75346 -55317 -58758 -124031 -94175 -111577 -160162
9962a60162L3845k7401m32l4064J06611P3120o3296n2410Q807M6805K4614J4754
$$ -160162 -126317 -153718 -154150 -188214 -81603 -8483 -71779 -124189 -115382 -68577 -43963 -29209
9950b9209m6560p1866l2894P7954k1888J72n1304k2404L0067P6280j4672p4098
$$ -29209 -75769 -147635 -180529 -102575 -124463 -124291 -175595 -197999 -167932 -91652 -106324 -180422
9938a80422n8852N8313Q1838j0355o9048J2135K4476M5805j5496j6640m1034M5751
$$ -180422 -239274 -180961 -99123 -109478 -178526 -166391 -141915 -96110 -111606 -128246 -169280 -123529
9926a23529P2432N6152Q203m9014m4943j0402K6611K5395M7718j406n2608o7939
$$ -123529 -51097 5055 13258 -35756 -80699 -91101 -64490 -39095 8623 7217 -45391 -113330
9914a13330P644L01J312O3797n7875N8316j1999m4006r2204l8600J02675K4492
$$ -113330 -105686 -105385 -104073 -40276 -98151 -39835 -51834 -95840 -188044 -226644 -123969 -99477
9902i9477p3922k1540O9562L4417j0149m5394P8784m7426m7202o3121N8492K9237
$$ -99477 -173399 -194939 -125377 -90960 -101109 -146503 -67719 -115145 -162347 -225468 -166976 -137739
9890a37739P3453j5906l1188n6087N7903n855r4418J9794o932J10358o1584O2806
$$ -137739 -64286 -80192 -111380 -167467 -109564 -115419 -209837 -190043 -196975 -86617 -148201 -85395
9878h5395j9453j9600j5735p6405L3943J2468Q5232O6582o7219j25812L1600M5123
$$ -85395 -104848 -124448 -140183 -216588 -182645 -170177 -84945 -18363 -85582 -211394 -179794 -134671
9866a34671k7843N8976q2730j9253M5358M4273K5050j9688n4520L1586M1227m952
$$ -134671 -162514 -103538 -186268 -205521 -160163 -115890 -90840 -110528 -165048 -133462 -92235 -97187
9854i7187j5994k7655m2284k1412J15179J11676m0521j1693j15602n9020P3522
$$ -97187 -113181 -140836 -183120 -204532 -89353 22323 -18198 -29891 -145493 -204513 -130991
9843a30991M1768l3676m6557K3222j6934P5148L4841m3244o7359K2261M504Q9256
$$ -130991 -89223 -122899 -169456 -146234 -163168 -88020 -53179 -96423 -163782 -141521 -137017 -47761
9831d7761l2399m914n3734P3365L5583l5859P377m3255j2471J9741L4093m6177
$$ -47761 -80160 -85074 -138808 -65443 -29860 -65719 -58342 -101597 -114068 -94327 -60234 -106411
9819a06411m3496l7390M945L2807K6411k4404j0200L1289J4009K2000n9403Q105
$$ -106411 -149907 -187297 -182352 -149545 -123134 -147538 -157738 -126449 -112440 -90440 -149843 -141738
9807a41738r5525j8027Q3724O6367j7586j518n9355K0258M5025O4287j07000p183
$$ -141738 -237263 -255290 -171566 -105199 -122785 -124303 -183658 -163400 -118375 -54088 -161088 -168271
9795a68271J2728M648M5600L1060n3920j6499Q8340J3362k1148l479r6514j0717
$$ -168271 -155543 -150895 -105295 -74235 -128155 -144654 -56314 -42952 -64100 -67579 -164093 -174810
9783a74810O0999M4662O40J5859n7047q0894M5027J0332O5926k4572n7282o8917
$$ -174810 -113811 -69149 -68509 -52650 -109697 -190591 -145564 -135232 -69306 -93878 -151160 -220077
9771b20077Q254L3590k2290O3803j4091j3827K8453K3827M7362o6062j22383l5710
$$ -220077 -211823 -178233 -200523 -136720 -150811 -164638 -136185 -112358 -64996 -131058 -253441 -289151
9759b89151J05530Q3199J1447p9481l6468P8576R7976k7180K20o2167j04277O5445
$$ -289151 -183621 -100422 -88975 -168456 -204924 -126348 -28372 -55552 -55332 -117499 -221776 -156331
9747a56331R4973L227j852m785o303p3328J21312m488l3613j21117R5336N8174
$$ -156331 -61358 -58131 -59983 -64768 -71071 -144399 -23087 -27575 -61188 -182305 -86969 -28795
9735b8795M7469L7056m1346r4161j10907R5516M4330J1449l5046m0424N9492L6628
$$ -28795 18674 55730 14384 -79777 -190684 -95168 -50838 -39389 -74435 -114859 -55367 -18739
9723a8739l5208o2149p9770P4967O6336M4042p9765N750M0697p415J2846o1777
$$ -18739 -53947 -116096 -195866 -120899 -54563 -10521 -90286 -84536 -43839 -51254 -38408 -100185
9711a00185Q709p8898k7409J32045J4374q1394m938M7398K3799j2490l019l7541
$$ -100185 -91476 -170374 -197783 -65738 -51364 -132758 -137696 -90298 -66499 -78989 -82008 -119549
9699a19549p8705M6693N9350P6118p6704m3682M3109j4266O370n9766N3569M7554
$$ -119549 -198254 -151561 -92211 -16093 -92797 -136479 -93370 -107636 -101266 -161032 -107463 -59909
9687e9909K3547J8631k6641m4913k635l0004R802j9644M1412K8781k7101l5093
$$ -59909 -36362 -17731 -44372 -89285 -91920 -121924 -112122 -131766 -90354 -61573 -88674 -123767
9675a23767O4095K1839l0464m1879p812M364M6553k8594n8454q464O11L8250j651
$$ -123767 -59672 -37833 -68297 -110176 -117988 -113624 -67071 -95665 -154119 -162583 -161972 -123722 -125373
9662a25373m7398R0633p7078M5956M9180N735n4825k4920j4777j4965p3586K8251
$$ -125373 -172771 -82138 -159216 -113260 -64080 -58345 -113170 -138090 -152867 -167832 -241418 -213167
9650b13167P7801K6168K9418l8038p3824n715N7328P5277M8154q5604j7994O605
$$ -213167 -135366 -109198 -79780 -117818 -191642 -197357 -140029 -64752 -16598 -102202 -120196 -113591
9638a13591K4535O8127J7811n852n5378q7375N2832P896K7712l7550o1797J5626
$$ -113591 -89056 -20929 -3118 -8970 -64348 -151723 -98891 -90995 -63283 -100833 -162630 -147004
9626a47004M7611K8332j5239n3449M8371o238P7207l0826q3819k9338J1277M7356
$$ -147004 -99393 -71061 -86300 -139749 -91378 -97616 -20409 -51235 -135054 -164392 -153115 -105759
9614a05759K0739Q7207m6815O958l076k9264k9366J1348K6760j9041J5356k1612
$$ -105759 -85020 2187 -44628 -37670 -40746 -70010 -99376 -88028 -61268 -80309 -64953 -86565
9602h6565J004n222k9832L3342l0103k4437J7542M1502P0393n9284N3718o7994
$$ -86565 -85561 -90783 -120615 -87273 -117376 -141813 -124271 -82769 -12376 -71660 -17942 -85936
9590h5936K6274j22j5791j1530J6090k732J7179o4557P4751m7721K6744L8588
$$ -85936 -59662 -59784 -75575 -87105 -71015 -73747 -56568 -121125 -46374 -94095 -67351 -28763
9578b8763Q3306k5377n5369k7917n537L0350k387k4492L1052j15629p0056P4579
$$ -28763 54543 29166 -26203 -54120 -59657 -29307 -31694 -56186 -25134 -140763 -210819 -136240
9566a36240K6552P2033k8581M1567N2545o0618R2004k5938m7541p5056L5903m4790
$$ -136240 -109688 -37655 -66236 -24669 27876 -32742 59262 33324 -14217 -89273 -53370 -98160
9554i8160k606L843Q427o057N1773K9141o825K5512K256L1795n4000l4759Q8582
$$ -98160 -100766 -96923 -88496 -94553 -42780 -13639 -20464 5048 7304 39099 -14901 -49660 38922
9541C8922J8684m6236q048m4502n239o499N0650m135M4116L2255M5312n9158m4130
$$ 38922 57606 11370 3322 -41180 -46419 -52918 -2268 -6403 37713 69968 115280 56122 11992
9528A1992n8460o4450P0482R5875j7005k3640K8271j8766j1550N3122j6087j05713
$$ 11992 -46468 -110918 -40436 55439 38434 14794 43065 24299 12749 65871 49784 -55929
9516e5929N2685J00507l9174J989j2437j03331N3470N7025R2619n3677j12323
$$ -55929 -3244 97263 58089 60078 47641 -55690 -2220 54805 147424 93747 -18576
9505a8576k9023K0187J13231m1679l9872j34326L5663P2185J08830j18585l0271
$$ -18576 -47599 -27412 85819 44140 4268 -130058 -94395 -22210 86620 -31965 -62236
9494f2236k3174N0981J13110M1471m3645q7677j14764Q9434J23658R661n9974
$$ -62236 -85410 -34429 78681 120152 76507 -11170 -125934 -36500 87158 96819 36845
9483C6845q4778O2271J67675n9248p4213q0375o4954N2085Q5704J2210M9900p8020
$$ 36845 -47933 14338 182013 122765 48552 -31823 -96777 -44692 41012 53222 103122 25102
9471B5102m1228L7556P6362K3270m0421n5040j9130O5704Q5788o7345j01527k355
$$ 25102 -16126 21430 97792 121062 80641 25601 6471 72175 157963 90618 -10909 -13264
9459a3264L2480K3024P2675k2630k3199l9188O4689L1318q167r931m7227P8418
$$ -13264 19216 42240 114915 92285 69086 29898 94587 125905 117738 107807 60580 138998
9447A38998n6400K7555J2001j9052J265P3590n7807J9229K5529q9515L4246M391
$$ 138998 82598 110153 122154 103102 104367 177957 120150 139379 164908 75393 109639 114030
9435A14030N3201k9159N2857n9020K3554p0061J8979K2489M2171l9421n4015M0919
$$ 114030 167231 138072 190929 131909 155463 85402 104381 126870 169041 129620 75605 116524
9423A16524R8140P26p1794l9707M3705J871R325L1685P453k9578l2786l6987Q6187
$$ 116524 214664 215390 143596 103889 147594 149465 158790 190475 197928 168350 135564 98577 184764
9410A84764K7531N746K3700J2782J02474k8216P8986M4935J38459L32218N42321
$$ 184764 212295 218041 241741 254523 356997 328781 407767 452702 591161 923379 1465700
9399A465700M36795Q6513j73257k55904l78299k74078j92685k16675p4135r5947
$$ 1465700 1902495 1989008 1815751 1559847 1181548 907470 714785 498110 423975 328028
9389C28028l5892J3193n9081k1432o4104K3877J05967K3656r7366O556p0704J27355
$$ 328028 292136 305329 246248 224816 160712 184589 290556 314212 216846 223402 152698 280053
9377B80053Q276n5269l5812L4814K5095O9367j4683K0158K0453L7518K6177o77
$$ 280053 288329 233060 197248 232062 257157 326524 311841 331999 352452 389970 416147 415470
9365D15470n3287J02863m9720P9045k4088J3182K2947J19419L8737Q7941J01309
$$ 415470 362183 465046 415326 494371 470283 483465 506412 625831 664568 752509 853818
9354H53818J16330K00189J64756J07949K1144k5153l045Q8825R3032M1657K1636
$$ 853818 970148 1170337 1335093 1443042 1464186 1439033 1435988 1524813 1617845 1659502 1681138
9343A681138J5661k8113m6573O626q2751q502l5488n7230j2462j02421j97256
$$ 1681138 1696799 1668686 1622113 1628739 1545988 1537486 1501998 1444768 1432306 1329885 1132629
9332A132629j76554j00595p2632j79519r4463M1599o3855p9456R149L476L5748
$$ 1132629 956075 855480 782848 603329 508866 550465 486610 407154 416303 419779 455527
9321D55527p5121m4353P544R6065m0803j5933R692J5269j172K1468j6528p0550
$$ 455527 380406 336053 343597 439662 398859 382926 392618 407887 406715 428183 411655 341105
9309C41105k9706L9850P6257r187j04558O779k3263J2675M4418l715M4835m0395
$$ 341105 311399 351249 427506 418319 313761 320540 297277 309952 354370 350655 395490 355095
9297C55095k230L4795j9247k59J4614K9679M5161n4433K0165r272l8164R998Q776
$$ 355095 352865 387660 368413 368154 382768 412447 457608 403175 423340 414068 375904 385902 394678
9284C94678l1162j7726j0138R8014M2161k2783K6787M5717r5929j2431o386L3416
$$ 394678 363516 345790 335652 433666 475827 453044 479831 525548 429619 417188 410802 444218
9272D44218p2871J0205j7892J6804L878J02348p738R5916K7668m1716l0346l4092
$$ 444218 371347 381552 363660 380464 384342 486690 478952 574868 602536 560820 530474 496382
9260D96382j3887M9532P3402j4247n8749n4073L8575J03937k9882J5224q3933
$$ 496382 482495 532027 605429 591182 532433 478360 516935 620872 590990 606214 522281
9249E22281Q1539M6066J14864j41271k4542p282P8897j5368N9162n7287N1866
$$ 522281 603820 649886 764750 623479 598937 591655 670552 655184 714346 657059 708925
9238G08925O2063O4636O5343j0925p6002l5275J392M1700L4343N1574J5623o5518
$$ 708925 770988 835624 900967 890042 814040 778765 780157 821857 856200 907774 923397 857879
9226H57879m0176O8236J3950n3668q5615K0684M4063J13006P3423J629q3380K1577
$$ 857879 817703 885939 899889 846221 760606 781290 825353 938359 1011782 1013411 930031 951608
9214I51608J9490L5535J01902M2030K7820K8591L8861J21620j7543m8824K3928
$$ 951608 971098 1006633 1108535 1150565 1178385 1206976 1245837 1367457 1349914 1301090 1325018
9203A325018M7137L0293N6479J03131O3964J15879N0626J00711K20922K09866
$$ 1325018 1372155 1402448 1458927 1562058 1626022 1741901 1792527 1893238 2114160 2324026
9193B324026J71744K00339J77232J05631k1811Q5809N2787J54534K25051L92276
$$ 2324026 2495770 2696109 2873341 2978972 2957161 3042970 3095757 3250291 3475342 3867618
9183C867618M24731K71734J49153J24521J1786n6499r7626q4392R2519K69207
$$ 3867618 4292349 4564083 4713236 4837757 4849543 4793044 4695418 4611026 4703545 4972752
9173D972752L29452K46301M1627P9747R1404J26677P6729j03074L2093J38414
$$ 4972752 5302204 5548505 5590132 5669879 5761283 5887960 5964689 5861615 5893708 6032122
9163F032122J67813K22362J16210K03082P8925J33654L45740L95726L38362L08612
$$ 6032122 6199935 6422297 6538507 6741589 6820514 6954168 7299908 7695634 8033996 8342608
9153H342608K34174L39532J79757J41411N5421J82496L45194M02318L39761K44600
$$ 8342608 8576782 8916314 9096071 9237482 9292903 9475399 9820593 10222911 10562672 10807272
9143A0807272j13486j46857l09278j96750j22206r806o7109J7748k5275j82710
$$ 10807272 10693786 10546929 10237651 10040901 9918695 9908889 9841780 9859528 9834253 9651543
9133I651543k73361m29282m06646k02699j17862q4331j42441O119k21881j19349
$$ 9651543 9378182 8948900 8542254 8339555 8221693 8137362 7994921 8001040 7779159 7659810
9123G659810j28299o6707j04497j29066n7853J05497O9578O3275j1535L7916k6846
$$ 7659810 7531511 7464804 7360307 7231241 7173388 7278885 7348463 7411738 7400203 7438119 7411273
9112G411273P6060M8914j8995j02182L1024N7805J00479J11105J66422M2636J00898
$$ 7411273 7487333 7536247 7517252 7415070 7446094 7503899 7604378 7715483 7881905 7924541 8025439
9101H025439J17169J80680J60874Q4500P9889K47016J72088J55052M2418J40801
$$ 8025439 8142608 8323288 8484162 8568662 8648551 8895567 9067655 9222707 9265125 9405926
9091I405926J17124J91107K16343K27909J59200J76993J28952J43834J84270J01775
$$ 9405926 9523050 9714157 9930500 10158409 10317609 10494602 10623554 10767388 10951658 11053433
9081A1053433R5122J33769M5633Q3993J66300J56338K7340Q2477J32865J20219
$$ 11053433 11148555 11282324 11327957 11411950 11578250 11734588 11761928 11844405 11977270 12097489
9071A2097489L6391N7691J59035J81122R4448K60323K09425J94116P0942q0452
$$ 12097489 12133880 12191571 12350606 12531728 12626176 12886499 13095924 13290040 13360982 13280530
9061A3280530l8489j76005j62792l8323J1984J15333J38906O7221J1796j87153
$$ 13280530 13242041 13066036 12903244 12864921 12876905 12992238 13131144 13198365 13210161 13023008
9051A3023008l78591m70071k34958j97529m1472k13398j77330j40238l5227j45917
$$ 13023008 12644417 12174346 11939388 11741859 11700387 11486989 11309659 11169421 11134194 10988277
9041A0988277j33933l22265j74529k71488j7353O0185O5349j91358l9681j98876
$$ 10988277 10854344 10532079 10357550 10086062 10068709 10128894 10194243 10002885 9963204 9764328
9031I764328Q3449o7541P7160o9624J73601J34074K05423P0206r777k20167R5242
$$ 9764328 9847777 9780236 9857396 9787772 9961373 10095447 10300870 10371076 10361299 10141132 10236374
9020A0236374M917K20999J54299K26243Q7915K06363K6089K12741Q4079J60490
$$ 10236374 10241291 10462290 10616589 10842832 10930747 11137110 11163199 11375940 11460019 11620509
9010A1620509o9680J48381P3182K83427O0466L15465J42065M38811K10433L32894
$$ 11620509 11550829 11699210 11772392 12055819 12116285 12431750 12573815 13012626 13223059 13555953
9000A3555953J33966L35981K48239M34456M34880O50958M46809N88091M68101
$$ 13555953 13689919 14025900 14274139 14708595 15143475 15794433 16241242 16829333 17297434
8991A7297434P70393N94673P65657N95531R19526Q15164J076824J019379J469606
$$ 17297434 18067827 18662500 19428157 20023688 20943214 21758378 22835202 23854581 25324187
8982B5324187J427331J671292J626128J927440J833677K046683K103209K693830
$$ 25324187 26751518 28422810 30048938 31976378 33810055 35856738 37959947 40653777
8974D0653777K936575L566935M080432N166737O157553Q441944J2242101K1552068
$$ 40653777 43590352 47157287 51237719 56404456 62562009 71003953 83246054 104798122
8966A04798122L3959621L9094447K9548915R068601o868961p570219J0192891
$$ 104798122 138757743 177852190 207401105 216469706 209600745 202030526 212223417
8959B12223417K2786530J9900854P287380L665390N824887R646201k416232j8584892
$$ 212223417 235009947 254910801 262198181 265863571 271688458 281334659 278918427 260333535
8951B60333535k4927600q695882J0533253J1924589n847946k7453339m0764614
$$ 260333535 235405935 226710053 237243306 249167895 243319949 215866610 175101996
8944A75101996l7415317k5349013j7765338j2299795q337963n075405l906940
$$ 175101996 137686679 112337666 94572328 82272533 73934570 68859165 64952225
8937F4952225k104504j106366N05695K484581N084873P131119J0152759J5959966
$$ 64952225 62847721 61741355 62247050 64731631 69816504 76947623 87100382 103060348
8929A03060348L1555228O3536472Q6203423P0827352J0997785l7352196o6752984
$$ 103060348 134615576 198152048 284355471 355182823 366180608 328828412 262075428
8922B62075428o8747309m8727099l3651968k3250440j6465066j1092539r241763
$$ 262075428 193328119 144601020 110949052 87698612 71233546 60141007 50899244
8915E0899244o147259m852520l363929l005549k211183k195591j506353j548612
$$ 50899244 44751985 39899465 36535536 33529987 31318804 29123213 27616860 26068248
8907B6068248j024045j269123r77785j363193r80527j007474m03806o25541l06712
$$ 26068248 25044203 23775080 22797295 21434102 20453575 19446101 19042295 18416754 18110042
8898A8110042n67922l81124o71254m24205n55533l25244l47061p0625l56455j78918
$$ 18110042 17542120 17160996 16489742 16065537 15510004 15184760 14837699 14767074 14410619 14231701
8888A4231701k70518n4994k16148o2931l62657j47601l47951o6453j30966k7984
$$ 14231701 13961183 13906189 13690041 13627110 13264453 13116852 12768901 12702448 12571482 12543498
8878A2543498k23696o9053k81100l09928l64778k49255l74288j16133j79323M9066
$$ 12543498 12319802 12250749 11969649 11659721 11294943 11045688 10671400 10555267 10375944 10425010
8868A0425010J235J41592n5515j01868Q5688P4562p5168j59886j81309k4518k8935
$$ 10425010 10426245 10567837 10512322 10410454 10496142 10570704 10495536 10335650 10154341 10129823 10100888
8857A0100888J51641J52301K40259O5845J29451K0777J6457j00457j6145P5288
$$ 10100888 10252529 10404830 10645089 10710934 10840385 10861162 10877619 10777162 10761017 10836305
8847A0836305R0853K25905L10944K31789K87246J97105J30071J77840L20013M22131
$$ 10836305 10927158 11153063 11464007 11695796 11983042 12180147 12310218 12488058 12808071 13230202
8837A3230202N14767N22558N95179N94344P73551P32008Q11681O92829Q39965
$$ 13230202 13744969 14267527 14862706 15457050 16230601 16962609 17774290 18467119 19307084
8828A9307084J092522J338808J441864J532200J565067J511825J665947J748899
$$ 19307084 20399606 21738414 23180278 24712478 26277545 27789370 29455317 31204216
8820C1204216J835496K259241K840232L762883M650038N746438O942752R596140
$$ 31204216 33039712 35298953 38139185 41902068 46552106 52298544 59241296 68837436
8812F8837436J4597478K6527626L8435732L9490922K3320200j721643k1031698
$$ 68837436 83434914 109962540 148398272 187889194 211209394 209487751 188456053
8805A88456053k6635029j4935936q75401J8077304M2372242O1047441N4714338
$$ 188456053 161821024 146885088 146009687 164086991 206459233 267506674 322221012
8798C22221012K2420150k0477412n1626444n7139529m2917181k5369664r278941
$$ 322221012 344641162 324163750 272537306 215397777 172480596 147110932 137831991
8791A37831991R520874K1673468J9565845J646767j9023526l3252328l2349230
$$ 137831991 147352865 169026333 188592178 190238945 171215419 137963091 105613861
8784A05613861k2580083j5959194j1282189q173316n860358n091273l859076l312021
$$ 105613861 83033778 67074584 55792395 47619079 41758721 36667448 32808372 29496351
8776B9496351k617654k238327j601996j324421r37830j020482q88702r10290p73635
$$ 29496351 26878697 24640370 23038374 21713953 20776123 19755641 18866939 17956649 17183014
8767A7183014p69773p15042p38564m87062m43164j92137m52039l36807l47267
$$ 17183014 16413241 15698199 14959635 14472573 14029409 13837272 13385233 13048426 12701159
8758A2701159k42947l16554k85704l43831p2736r4167k9432j18711j12142j35876
$$ 12701159 12458212 12141658 11855954 11512123 11439387 11345220 11315788 11197077 11084935 10949059
8748A0949059p9749K5214o1164L7796J31613R2714K03031M85273J275142K005044
$$ 10949059 10869310 10894524 10833360 10871156 11002769 11095483 11298514 11783787 13058929 15063973
8738A5063973K067969J679797L06986j483187j982331j655415j066358m00779
$$ 15063973 17131942 18811739 19118725 17635538 15653207 13997792 12931434 12530655
8730A2530655O62643J737736J969802J510347j86701k067107k697615k223043
$$ 12530655 13193298 14931034 16900836 18411183 18224482 16157375 13459760 11236717
8722A1236717j521180j297539r35069n29579m32591l27349k83309l13736k30024
$$ 11236717 9715537 8417998 7482929 6953350 6520759 6193410 5910101 5596365 5366341
8713E366341k14398j38706n6124j69135j26813j90106k1374R2718m3136j53779
$$ 5366341 5151943 5013237 4957113 4787978 4661165 4471059 4449685 4542403 4499267 4345488
8703D345488j97106n0968j7974j7933j68614P865Q3493J34918J55998M9169j00814
$$ 4345488 4148382 4097414 4079440 4061507 3892893 3900758 3984251 4119169 4275167 4324336 4223522
8692D223522l00402k39749j62688L2862r5515p715p7214J05333N8104j6115j26111
$$ 4223522 3923120 3683371 3520683 3553545 3458030 3450315 3373101 3478434 3536538 3520423 3394312
8681C394312j03026j20346n6448k6562O2402o0895j05895k04709j47610m9349
$$ 3394312 3291286 3170940 3114492 3087930 3150332 3089437 2983542 2778833 2631223 2581874
8671B581874O8677j00743l2652j36259J43787J57805M3754j46949j35766j29708
$$ 2581874 2650551 2549808 2517156 2380897 2524684 2682489 2726243 2579294 2443528 2313820
8661B313820l9316j9806k6628o2489n2187r9120J3482N2236O984m1980M553m0730
$$ 2313820 2274504 2254698 2228070 2165581 2113394 2014274 2027756 2079992 2086976 2044996 2049549 2008819
8649B008819N0211k5046M5908Q1J6836q5920L8629L9456L0591n3957k7602M0713
$$ 2008819 2059030 2033984 2079892 2079973 2096809 2010889 2049518 2088974 2119565 2065608 2038006 2078719
8637B078719Q6140R8219J05562L2442O0068K4711O7021Q3428M5758M0889J29918
$$ 2078719 2164859 2263078 2368640 2401082 2461150 2485861 2552882 2636310 2682068 2722957 2852875
8626B852875J31694K10240K13778K76281K26565L16202M54352M38696K78847J82379
$$ 2852875 2984569 3194809 3408587 3684868 3911433 4227635 4681987 5120683 5399530 5581909
8616E581909J86187J23212p6494j83029j70525l26259l67093m03750m22197l33439
$$ 5581909 5768096 5891308 5814814 5631785 5461260 5135001 4767908 4364158 3941961 3608522
8606C608522l64640k38942k48357k53831k24939j29866p5299j0539j73440o0109
$$ 3608522 3243882 3004940 2756583 2502752 2277813 2147947 2072648 2062109 1888669 1828560
8596A828560m687p4451m8626n1307q9268L4016K1080q0646L4035m1252n6090n2556
$$ 1828560 1823873 1749422 1700796 1649489 1560221 1594237 1615317 1534671 1568706 1527454 1471364 1418808
8584A418808Q873O5036R7155P499R2492q8936M4328J27805J66992R4367N7996
$$ 1418808 1427681 1492717 1589872 1597371 1689863 1600927 1645255 1773060 1940052 2034419 2092415
8573B092415J37796K15989M2057O3335L716P7690O6625L29j07367q5368l2425
$$ 2092415 2230211 2446200 2488257 2551592 2555308 2632998 2699623 2699952 2592585 2507217 2474792
8562B474792l1419j28228J5710m813J0336k3773p5833j93664k11858k15838m9974
$$ 2474792 2443373 2315145 2330855 2326042 2336378 2312605 2236772 2043108 1831250 1615412 1565438
8551A565438j33363J4333j51268m0167m0982l3092M831k272j05741q7413O7700
$$ 1565438 1432075 1446408 1295140 1254973 1213991 1180899 1185730 1183458 1077717 990304 1058004
8540A058004J12448j0433k4338O0620O7990k3659l5026k035M4429L9046N3346
$$ 1058004 1170452 1160019 1135681 1196301 1264291 1240632 1205606 1203571 1248000 1287046 1340392
8529A340392Q5724Q8474k1372p9840r8470l0845j2723L9048K0324Q1796n0299
$$ 1340392 1426116 1514590 1493218 1413378 1314908 1284063 1271340 1310388 1330712 1412508 1362209
8518A362209Q2404K7359q31p2073m9745l6231N5380J21608J5237K8982k8914K9547
$$ 1362209 1444613 1471972 1471141 1399068 1349323 1313092 1368472 1490080 1505317 1534299 1505385 1534932
8506A534932J31181J49219M4281L3263J24925J67293L19607L87045M59674O56487
$$ 1534932 1666113 1815332 1859613 1892876 2017801 2185094 2504701 2891746 3351420 4007907
8496D007907J004424J524355J851788J808331J003376J26509m18269j031803j341655
$$ 4007907 5012331 6536686 8388474 10196805 11200181 11326690 10908421 9876618 8534963
8487H534963q77193j25074M96235J022996J249432O32322l00890q31052j411789
$$ 8534963 7657770 7532696 8028931 9051927 10301359 10933681 10632791 9801739 8389950
8478H389950j685650j485795j041252p55375n04092l12005k86789k75747j80848
$$ 8389950 6704300 5218505 4177253 3421878 2917786 2605781 2318992 2043245 1862397
8469A862397j11038j72882J2436o223o1390j15600o7499l972M4945q890r5977
$$ 1862397 1751359 1578477 1590913 1584690 1523300 1407700 1340201 1336229 1381174 1372284 1276307
8458A276307P596P7237p752m44N4802N9750R4404L58998M26784M29759J8730j07353
$$ 1276307 1283903 1361140 1353388 1352944 1407746 1467496 1561900 1920898 2347682 2777441 2796171 2688818
8446B688818l19820l57852k58919j87472j96011j39287j1391K5077p6886p9206
$$ 2688818 2368998 2011146 1752227 1564755 1368744 1229457 1218066 1243143 1166257 1087051
8436A087051l4974M43L8482N0857j1838J741p1411l604J08552J44728M8759J70867
$$ 1087051 1052077 1052520 1091002 1141859 1130021 1131762 1060351 1056747 1165299 1310027 1358786 1529653
8424A529653R9942J57985J04259L8302m8030q4263q8938k2368J84572K77474K51593
$$ 1529653 1629595 1787580 1891839 1930141 1882111 1797848 1708910 1686542 1871114 2148588 2400181
8413B400181J82737p197j07779j79644j52796k63733j30221r6273O1581J41415
$$ 2400181 2582918 2575721 2467942 2288298 2135502 1871769 1741548 1645275 1706856 1848271
8403A848271J00708r1106j47986j50849r4970j28117m6551o7664j03416p2558
$$ 1848271 1948979 1857873 1709887 1559038 1464068 1335951 1289400 1221736 1118320 1045762
8393A045762m736K2281l6441J4598k5087j9745k2800K4253J22637q0014l7341
$$ 1045762 1041026 1063307 1026866 1041464 1016377 996632 973832 998085 1120722 1040708 1003367
8382A003367M1315J19972M166k7418p6504m4432L0756j1572O8928j00036L7802
$$ 1003367 1044682 1164654 1168820 1141402 1064898 1020466 1051222 1039650 1108578 1008542 1046344
8371A046344K9717N2768o872J560K04n338K0028m2875J6432O9269P582K1127J7530
$$ 1046344 1076061 1128829 1121957 1123517 1123721 1118383 1138411 1095536 1111968 1181237 1188819 1209946 1227476
8358A227476L0388K5913N9049N533J59992L7702J16146O6309m90m0909K7696L3283
$$ 1227476 1257864 1283777 1342826 1348359 1508351 1546053 1662199 1728508 1728018 1687109 1714805 1748088
8346A748088M0490l423P2202l9302O6268J81952P7159k1521N2639M9038N2204
$$ 1748088 1788578 1785155 1857357 1818055 1884323 2066275 2143434 2121913 2174552 2223590 2275794
8335B275794J8674r518k9657M2247M1813J15778J00480N4882J950P2256O9694
$$ 2275794 2294468 2284950 2255293 2297540 2339353 2455131 2555611 2610493 2612443 2684699 2754393
8324B754393J8958L0625m0535J9991R1317K58609O6368P0349K5061K0J36404J11448
$$ 2754393 2773351 2803976 2763441 2783432 2874749 3133358 3199726 3270075 3295136 3295156 3431560 3543008
8312C543008J43272O1329l5051k4857J39668Q6051J18751J6737j9472L7938Q5886
$$ 3543008 3686280 3747609 3712558 3687701 3827369 3913420 4032171 4048908 4029436 4067374 4153260
8301D153260J32834O0618O9936r915J9282K01959N6241J00552M2547M3131O994
$$ 4153260 4286094 4346712 4416648 4406733 4426015 4627974 4684215 4784767 4827314 4870445 4877439
8290D877439J79954J41554J27250L0780O0568J23134J65227J11989M7385J18732
$$ 4877439 5057393 5198947 5326197 5356977 5417545 5540679 5705906 5817895 5865280 5984012
8280E984012O1335J55232j1006Q2209L4872J02451J30600J58168R5795O7536P9569
$$ 5984012 6045347 6200579 6189573 6271782 6306654 6409105 6539705 6697873 6793668 6861204 6940773
8269F940773q1348R5849J28416P1377N4074M500O9213Q9581J00183O3660J4749
$$ 6940773 6859425 6955274 7083690 7155067 7209141 7213641 7282854 7372435 7472618 7536278 7551027
8258G551027M9577J03573O8354R8125k1919n2715M6075N5315R3256P57J5726r4822
$$ 7551027 7600604 7704177 7772531 7870656 7848737 7796022 7842097 7897412 7990668 7991425 8007151 7912329
8246G912329p235K0815j991m7721j06391k2978n4485K2388p8709n1951j69291
$$ 7912329 7905094 7925909 7923918 7876197 7769806 7746828 7692343 7714731 7636022 7584071 7414780
8235G414780p7425r4700J7710r0950j50244r4617r2650l9229p6053J6485j06131
$$ 7414780 7337355 7242655 7260365 7169415 7019171 6924554 6831904 6792675 6716622 6733107 6626976
8224F626976j81762l9327l0763j32223k03211j13213o3734k727j2823p6576o2619
$$ 6626976 6445214 6405887 6375124 6242901 6039690 5926477 5862743 5860016 5847193 5770617 5707998
8213E707998j70910j35438q3488N042r0867r0375j22375K3219o9328K945m6460
$$ 5707998 5537088 5401650 5318162 5323204 5232337 5141962 5019587 5042806 4973478 4976423 4929963
8202D929963o8159j49696j65126K5357p6069j31119j20225j20008o7402k80075
$$ 4929963 4861804 4712108 4546982 4572339 4496270 4365151 4244926 4124918 4057516 3777441
8192C777441N58907N63105l84429J23066m2068m1724p7393m4824j94611j23559
$$ 3777441 4336348 4899453 4515024 4638090 4596022 4554298 4476905 4432081 4237470 4113911
8182D113911j60517m9722j09523j09868j14787R7055J9899L6739l9391j64663
$$ 4113911 3953394 3903672 3794149 3684281 3569494 3666549 3686448 3723187 3683796 3519133
8172C519133n9494j25275j94157k48139j61188k62432q9084J8989o9549k6129
$$ 3519133 3459639 3334364 3140207 2892068 2730880 2468448 2379364 2398353 2328804 2302675
8162B302675p6624p5624K6418J6067r4328j13995j91532l4477k2507L4143m0761
$$ 2302675 2226051 2150427 2176845 2192912 2098584 1984589 1793057 1758580 1736073 1770216 1729455
8151A729455j47287n2609m1262J01700N7848p6218j92514q3501o986Q2694j1610
$$ 1729455 1582168 1529559 1488297 1589997 1647845 1571627 1379113 1295612 1288626 1371320 1359710
8140A359710j22234r7728k1412M2433j0217o3014p7117p3367Q355P8195M6608
$$ 1359710 1237476 1139748 1118336 1160769 1150552 1087538 1010421 937054 945409 1023604 1070212
8129A070212j16589j33666n2200N1906P2295k387j25451j60080m0269P8015R2578
$$ 1070212 953623 819957 767757 819663 891958 889571 764120 604040 563771 641786 734364
8118G34364l8450m3122j02021N5976J18202J07809m1380j03589m0269l6735P7040
$$ 734364 695914 652792 550771 606747 724949 832758 791378 687789 647520 610785 687825
8107F87825M4572q2935j55346J6840M7604L979m1054l5282n4849k0909N8978K1887
$$ 687825 732397 649462 494116 510956 558560 562539 521485 486203 431354 410445 469423 491310
8095D91310N256J1530p2981k4308j1972M8773n1899j2959k2296J8880q46l6511
$$ 491310 496566 508096 435115 410807 398835 447608 395709 382750 360454 379334 378488 341977
8083C41977q0425P7789K4353L335j8426j5581K3758O4278N5617p7662k5099p3083
$$ 341977 261552 339341 363694 367029 348603 333022 356780 421058 476675 399013 373914 300831
8071C00831k8033J13435L293k683k9739m9172R4248Q8721l4363j5190o3066n8468
$$ 300831 272798 386233 389526 386843 357104 307932 402180 490901 456538 441348 378282 319814
8059C19814J41124J06106m4294j07930n9678P9494Q0182J01602n5654M0720n3896
$$ 319814 460938 567044 522750 414820 355142 434636 514818 616420 560766 601486 547590
8048E47590L2428K2326L8957n5849l2239J3641N4679M8667P2897P2842p2409N3256
$$ 547590 580018 602344 641301 585452 553213 566854 621533 670200 743097 815939 743530 796786
8036G96786R0378J60948J96880K17163K21065J68619Q2492k8538M4397n9202o9925
$$ 796786 887164 1048112 1244992 1462155 1683220 1851839 1934331 1905793 1950190 1890988 1821063
8025A821063j03202R213J02115K9698L3607j5957M9905l3800j43382j33281j46897
$$ 1821063 1717861 1727074 1829189 1858887 1892494 1876537 1926442 1892642 1749260 1615979 1469082
8014A469082j97967k08670o9929O1281J7543n2074r1340p3586m6010J7491R7033
$$ 1469082 1271115 1062445 992516 1053797 1071340 1019266 927926 854340 808330 825821 922854
8003I22854J13978r7761q7172q3223L1743O5849J33780r0138l9607r6922Q2701
$$ 922854 1036832 939071 851899 768676 800419 866268 1000048 909910 870303 773381 856082
7992H56082K15557j4047j20256o9309K04544J90746Q2692P9295p5822q0183n9690
$$ 856082 1071639 1057592 937336 868027 1072571 1263317 1346009 1425304 1349482 1269299 1209609
7981A209609l6586p9376j28461j36707m5542q4284k2839o2321K0659n1061j08800
$$ 1209609 1173023 1093647 965186 828479 782937 698653 675814 613493 634152 583091 474291
7970D74291P7048M4874Q5370q1085n2740j28310K5384Q980L337N6292q8820m5721
$$ 474291 551339 596213 681583 600498 547758 419448 444832 453812 457149 513441 424621 378900
7958C78900o8103R6773P0335k5918j31323N276n3312P8048R7712J595l791j13696
$$ 378900 310797 407570 477905 451987 320664 325940 272628 350676 448388 449983 446192 332496
7946C32496l1248M0954J7581L2882l5738j09138n0776J6055Q1995O3836j50537
$$ 332496 301248 342202 359783 392665 356927 247789 197013 213068 295063 358899 208362
7935B08362k1096n6373J23977L627K8439l6912p1500m1883O6435Q9801k4379l0466
$$ 208362 187266 130893 254870 258497 286936 250024 178524 136641 203076 292877 268498 238032
7923B38032j29188K0574M3231J28233j660o7766q5788m8693R2538J00705O4324
$$ 238032 108844 129418 172649 300882 299222 231456 145668 96975 189513 290218 354542
7912C54542r8165j31050M6046K3353J48901r758r8359p3550m5146M5442L2840
$$ 354542 256377 125327 171373 194726 343627 333869 235510 161960 116814 162256 195096
7901A95096m4045j4565j0588m3905J1816j9418k0888j9602O488J2194M1548j9672
$$ 195096 151051 136486 125898 81993 93809 74391 53503 33901 40389 52583 94131 74459
7889G4459P1256m1360j03651O2130M2088J05079L145q9669n2476p997K4215O8004
$$ 74459 145715 104355 704 62834 104922 210001 213146 123477 71001 63004 87219 155223
7877A55223J7208n4939k5963m8708J0558R6156L5336L934m6076k6328m5121O8814
$$ 155223 172431 117492 91529 42821 53379 149535 184871 188805 142729 116401 71280 140094
7865A40094K1137J4539j10320L4005n434K9490P2124O327p6392q0397R03J03337
$$ 140094 161231 175770 65450 99455 94021 123511 195635 201962 125570 45173 46076 149413
7853A49413Q1506n880j3675l1351M4154Q0708j3187L92q2985k5065k3635J13882
$$ 149413 230919 225039 211364 180013 224167 304875 291688 292080 209095 184030 160395 274277
7841B74277O0390J22764j40285l6123j4966L4385N5254k7104K5o0845K086P6662
$$ 274277 334667 457431 317146 281023 266057 300442 355696 328592 328617 267772 269858 346520
7829C46520Q8307o914n1288j00374P1425J27183K7152l816j07327o2331O2710
$$ 346520 434827 427913 376625 276251 347676 474859 502011 498195 390868 328537 391247
7818C91247J30102J03980j52324q0247o4905R8567N3803M7509L6343m4388j03144
$$ 391247 521349 625329 473005 392758 327853 426420 480223 527732 564075 519687 416543
7807D16543q32N5830M47037l00193l65423N4452l9004J22952j5459l5887j10148
$$ 416543 415711 471541 918578 618385 252962 307414 268410 391362 375903 340016 229868
7796B29868j1018M3216O4662L2206j19399p9579l0245K9939J10654m0373l7748
$$ 229868 218850 262066 326728 358934 239535 159956 129711 159650 270304 229931 192183
7785A92183q0849k1939K6159k2834O2943L1466n8554O7219J8160q392l1210j13862
$$ 192183 111334 89395 115554 92720 155663 187129 128575 195794 213954 205562 174352 60490
7773F0490L0933j7303N2428k2732N8086k785n6403j4140j9742j9415m0519m221
$$ 60490 91423 74120 126548 103816 161902 159117 102714 88574 68832 49417 8898 4677
7761D677R889J07268n6573M7388L5159n8116N6917j26500j28L8667k0216R3178
$$ 4677 14566 121834 65261 112649 147808 89692 146609 20109 19981 58648 38432 131610
7749A31610j2962j24267p9090l849M6978L5855K9906o0759m6036Q1909Q3135M6246
$$ 131610 118648 -5619 -84709 -88558 -41580 -5725 24181 -36578 -82614 -705 82430 128676
7737A28676o2210r3194j13238Q2165J11113L1568k2697r5708K0N5586L1287l3773
$$ 128676 66466 -26728 -139966 -57801 53312 84880 62183 -33525 -33505 22081 53368 19595
7725A9595m0502l6552Q151P320K9944m9787q8681M0397J8176J237R9463O2518
$$ 19595 -20907 -57459 -49308 -41988 -12044 -61831 -150512 -110115 -91939 -90702 8761 71279
7713G1279J847j34392j339J4243M8852M4278n8394J838o999P554L7451O9108r3542
$$ 71279 73126 -61266 -62605 -48362 490 44768 -13626 -11788 -18787 -11233 26218 95326 1784
7700A784j5499k2291P3164n181J6013Q931j27722P843l6892Q4027K7504l3576
$$ 1784 -13715 -36006 37158 31977 47990 56921 -70801 -62958 -99850 -15823 11681 -21895
7688b1895m5813L0649K6344J14452m1746j03211n5475K9668K3467Q7832k3017
$$ -21895 -67708 -37059 -10715 103737 61991 -41220 -96695 -67027 -43560 44272 21255
7677B1255m4814j4544J8761O7249k6382o2132r1556O2874J03296L4140p711r9632
$$ 21255 -23559 -38103 -19342 47907 21525 -40607 -132163 -69289 34007 68147 60436 -39196
7665c9196p3180P2220M952P4714j24833L6629l1786j4982M4201K3311m8572m4096
$$ -39196 -112376 -40156 -35204 39510 -85323 -48694 -80480 -95462 -51261 -27950 -76522 -120618
7653a20618J510n1746P5187K2446P4117r558J388m975K5125K8900N635n0272o9616
$$ -120618 -119108 -170854 -95667 -73221 896 -8662 -7274 -12249 12876 41776 47411 -2861 -72477
7640g2477K6330J6613K7762n6368N8603m4487m5016R243J4514K1621K791n320
$$ -72477 -46147 -29534 -1772 -58140 463 -44024 -89040 -79797 -65283 -43662 -40871 -46191
7628d6191l5310r221j0448M5238l321J8981k2277O224O4466m4207m0161j1770
$$ -46191 -81501 -90722 -101170 -55932 -59253 -40272 -62549 -56325 8141 -36066 -76227 -87997
7616h7997M3095O3621K3754R863m863k8526m9492J6371K4032l0122r1694O2488
$$ -87997 -44902 18719 42473 52336 47473 18947 -30545 -14174 9858 -20264 -111958 -49470
7604d9470K4939N1474j9316j08553p477m6842N1807k5464Q6241L0482m6844k4473
$$ -49470 -24531 26943 7627 -100926 -108403 -155245 -103438 -128902 -42661 -12179 -59023 -83496
7592h3496Q9481J8113j22205q759M3559K4609O1364j803n4479L7525p1546J4920
$$ -83496 5985 24098 -98107 -106866 -63307 -38698 22666 20863 -33616 3909 -67637 -52717
7580e2717P3942j1646p4675o7157M8213P5859K4422m9032n0961K5759q865l994
$$ -52717 21225 9579 -65096 -132253 -84040 -8181 16241 -32791 -83752 -57993 -66858 -70852
7568g0852M1483J7614m7576r6432O1855L2256L6700O296p848r1686P3530L9756
$$ -70852 -29369 -11755 -59331 -155763 -93908 -61652 -24952 -18656 -26504 -118190 -44660 -4904
7556d904K4341o6478j03995k455M5829R6049k6386k4109n0625J2987m5994J02732
$$ -4904 19437 -47041 -151036 -153491 -107662 -11613 -37999 -62108 -112733 -99746 -145740 -43008
7544d3008J3864P820p433k1604M4365j1756p2883o2318K0229K8675J06926k1473
$$ -43008 -29144 -21324 -28757 -50361 -5996 -17752 -90635 -152953 -132724 -104049 2877 -18596
7532a8596K0927l5049P6702R807j07474m5688j7764J00711M8447M8042k8473j32183
$$ -18596 2331 -32718 43984 53791 -53683 -99371 -117135 -16424 32023 80065 51592 -80591
7520h0591n989P6669J35916q2787r4804q0238M6996K6881R803L5788j01422K5759
$$ -80591 -86580 -9911 126005 43218 -51586 -131824 -84828 -57947 -48144 -12356 -113778 -88019
7508h8019m9979P7329K4087L8343n8410j1748M5202O0216q0132q7077k5303k2316
$$ -88019 -137998 -60669 -36582 1761 -56649 -68397 -23195 37021 -43111 -130188 -155491 -177807
7496a77807J42515m859J4270O385j07596J0629J24337k3249j03538n5777j9975
$$ -177807 -35292 -40151 -25881 -19496 -127092 -116463 7874 -15375 -118913 -174690 -194665
7485a94665J42290O5467L3280l1760j44337p6050J59470M3476J1203l4199p8768
$$ -194665 -52375 13092 46372 14612 -129725 -205775 -46305 -2829 8374 -25825 -104593
7474a04593K3321J00351m459o154q0085j1524m5599N5289J0058N1017L7636j00888
$$ -104593 -81272 19079 14620 8466 -71619 -83143 -128742 -73453 -63395 -12378 25258 -75630
7462g5630L0907n6586J21757l4344n6299k3504O546n8023Q0659L6232J7803J608
$$ -75630 -44723 -101309 20448 -13896 -70195 -93699 -87153 -145176 -64517 -28285 -10482 -8874
7450h874k5106L3353L4192J7133j32206L8796j08569j9447k8285K5583L2608k9278
$$ -8874 -33980 -627 33565 50698 -81508 -42712 -151281 -170728 -199013 -173430 -140822 -170100
7438a70100O0494N8221M0365J2035N2404m6222p2028K8204N8108k014j51265J1188
$$ -170100 -109606 -51385 -11020 1015 53419 7197 -64831 -36627 21481 19467 -131798 -120610
7426a20610P921N4541N4088n867j04822p514n532k372J08725p0654m2354j3161
$$ -120610 -112689 -58148 -4060 -9927 -114749 -122263 -127795 -130167 -21442 -92096 -134450 -147611
7414a47611Q2406P2137J1363o6897l5450m0290M0850K9434o5538K5777K0109P7954
$$ -147611 -65205 6932 18295 -48602 -84052 -124342 -83492 -54058 -119596 -93819 -73710 4244
7402D244j20264M6817m6306k1423P9515J7185P335O6359o543j13198K1130j627
$$ 4244 -116020 -69203 -115509 -136932 -57417 -40232 -32897 33462 26919 -86279 -65149 -66776
7390f6776N4087r0553K9712N4177m6446o4193P8508r5546l552k9639M0800J2114
$$ -66776 -12689 -103242 -73530 -19353 -65799 -129992 -51484 -147030 -150582 -180221 -139421 -127307
7378a27307Q6125L8017l3749o8817P3654m4053K0931j6099m4585J0410j7437M0880
$$ -127307 -41182 -3165 -36914 -105731 -32077 -76130 -55199 -71298 -115883 -105473 -122910 -82030
7366h2030K4217q078j06352N5453J1421P0836N8083r3940j6485K2618L4494l5933
$$ -82030 -57813 -65891 -172243 -116790 -105369 -34533 23550 -70390 -86875 -64257 -29763 -65696
7354f5696N5444j19576J4094N8303L1096n2447j5583k4914j1752R6215K5853m5789
$$ -65696 -10252 -129828 -115734 -57431 -26335 -78782 -94365 -119279 -131031 -34816 -8963 -54752
7342e4752j31099j0949M4461Q2655j9467j3522n4348K4809Q5110l969n1793m9580
$$ -54752 -185851 -196800 -152339 -69684 -89151 -102673 -157021 -132212 -47102 -51071 -102864 -152444
7330a52444k3698L8362P025J07590r22j02701j35137P9636J07687L5548K6279
$$ -152444 -176142 -137780 -130755 -23165 -24087 -126788 -261925 -182289 -74602 -39054 -12775
7319a2775n9267n8729O498J05668m5690k4909j6791l7929M362O6196J02315r5529
$$ -12775 -72042 -130771 -124273 -18605 -64295 -89204 -105995 -143924 -139562 -73366 28949 -66580
7307f6580J1438k7213O3747M9793L735n0287n6516J2157m5478p4135R5308O3639
$$ -66580 -55142 -82355 -18608 31185 34920 -15367 -71883 -59726 -105204 -179339 -84031 -20392
7295b0392o7236n4821N0281J6462L55O3464m7372j4593j0302K6003K3245j4541
$$ -20392 -87628 -142449 -92168 -75706 -75351 -11887 -59259 -73852 -84154 -58151 -34906 -49447
7283d9447j3690j3537L3619k9201o3931J07442o7038L5363N9060k4543m0441k0747
$$ -49447 -63137 -76674 -43055 -72256 -136187 -28745 -95783 -60420 -1360 -25903 -66344 -87091
7271h7091L1302L4208j1383k9284j2756k7445j5653o3201J01459r851M4505o7179
$$ -87091 -55789 -21581 -32964 -62248 -75004 -102449 -118102 -181303 -79844 -89695 -45190 -112369
7259a12369K4402K9555j8603K0369L0944l0780j6126L2087l0301n0444j1411Q046
$$ -112369 -87967 -58412 -77015 -56646 -25702 -56482 -72608 -40521 -70822 -121266 -132677 -124631
7247a24631M5893P3162J0020J0779l5131M6237K039m1386N348J5081k5295n0801
$$ -124631 -78738 -5576 4444 15223 -19908 26329 28368 -13018 -7670 7411 -17884 -68685
7235f8685o7578R6146k6882l3278p871N8259K2102q3872Q2662m4856K4056l2013
$$ -68685 -136263 -40117 -66999 -100277 -108148 -49889 -27787 -111659 -28997 -73853 -49797 -81810
7223h1810O1743J4100L1427m3479l1857L6358L9942N9419j20923l4983k0508O0031
$$ -81810 -20067 -5967 25460 -18019 -49876 -13518 26424 85843 -35080 -70063 -90571 -30540
7211c0540J5177K9772K1517m3748j00853M0185L2253J7035M4649j25735k8740
$$ -30540 -15363 14409 35926 -7822 -108675 -68490 -36237 -19202 25447 -100288 -129028
7200a29028L0368O4375L6263n020n0490K2728k695r743L7463L0842p4771P032
$$ -129028 -98660 -34285 1978 -3042 -53532 -30804 -33499 -43242 -5779 25063 -49708 -42676
7188d2676M0518O789K2021o1761l6764M1561j5341k0276P16q764Q8781P319N6893
$$ -42676 -2158 4631 26652 -35109 -71873 -30312 -45653 -65929 -65213 -73977 14804 22123 79016
7175G9016m8582p5199K2759Q1651R626k4087j8062J5612m3505O3492M5357j5652
$$ 79016 30434 -44765 -22006 59645 69271 45184 27122 42734 -771 62721 108078 92426
7163I2426P666r4168q654O018M2671N3908M2875n6104J6506J06842K1187J340
$$ 92426 100092 5924 -2730 3288 45959 99867 142742 86638 103144 209986 231173 232513
7151B32513L4265K9506k7945L8400P8871J32813J08416L11698O81125P70430Q03400
$$ 232513 266778 296284 268339 306739 385610 518423 626839 938537 1619662 2390092 3193492
7140C193492K74000l35821o94960p28087m68833m31893k22085j27822k0528j21715
$$ 3193492 3467492 3131671 2436711 1708624 1239791 807898 585813 457991 437463 315748
7130C15748q7043n8710k3844l4536p1576k4404l6242L5068l2221K3111M227M9649
$$ 315748 228705 169995 146151 111615 40039 15635 -20607 14461 -17760 5351 9578 59227
7118E9227l1027J4800K6829j7436j7544O788r467m452J6677o2852Q7696m7960
$$ 59227 28200 43000 69829 52393 34849 41637 32170 27718 44395 -18457 69239 21279
7106B1279P748P859J749Q9296k4503r4623L1642K1638L325o7604j6929k8102J1800
$$ 21279 29027 36886 38635 127931 103428 8805 40447 62085 65410 -2194 -19123 -47225 -35425
7093c5425k4138Q4524m0867q3902P4541K189M1366o7838p2808J12858L5643m6365
$$ -35425 -59563 24961 -15906 -99808 -25267 -23078 18288 -49550 -122358 -9500 26143 -20222
7081b0222k4066K899O3876k7254k4540k7660l7917N4489L3131O4472l7979j8291
$$ -20222 -44288 -41389 22487 -4767 -29307 -56967 -94884 -40395 -7264 57208 19229 938
7069I38r8912J01232j7006L8920k3309j06032J1724L8789O9761r1015L5278K4709
$$ 938 -97974 3258 -13748 25172 1863 -104169 -92445 -53656 16105 -74910 -39632 -14923
7057a4923Q7752n3507L1939l7747o7183r1061N4743N6887O1641m5719j13871N5666
$$ -14923 72829 19322 51261 13514 -53669 -144730 -89987 -33100 28541 -17178 -131049 -75383
7045g5383J26418l4905K9633p7683n6928m6298O2870Q2777k7096m7439r0462M6159
$$ -75383 51035 16130 45763 -31920 -88848 -135146 -72276 10501 -16595 -64034 -154496 -108337
7033a08337O2346j5557n6374l3586L8281N9048J9160N2528n0400l493J8537J8207
$$ -108337 -45991 -61548 -117922 -151508 -113227 -54179 -35019 17509 -32891 -36384 -17847 360
7021C60N6083o0812L1323N0971R1279j3482J87551K5236j02341r2773j21160n5781
$$ 360 56443 -4369 26954 77925 169204 155722 343273 368509 266168 173395 52235 -3546
7009c546O743P2024r2089o6281l1469L5667J9799L684K892m367p3423J6815L0118
$$ -3546 3197 75221 -16868 -83149 -114618 -78951 -59152 -55468 -52576 -56943 -130366 -113551 -83433
6996h3433N5137j8102m5906j0526j594L5563M4292L9399m3424L5736o23k8034
$$ -83433 -28296 -46398 -92304 -102830 -104424 -68861 -24569 14830 -28594 7142 6519 -21515
6984b1515R398j2416j06130q6205k5501J14327k7613L1476j1951J7806J8557M0915
$$ -21515 -12117 -24533 -130663 -216868 -242369 -128042 -155655 -124179 -136130 -118324 -99767 -58852
6972e8852P0745m1058q8301l2637Q9481k6335N0091J9557J5949r7948O1207P709
$$ -58852 11893 -29165 -117466 -150103 -60622 -86957 -36866 -17309 -1360 -99308 -38101 -30392
6960c0392L9893o8214k9660M4241m0281R5447p2632k6034l1400N7835L2964K563
$$ -30392 9501 -58713 -88373 -44132 -84413 11034 -61598 -87632 -119032 -61197 -28233 -25670
6948b5670L934j4457l2423m0242J4920P7531n5328Q190j4345q780Q8002K8227
$$ -25670 -21736 -36193 -68616 -108858 -93938 -16407 -71735 -63545 -77890 -86670 1332 29559
6936B9559j1625o0621k6967K2405l0792j009K8776j01571P7226O1141l6109l4656
$$ 29559 17934 -42687 -69654 -47249 -78041 -79050 -50274 -151845 -74619 -13478 -49587 -84243
6924h4243J1538j3277M6534m3753L3603k1829k1933P7023j772J7433l3660m920
$$ -84243 -72705 -85982 -39448 -83201 -49598 -71427 -93360 -16337 -18109 -676 -34336 -39256
6912c9256K3039L1413M3759m2122j6219n0336l5558j3159P6109K9361l2129j2740
$$ -39256 -16217 15196 58955 16833 614 -49722 -85280 -98439 -22330 7031 -25098 -37838
6900c7838J9940k6331L160j4072m4226j09063Q3038J4402n5353p2800M5400Q447
$$ -37838 -17898 -44229 -41069 -55141 -99367 -208430 -125392 -110990 -166343 -239143 -193743 -185296
6888a85296Q0072j048k4563K2961N5208o7750N0540l6762j0574K4288l3606K6094
$$ -185296 -105224 -106272 -130835 -107874 -52666 -120416 -69876 -106638 -117212 -92924 -126530 -100436
6876a00436O984O1949k7365l7656m7989P2972k3082j6820L8157m6953q949L1185
$$ -100436 -93452 -31503 -58868 -96524 -144513 -71541 -94623 -111443 -73286 -120239 -129188 -98003
6864i8003K2606j9639Q758j6625J8282O4826l8881k582l6198o3669j2128J08501
$$ -98003 -75397 -95036 -86278 -102903 -84621 -19795 -58676 -61258 -97456 -161125 -173253 -64752
6852f4752l432L4332M266p2993m6184m6796r886M5354O859L4921K2251Q6964j3164
$$ -64752 -68184 -33852 -29586 -102579 -148763 -195559 -205445 -160091 -153232 -118311 -96060 -9096 -22260
6839b2260r514r9907k1933k3841L2124M7993M858o3424J390L3697R6557q717L1455
$$ -22260 -31774 -131681 -153614 -177455 -145331 -97338 -92480 -155904 -154514 -120817 -24260 -32977 -1522
6826a522o1952j04635R4252O1546K7002q8801q0895N6431M2566N300n6296J4823
$$ -1522 -63474 -168109 -73857 -12311 14691 -74110 -155005 -98574 -56008 -50708 -107004 -92181
6814i2181n6304K2673O2896L921n2598k6988P9739L3123l6511m6681j2656M2574
$$ -92181 -148485 -125812 -62916 -58995 -111593 -138581 -58842 -25719 -62230 -108911 -121567 -78993
6802g8993O394M7485M833L5347n1728n1543k4638N6376M636q6615P5213L4752
$$ -78993 -72599 -25114 -20281 15066 -36662 -88205 -112843 -56467 -51831 -138446 -63233 -28481
6790b8481L8403j01660J2934N644Q210j4401J7115p4930L4081J6203L5637m123
$$ -28481 9922 -91738 -78804 -73160 -64950 -79351 -62236 -137166 -103085 -86882 -51245 -55368
6778e5368o4752K0952O8564O4469j12856L9511K6415L725n912N8529k7334o4364
$$ -55368 -120120 -99168 -30604 33865 -78991 -39480 -13065 -9340 -15252 43277 15943 -48421
6766d8421n9167M1239K2703j5056J3040r2413n6300j0474J12104K0947l3209M9536
$$ -48421 -107588 -66349 -43646 -58702 -45662 -138075 -194375 -204849 -92745 -71798 -105007 -55471
6754e5471K9138k9979L239l7627q670K8171L1843q7441L353k9140K8881N8376
$$ -55471 -26333 -56312 -53073 -90700 -99370 -71199 -39356 -126797 -123444 -152584 -123703 -65327
6742f5327l4703J0877N966l8499M1426M5277o3796J8920n8604M1905l6255R5527
$$ -65327 -100030 -89153 -83187 -121686 -80260 -34983 -98779 -79859 -138463 -96558 -132813 -37286
6730c7286j6580k230J1492p1746j702n4169j5047l7034P5509R8594J10545l5524
$$ -37286 -53866 -56096 -44604 -116350 -118052 -172221 -187268 -224302 -148793 -50199 60346 24822
6718B4822k7879p7771M3827N6064j3428q1657q0239K9221N5146L3197J754R403
$$ 24822 -3057 -80828 -37001 19063 5635 -76022 -156261 -127040 -71894 -38697 -36943 -27540
6706b7540p1951k5537R8851Q4904k6050q9572m9929L9087Q0039L9055l4342J954
$$ -27540 -99491 -125028 -26177 58727 32677 -56895 -106824 -67737 12302 51357 17015 18969
6694A8969l6958j960Q0369M274m2250p6235j6478J06531Q3322m3469j13080p1711
$$ 18969 -17989 -19949 60420 64694 22444 -53791 -70269 36262 119584 76115 -36965 -108676
6682a08676R1582O891O266m1400M489K1252k2069K4592j4326n0855l4260n0577
$$ -108676 -17094 -10203 -3937 -45337 -40848 -19596 -41665 -17073 -31399 -82254 -116514 -167091
6670a67091M6750L5483O340q7033l9059O5767M1026J3574K6613o5933l3055N2403
$$ -167091 -120341 -84858 -78518 -165551 -204610 -138843 -97817 -84243 -57630 -123563 -156618 -104215
6658a04215J16935M4849r3209r7979K2747L7140p063K0444p2317m4908O814k2328
$$ -104215 12720 57569 -35640 -133619 -110872 -73732 -80795 -60351 -132668 -177576 -170762 -193090
6646a93090K4987L2997L6187n136o414M4899m085n6510m7035r717O6487O269j1088
$$ -193090 -168103 -135106 -98919 -104055 -110469 -65570 -69655 -126165 -173200 -182917 -116430 -110161 -121249
6633a21249k0435l6231J12803L626R6775r0896m7378K7350O9778K1478l7038l8539
$$ -121249 -141684 -177915 -65112 -61486 35289 -55607 -102985 -75635 -5857 15621 -21417 -59956
6621e9956n1941N0133o998N5410K1657k6846n4791k6432Q1324l8930o0090j3208
$$ -59956 -111897 -61764 -68762 -13352 8305 -18541 -73332 -99764 -18440 -57370 -117460 -130668
6609a30668Q6480L5861L2752l7218j22687n646P5103M1096q633n1765m1589R560
$$ -130668 -44188 -8327 24425 -12793 -135480 -141126 -66023 -24927 -33560 -85325 -126914 -117354
6597a17354J02687P4528j1258j16252o0363Q705O2256N3124j9379k9134j15131
$$ -117354 -14667 59861 48603 -67649 -128012 -119307 -57051 -3927 -23306 -52440 -167571
6586a67571n5459R7494N7660o9358J8725O480l87J6392J01707l4918O50l9314
$$ -167571 -223030 -125536 -67876 -137234 -118509 -112029 -112416 -96024 5683 -29235 -28585 -67899
6574f7899k3250P8726k5606l8296m4929J9684J3389N7245q8288N1885J7654j9070
$$ -67899 -91149 -12423 -38029 -76325 -121254 -101570 -88181 -30936 -119224 -67339 -49685 -68755
6562f8755M7791q122k490p5244R409J20428j6565o4210n6896N0326l306R769M4195
$$ -68755 -20964 -29086 -31576 -106820 -97411 23017 6452 -57758 -114654 -64328 -67634 -57865 -13670
6549a3670m0593m4663m239P0217o0206L723j070n8739Q979R6983L2133Q660j3975
$$ -13670 -54263 -98926 -103165 -32948 -93154 -89431 -90501 -149240 -140261 -43278 -11145 -2485 -16460
6536a6460m8951k891j4482J6729J05556j9016k5139m7839j8688P9961j7644k0740
$$ -16460 -65411 -68302 -82784 -66055 39501 20485 -4654 -52493 -71181 8780 -8864 -29604
6524b9604j25104K9905M2170Q8590j5113l6727o2161R016Q2211m63j0459o4705
$$ -29604 -154708 -124803 -82633 5957 -9156 -45883 -108044 -99028 -16817 -17280 -27739 -92444
6512i2444j2713N7032J03597m7440n0992q0987j604M9384M2558r8913p0109r1877
$$ -92444 -105157 -48125 55472 8032 -42960 -123947 -125551 -76167 -33609 -132522 -202631 -294508
6500b94508J09415J43763J4963l8832m9122o6229Q3569J18668l2925J7308q2449
$$ -294508 -185093 -41330 -26367 -65199 -114321 -180550 -96981 21687 -11238 6070 -76379
6489g6379J2463n7479J01238n415m6666n4128J1397L3507m840P3750l7972q0146
$$ -76379 -63916 -121395 -20157 -25572 -72238 -126366 -114969 -81462 -86302 -12552 -50524 -130670
6477a30670K9417K5733l9637J799j13813P1857O871P6477J3096l9841p739J0027
$$ -130670 -101253 -75520 -115157 -113358 -227171 -155314 -148443 -71966 -58870 -98711 -106450 -96423
6465i6423l7432O1646K043n0033J4479P922K9992j5186k1069n8961M4091N1648
$$ -96423 -133855 -72209 -70166 -120199 -105720 -97798 -67806 -82992 -104061 -163022 -118931 -67283
6453f7283N2081j6020n4979p4913P8700m7375R945N8712j6136k2490n0713O8154
$$ -67283 -15202 -31222 -86201 -161114 -82414 -129789 -119844 -61132 -77268 -99758 -150471 -82317
6441h2317l4649L3440q9290J5651J08257M4113m5163q4452J895L2615R700J09014
$$ -82317 -116966 -83526 -172816 -157165 -48908 -4795 -49958 -134410 -132515 -99900 -90200 18814
6429A8814J767j19911J0729M3597k3703N4308m2303o2244j8155N1354R2238j4994
$$ 18814 20581 -99330 -88601 -45004 -68707 -14399 -56702 -118946 -137101 -85747 6491 -8503
6417h503O023o7198j5903K5656P9727j02641M9352j6874m5143Q5688K7539l5134
$$ -8503 -2480 -69678 -85581 -59925 19802 -82839 -33487 -50361 -95504 -9816 17723 -17411
6405a7411l4089K8753j21Q5500n9136p4152j32460J04711K7615L0174o6099n2
$$ -17411 -51500 -22747 -22868 62632 3496 -70656 -203116 -98405 -70790 -40616 -106715 -106767
6393a06767N5355J5199L4446k5766j8058p6827M9301q922J1894m0875j3345q2985
$$ -106767 -51412 -36213 -1767 -27533 -45591 -122418 -73117 -82039 -70145 -111020 -124365 -207350
6381b07350J32634Q5649j2393l9382n0460P297Q5812N1619p3382r0719j9074M8166
$$ -207350 -74716 10933 -1460 -40842 -91302 -84005 1807 53426 -19956 -110675 -129749 -81583
6369h1583J30051m535j19848j3024K1413J58314J25769l4811j43307j11778m3749
$$ -81583 48468 43933 -75915 -88939 -67526 90788 216557 181746 38439 -73339 -117088
6358a17088J15581J9975j3267j01736o8708K4694N4447J76589j21740l8649o2583
$$ -117088 -1507 18468 5201 -96535 -165243 -140549 -86102 90487 -31253 -69902 -132485
6347a32485l407M4400Q0305K5873l5988j09691M1617Q7005m7291L5653j2000n7188
$$ -132485 -135892 -91492 -11187 14686 -21302 -130993 -89376 -2371 -49662 -14009 -26009 -83197
6335h3197N6941J40113k3404r402j29817l151P8812M5664J6844j29131n9599M0200
$$ -83197 -26256 113857 90453 81051 -48766 -51917 26895 72559 89403 -39728 -99327 -59127
6323e9127O2566o9067n354n9938l3903K9368M9244Q4318k3487m509k2538j3957
$$ -59127 3439 -65628 -70982 -130920 -164823 -135455 -86211 -1893 -25380 -29889 -52427 -66384
6311f6384J28800K9543q9507n7560p852J9601J39646o3177k271R527l5398j4435
$$ -66384 62416 91959 2452 -55108 -62960 -43359 96287 33110 30839 40366 4968 -9467
6299i467L6107O4095j25969o5944l115J51789K1318O972p6673J8744K7807P168
$$ -9467 26640 90735 -35234 -101178 -104293 47496 68814 75786 -887 17857 45664 52832
6287E2832P7239p9491l1407k7713J06185m5974p7436j071J1989p751N1906P568
$$ 52832 130071 50580 19173 -8540 97645 51671 -25765 -26836 -14847 -22598 29308 36876
6275C6876j12329J03067K563l808O175l139M442N0692R5577m2909m8601m66m4668
$$ 36876 -75453 27614 30177 26369 32544 29405 33847 84539 180116 137207 88606 88140 43472
6262D3472M1759L3992O5306O1703M2264K5156J25039j5312L483j04710j31665
$$ 43472 85231 119223 184529 246232 288496 313652 438691 423379 426862 322152 190487
6251A90487l6713q474r753N5599J9779q4797O8291l4808N1328K5553O0664l1113
$$ 190487 153774 145300 135547 191146 210925 126128 194419 159611 210939 236492 297156 266043
6239B66043l9806P6693L5787O3725j8792M655l5490l7685l0330J5461p7891n8549
$$ 266043 226237 302930 338717 402442 383650 388305 352815 315130 284800 300261 222370 163821
6227A63821l3791J26999N7984L0198j22924l9924l2795Q27Q7399O071j5351n5368
$$ 163821 130030 257029 315013 345211 222287 182363 149568 150395 237794 243865 228514 173146
6215A73146O9258o647L6204j7940p1924k6177O9463M5945O7821k1524l3797L224
$$ 173146 242404 235757 271961 254021 182097 155920 225383 271328 339149 317625 283828 287052
6203B87052N2126L2863k4655n6800P270j2275N5052R8333L7471l6544O2215J59734
$$ 287052 339178 372041 347386 290586 297856 285581 340633 438966 476437 439893 502108 661842
6191F61842O6480J5530m1091M278J7055r6201o3489j228n2406n5732k0830l5958
$$ 661842 728322 743852 702761 707039 724094 627893 564404 563176 510770 455038 434208 398250
6179C98250K3917m705p8324K9847J00062J0263k3384n3764N52K0457J70375Q1229
$$ 398250 422167 417462 339138 368985 469047 479310 455926 402162 402714 423171 593546 674775
6167F74775O450n8827k635N6596R181K8657j00221q3343n9390O3815j6276o7642
$$ 674775 681225 622398 619763 676359 685540 714197 613976 530633 471243 535058 518782 451140
6155D51140j34609o2463k424P4206J9378N585j41317m8312R0927J14344J03392
$$ 451140 316531 254068 251644 325850 345228 350813 209496 161184 252111 366455 469847
6144D69847j03362j47470m647N7797N0372J8764j20598O785l0223J14818N6023
$$ 469847 366485 219015 214368 272165 322537 341301 220703 227488 197265 312083 368106
6133C68106m7982n7212K4384P7093J17030n088n0460n2748L5349L2116l6696j1741
$$ 368106 320124 262912 287296 364389 481419 476331 425871 373123 408472 440588 403892 392151
6121C92151r0856o9388O9341J32795J0104o409j47037l7950O62O3424J36539k0747
$$ 392151 301295 231907 301248 434043 444147 437738 290701 252751 253413 316837 453376 432629
6109D32629M547l813M7862K5325o163j06006p4333K3251J01585P4542l0531q3024
$$ 432629 437176 433363 481225 506550 500387 394381 320048 343299 444884 519426 488895 405871
6097D05871l7029K9472J10099J39536k7405K8522j1062M008o3641K2464O093k9445
$$ 405871 368842 398314 508413 647949 620544 649066 638004 642012 578371 600835 606928 577483
6085E77483k7305K8906Q1286k4546O409r203K8506J1617J2279L0695N398O4893
$$ 577483 550178 579084 660370 635824 642233 633030 661536 673153 685432 716127 721525 786418
6073G86418R2779R1014j5477n5341P810j8313J1226M3206p9178r9706O6310m086
$$ 786418 879197 970211 954734 899393 907203 888890 900116 943322 864144 764438 830748 826662
6061H26662m268j1183q6844l0267L0427J09145J0573K743j44226n0051M5588J23473
$$ 826662 822394 811211 724367 694100 724527 833672 844245 846988 702762 652711 698299 821772
6049H21772J00475k7314n6817N2898P5629J32880M268r09R4741J21633J04924
$$ 821772 922247 894933 838116 891014 966643 1099523 1103791 1102882 1197623 1319256 1424180
6038A424180M9193m1059j32503j09481r0363N0566m5176n3007p6646J9087j5260
$$ 1424180 1473373 1432314 1299811 1190330 1099967 1150533 1105357 1052350 975704 994791 979531
6027I79531O0878J362L3859j7101P436M3826J13814l4913l3319m307k2463O8346
$$ 979531 1040409 1041771 1075630 1058529 1065965 1109791 1223605 1188692 1155373 1151066 1128603 1196949
6015A196949N3020L5863m5723P4401k3140K7672O0601K1882M400K4106K3559l3113
$$ 1196949 1249969 1285832 1240109 1314510 1291370 1319042 1379643 1401525 1405925 1430031 1453590 1420477
6003A420477J07954M4401P5850o6003J8412P9290K1943l1348R618R851O7463R6997
$$ 1420477 1528431 1572832 1648682 1582679 1601091 1680381 1702324 1670976 1680594 1690445 1757908 1854905
5991A854905N9692J10195M8224N8764K6263M1737P8802K5644n1839O7276J07889
$$ 1854905 1914597 2024792 2073016 2131780 2158043 2199780 2278582 2304226 2252387 2319663 2427552
5980B427552R6695O9923O6935J6533J19529J09632P8215J01476K26739R8013J02526
$$ 2427552 2524247 2594170 2661105 2677638 2797167 2906799 2985014 3086490 3313229 3411242 3513768
5969C513768J36404J43930K22143J95670J00964J38734J36195m7570K19677L29666
$$ 3513768 3650172 3794102 4016245 4211915 4312879 4451613 4587808 4540238 4759915 5089581
5959E089581K90069L03493L58198L09767L50084N08162N76874P07770O78841J038846
$$ 5089581 5379650 5683143 6041341 6351108 6701192 7209354 7786228 8493998 9172839 10211685
5949A0211685J426504J910679K685369L954940N919189Q064531Q677218N978497
$$ 10211685 11638189 13548868 16234237 20189177 26108366 34172897 42850115 48828612
5941D8828612P61940m055303o872104o961762n650049m120773k989298k178076
$$ 48828612 49590552 45535249 38663145 31701383 26051334 21930561 18941263 16763187
5933A6763187j457527r11307k55378K14455P24429J120100J761379K737359M527947
$$ 16763187 15305660 14394353 14138975 14353430 15077859 16197959 17959338 20696697 25224644
5924B5224644O994596Q977508Q465780M347949j430533o005707q102497p698601
$$ 25224644 32219240 41196748 49662528 54010477 52579944 46574237 38471740 30773139
5916C0773139o016959m500277l214726k420014j758124j433902r97938o10071
$$ 30773139 24756180 20255903 17041177 14621163 12863039 11429137 10431199 9821128
5908I821128m07786k15983k81125l83325k01965j1006N9965N8469J3106J53697
$$ 9821128 9413342 9197359 8916234 8532909 8330944 8319938 8379903 8438372 8451478 8605175
5898H605175J57920K54011K22691K13653J35161J36091L10588L66724O07517N97620
$$ 8605175 8763095 9017106 9239797 9453450 9588611 9724702 10035290 10402014 11009531 11607151
5888A1607151N88383O80340Q33283J011324J108392J361280J571571K138595K961194
$$ 11607151 12195534 12875874 13709157 14720481 15828873 17190153 18761724 20900319 23861513
5879B3861513L829508N131673P256397J0767986J5050806J6994274J3420212M622203
$$ 23861513 27691021 32822694 40079091 50847077 65897883 82892157 96312369 100934572
5871A00934572n131900j1832334j4031414j2435130r617241p170580n103655l570611
$$ 100934572 95802672 83970338 69938924 57503794 47886553 40715973 35612318 32041707
5863C2041707k293510j259784j23338P41465J980735L214924N034413P758314
$$ 32041707 29748197 28488413 28365075 29106540 31087275 34302199 39336612 47094926
5855D7094926J1953738J5926309J6407607J0790819P23685q811376j4444912j5359563
$$ 47094926 59048664 74974973 91382580 102173399 102897084 94085708 79640796 64281233
5847F4281233j3058502j0069286p696766n754556m373931l368465k501096j791306
$$ 64281233 51222731 41153445 33456679 27702123 23328192 19959727 17458631 15667325
5839A5667325j411267j231481j045363p62226o07657n21569n68757n32776m78966
$$ 15667325 14256058 13024577 11979214 11216988 10609331 10087762 9519005 8986229 8507263
5830H507263m03500l52150l33065k37584j95488k41850j89021j28508j166r6083
$$ 8507263 8103763 7751613 7418548 7180964 6985476 6743626 6554605 6426097 6424931 6328848
5820F328848j60961j95262m5537Q663j5780p7783m5074n2972p7631Q7282k5207
$$ 6328848 6167887 5972625 5927088 5935751 5919971 5842188 5797114 5744142 5666511 5753793 5728586
5809E728586j45450k10557j23931O4206O858j37771j85450m6423m6439m738k2904
$$ 5728586 5583136 5372579 5248648 5312854 5319712 5181941 4996491 4950068 4903629 4898891 4875987
5798D875987n324m1039k3240O4536J9276J18129O1192J33943N9870J18156J41622
$$ 4875987 4870663 4829624 4806384 4870920 4890196 5008325 5069517 5203460 5263330 5381486 5523108
5787E523108l960P550M4373J34926K24516J29750J41091K08929J73233L52029
$$ 5523108 5519148 5526698 5571071 5705997 5930513 6060263 6201354 6410283 6583516 6935545
5777F935545K87733K28136K48828K42681L65408M02193M73956N75838O00299O69994
$$ 6935545 7223278 7451414 7700242 7942923 8308331 8710524 9184480 9760318 10360617 11030611
5767A1030611O92553Q78811R96805J176289J356266J616697K088386K826492L861337
$$ 11030611 11723164 12601975 13598780 14775069 16131335 17748032 19836418 22662910 26524247
5758B6524247N370362P656100J0561809J2949695J2968081R614196L320777l586061
$$ 26524247 31894609 39550709 50112518 63062213 76030294 85644490 88965267 85379206
5750H5379206q979935j1489096j1319421r649050p406278n534015m066604k942806
$$ 85379206 76399271 64910175 53590754 43941704 36535426 31001411 26934807 23992001
5742B3992001k045064j433032q83878o30051m19119j58976J56080J90791M23015
$$ 23992001 21946937 20513905 19630027 18999976 18580857 18421881 18577961 18768752 19191767
5733A9191767O18182Q27813J199040J617234K434016L436493N084529P514073
$$ 19191767 19809949 20637762 21836802 23454036 25888052 29324545 34409074 41923147
5725D1923147J0699831J3525824J4195904J1331747N097598k556674q760704j2107602
$$ 41923147 52622978 66148802 80344706 91676453 96774051 94217377 85456673 73349071
5717G3349071j2286316j0869899q912191p081101n450591m110327l110715k378231
$$ 73349071 61062755 50192856 41280665 34199564 28748973 24638646 21527931 19149700
5709A9149700j740388j301440j103390r83645q48619o45396n83120m24672m49411
$$ 19149700 17409312 16107872 15004482 14020837 13172218 12526822 11943702 11519030 11069619
5700A1069619k97448r2202j823L1171J75323J68050L41216L58276Q40161R22760
$$ 11069619 10772171 10679969 10678146 10709317 10884640 11052690 11393906 11752182 12592343 13515103
5690A3515103J271623J932941K902020M445192N936656O716702N628432K948877
$$ 13515103 14786726 16719667 19621687 24066879 30003535 36720237 42348669 45297546
5682D5297546p44309l840777n549219n798469n143959m002022l008708k086441
$$ 45297546 44553237 40712460 35163241 29364772 24220813 20218791 17210083 15123642
5674A5123642j553151j104359q19970o29841l25035k05515k17962p0409J0940
$$ 15123642 13570491 12466132 11646162 11016321 10691286 10485771 10267809 10197400 10208340
5665A0208340J5703K18292L06905N48260P24684J058972J439731K101281L287959
$$ 10208340 10224043 10442335 10749240 11297500 12022184 13081156 14520887 16622168 19910127
5656A9910127M930466O840888P730500O973926M223602o1402m104634o516228
$$ 19910127 24840593 31681481 39411981 46385907 50609509 50548107 46443473 39927245
$$ [...]
##END NTUPLES=NMR SPECTRUM
##END=
