##TITLE=1H_DE-80H_X3
 200.13MHz, d2o
 8 sc
 
 19ns.26.2.2025
##JCAMPDX= 6.0         $$ Bruker NMR JCAMP-DX V2.0
##DATA TYPE= NMR SPECTRUM
##DATA CLASS= NTUPLES
##ORIGIN= UXNMR, Bruker Analytische Messtechnik GmbH
##OWNER= pz
$$ XWIN-NMR		Version 3.5
$$ Fri Dec 26 10:13:05 2025 Russian Standard Time (UT+4h)  Yarkov@DPX200
##.OBSERVE FREQUENCY= 200.1313
##.OBSERVE NUCLEUS= ^1H
##.ACQUISITION MODE= SIMULTANEOUS
##.ACQUISITION SCHEME= undefined
##.AVERAGES= 8
##.DIGITISER RES= 18
##SPECTROMETER/DATA SYSTEM= spect
##.PULSE SEQUENCE= zg30
##.SOLVENT NAME= CDCl3
##.SHIFT REFERENCE= (INTERNAL, CDCl3, 0, 15.4692)
##AUDIT TRAIL= $$ (NUMBER, WHEN, WHO, WHERE, WHAT)
$$ ##TITLE= Audit trail, XWIN-NMR		Version 3.5
$$ ##JCAMPDX= 5.01
$$ ##ORIGIN= Bruker BioSpin GmbH
$$ ##OWNER= Yarkov
$$ C:/Bruker/XWIN-NMR/data/yarkov2/nmr/H-C/1/pdata/1/auditp.txt
$$ ##AUDIT TRAIL=  $$ (NUMBER, WHEN, WHO, WHERE, WHAT)
(   1,<2025-12-26 10:11:57.37 +0400>,<Yarkov>,<DPX200>,
      <created by zg, POWCHK disabled, PULCHK disabled
       configuration hash MD5:
       00 E9 B6 7A A2 85 ED C7 34 08 36 98 17 FE 4E 26
       data hash MD5: 16K
       74 11 64 FD 38 56 40 EF 41 B4 E0 8B CC CA 12 1A>)
(   2,<2025-12-26 10:12:03.96 +0400>,<Yarkov>,<DPX200>,
      <Start of raw data processing
       efp BC_mod = 2 LB = 0.25 FT_mod = 6 PKNL = 1 PHC0 = -5306.155 PHC1 = 10.82193 SI = 16K 
       data hash MD5: 16K
       A5 5C 8D 71 CC 91 19 94 E1 DF 96 9F 4B 12 6B C5>)
$$ ##END=
$$ 
$$ hash MD5
$$ E1 A1 50 92 40 C5 95 F1 01 84 FB 53 D1 EE B6 93
##$RELAX= 
##$RELAX= 
##$RELAX= 
##$RELAX= 
##$RELAX= 
##$RELAX= 
$$ Bruker specific parameters
$$ --------------------------
##$DU= <C:/Bruker/XWIN-NMR>
##$EXPNO= 1
##$NAME= <H-C>
##$PROCNO= 1
##$TYPE= <nmr>
##$USER= <yarkov2>
##$AMP= (0..31)
100 100 100 100 100 100 100 100 100 100 100 100 100 100 100 100 100 100 
100 100 100 100 100 100 100 100 100 100 100 100 100 100 
##$AQSEQ= 0
##$AQ_mod= 1
##$AUNM= <au_zg>
##$AUTOPOS= <>
##$BF1= 200.13
##$BF2= 200.13
##$BF3= 200.13
##$BF4= 200.13
##$BF5= 200.13
##$BF6= 200.13
##$BF7= 200.13
##$BF8= 200.13
##$BYTORDA= 1
##$CFDGTYP= 0
##$CFRGTYP= 5
##$CHEMSTR= <none>
##$CNST= (0..31)
1 1 145 1 1 1 1 1 1 1 1 1 1 1 1 1 1 1 1 1 1 1 1 1 1 1 1 1 1 1 1 1 
##$CPDPRG= <>
##$CPDPRG1= <>
##$CPDPRG2= <>
##$CPDPRG3= <>
##$CPDPRG4= <mlev>
##$CPDPRG5= <mlev>
##$CPDPRG6= <mlev>
##$CPDPRG7= <mlev>
##$CPDPRG8= <mlev>
##$CPDPRGB= <>
##$CPDPRGT= <>
##$D= (0..31)
0 0.7 0 0 0 0 0 0 0 0 0 0.03 0 0 0 0 0 0 0 0 0 0 0 0 0 0 0 0 0 0 0 0 
##$DATE= 1766729516
##$DBL= (0..7)
120 120 120 120 120 120 120 120 
##$DBP= (0..7)
150 150 150 150 150 150 150 150 
##$DBP07= 0
##$DBPNAM0= <>
##$DBPNAM1= <>
##$DBPNAM2= <>
##$DBPNAM3= <>
##$DBPNAM4= <>
##$DBPNAM5= <>
##$DBPNAM6= <>
##$DBPNAM7= <>
##$DBPOAL= (0..7)
0.5 0.5 0.5 0.5 0.5 0.5 0.5 0.5 
##$DBPOFFS= (0..7)
0 0 0 0 0 0 0 0 
##$DE= 6
##$DECBNUC= <off>
##$DECIM= 32
##$DECNUC= <off>
##$DECSTAT= 4
##$DIGMOD= 1
##$DIGTYP= 9
##$DL= (0..7)
0 120 120 120 120 120 120 120 
##$DP= (0..7)
$$ [...]
##$SUBNAM2= <"">
##$SUBNAM3= <"">
##$SUBNAM4= <"">
##$SUBNAM5= <"">
##$SUBNAM6= <"">
##$SUBNAM7= <"">
##$SUBNAM8= <"">
##$SUBNAM9= <"">
##$SW= 18.0517328524113
##$SWIBOX= (0..15)
0 0 2 0 0 0 0 0 0 0 0 0 0 0 0 0 
##$SW_h= 3612.71676300578
##$TD= 16384
##$TD0= 1
##$TE= 0
##$TE2= 300
##$TE3= 300
##$TEG= 300
##$TL= (0..7)
0 120 120 120 120 120 120 120 
##$TP= (0..7)
150 150 150 150 150 150 150 150 
##$TP07= 0
##$TPNAME0= <>
##$TPNAME1= <>
##$TPNAME2= <>
##$TPNAME3= <>
##$TPNAME4= <>
##$TPNAME5= <>
##$TPNAME6= <>
##$TPNAME7= <>
##$TPOAL= (0..7)
0.5 0.5 0.5 0.5 0.5 0.5 0.5 0.5 
##$TPOFFS= (0..7)
0 0 0 0 0 0 0 0 
##$TUNHIN= 0
##$TUNHOUT= 0
##$TUNXOUT= 0
##$USERA1= <user>
##$USERA2= <user>
##$USERA3= <user>
##$USERA4= <user>
##$USERA5= <user>
##$V9= 5
##$VALIST= <valist>
##$VCLIST= <CCCCCCCCCCCCCCC>
##$VD= 0
##$VDLIST= <DDDDDDDDDDDDDDD>
##$VPLIST= <PPPPPPPPPPPPPPP>
##$VTLIST= <TTTTTTTTTTTTTTT>
##$WBST= 1024
##$WBSW= 4
##$XGAIN= (0..3)
0 0 0 0 
##$XL= 0
##$YL= 0
##$YMAX_a= 47362
##$YMIN_a= -33955
##$ZGOPTNS= <>
##$ZL1= 120
##$ZL2= 120
##$ZL3= 120
##$ZL4= 120
##$ABSF1= 0
##$ABSF2= 0
##$ABSG= 0
##$ABSL= 0
##$ALPHA= 0
##$AQORDER= 0
##$ASSFAC= 0
##$ASSFACI= 0
##$ASSFACX= 0
##$ASSWID= 0
##$AUNMP= <proc_1d>
##$AZFE= 0.1
##$AZFW= 0.1
##$BCFW= 0
##$BC_mod= 2
##$BYTORDP= 0
##$COROFFS= 0
##$CY= -3
##$DATMOD= 1
##$DC= 0
##$DFILT= <>
##$DTYPP= 0
##$F1P= 0
##$F2P= 0
##$FCOR= 1
##$FTSIZE= 16384
##$FT_mod= 6
##$GAMMA= 0
##$GB= 0
##$INTBC= 1
##$INTSCL= 3.241238e-09
##$ISEN= 128
##$LB= 0.25
##$LEV0= 0
##$LPBIN= 0
##$MAXI= 10000
##$MC2= 0
##$MEAN= 0
##$ME_mod= 0
##$MI= 1.114404
##$NCOEF= 0
##$NC_proc= -8
##$NLEV= 6
##$NOISF1= 3.799351
##$NOISF2= 2.8
##$NSP= 0
##$NTH_PI= 0
##$NZP= 0
##$OFFSET= 15.46924
##$PC= 1
##$PHC0= -5306.155
##$PHC1= 10.82193
##$PH_mod= 1
##$PKNL= yes
##$PPARMOD= 0
##$PSCAL= 0
##$PSIGN= 0
##$REVERSE= no
##$SF= 200.130010499718
##$SI= 16384
##$SIGF1= 3
##$SIGF2= 2
##$SINO= 0.751879
##$SIOLD= 32768
##$SREGLST= <19F.Aceton>
##$SSB= 0
##$STSI= 16384
##$STSR= 0
##$SW_p= 3612.71676300578
##$SYMM= 0
##$S_DEV= 0
##$TDeff= 16384
##$TDoff= 0
##$TI= <>
##$TILT= no
##$TM1= 0
##$TM2= 0
##$TOPLEV= 0
##$USERP1= <user>
##$USERP2= <user>
##$USERP3= <user>
##$USERP4= <user>
##$USERP5= <user>
##$WDW= 1
##$XDIM= 16384
##$YMAX_p= 517931907
##$YMIN_p= -959910
$$ End of Bruker specific parameters
$$ ---------------------------------
##NTUPLES= NMR SPECTRUM
##VAR_NAME=  FREQUENCY,     SPECTRUM/REAL,   SPECTRUM/IMAG
##SYMBOL=    X,             R,               I
##VAR_TYPE=  INDEPENDENT,   DEPENDENT,       DEPENDENT
##VAR_FORM=  AFFN,          ASDF,            ASDF
##VAR_DIM=   16384,         16384,           16384
##UNITS=     HZ,            ARBITRARY UNITS, ARBITRARY UNITS
##FACTOR=    0.220516191357247, 1,           1
##FIRST=     3095.8592013669, 0,             0
##LAST=      -516.857561638876, 0,           0
##MIN=       -516.857561638876, -959910,     0
##MAX=       3095.8592013669, 517931907,     0
$$ Real data points
##PAGE= N=1
##DATA TABLE= (X++(R..R)), XYDATA
$$ [...]
5366I87844j38287j82762K28581p6015m3551R0086j65770j43176K91123J40027
$$ 987844 849557 666795 895376 819361 775810 865896 700126 556950 848073 988100
5356I88100m8550j48996J38892j6707J11128J27822j24456k34235J73439j19249
$$ 988100 939550 790554 929446 912739 1023867 1151689 1027233 792998 966437 847188
5346H47188Q2796q3680j43382K30402J85343j67876q3834J88894j52230l17161
$$ 847188 929984 846304 702922 933324 1118667 950791 866957 1055851 903621 586460
5336E86460N6015J28019l0846J53665M7582N8252J07712k04203O1400n6246k1971
$$ 586460 642475 770494 739648 893313 940895 999147 1106859 902656 964056 907810 885839
5325H85839N3066k15945K42188j21598L14439K76891n49564j74476J05686l87675
$$ 885839 938905 722960 965148 843550 1157989 1434880 885316 710840 816526 428851
5315D28851P4361N5416N5030O1459k15497K59899J10433r9647L00910o0598l31735
$$ 428851 503212 558628 613658 675117 459620 719519 829952 730305 1031215 970617 638882
5304F38882j07993K90543o4216Q9068J03585j79060l4857J80566k24574J85798
$$ 638882 530889 821432 757216 846284 949869 770809 735952 916518 691944 877742
5294H77742o3183J0297K9959j53916N4292K25743j78741p2006K01887j39951j21289
$$ 877742 814559 824856 854815 700899 755191 980934 802193 730187 932074 792123 670834
5283F70834n2968K67899o1286q7724N23799m18663k56926R4315j73075J30752
$$ 670834 617866 885765 824479 736755 1260554 841891 584965 679280 506205 636957
5273F36957M3397j04262L33785k29068j45618M52031j17127K1931J4196l13165
$$ 636957 680354 576092 909877 680809 535191 987222 870095 892026 906222 593057
5263E93057J68838K5082J17327J45246k90590K14328P0699j83263K68636j47919
$$ 593057 761895 786977 904304 1049550 758960 973288 1043987 860724 1129360 981441
5253I81441j50750q1611k34427J96647j3632l54150L85376o0850j22743M37834
$$ 981441 830691 749080 514653 711300 697668 343518 728894 668044 545301 983135
5243I83135m35417k2786N18229j8959j39897J30719j39692j17965r135K60947
$$ 983135 547718 524932 1043161 1024202 884305 1015024 875332 757367 748232 1009179
5233A009179J7937l44947J03380K9369j39492L47502l21349P8876p063j27449
$$ 1009179 1027116 682169 785549 814918 675426 1022928 701579 780455 773392 645943
5223F45943L29381j65867M6587L31446n51479L648K80233l12243J93336p94m32759
$$ 645943 975324 809457 856044 1187490 636011 639659 919892 607649 800985 800191 367432
5212C67432J45548J97483o1807J96744J61983k11141J81870j83598L63499J9811
$$ 367432 512980 710463 648656 845400 1007383 796242 978112 794514 1158013 1177824
5202A177824m00589p1455n3318K82268l9798j79560N00926k59062O3578J28598
$$ 1177824 777235 705780 652462 934730 894932 715372 1216298 957236 1020814 1149412
5192A149412o20922J27917L29325l26035J19184K4391N834K24131p0693R3545
$$ 1149412 528490 656407 985732 659697 778881 803272 809106 1033237 962544 1056089
5182A056089j72984J08403K68761j26098n02449n091K23225o2511l10963N59203
$$ 1056089 883105 991508 1260269 1134171 631722 626631 849856 787345 476382 1035585
5172A035585p9111m48186K04738K11836k53059J64928J19382k36304J96942L04171
$$ 1035585 956474 508288 713026 924862 671803 836731 956113 719809 916751 1220922
5162A220922l71409k77689L9294J69400j9414l28787L92328K62034l49012P2629
$$ 1220922 849513 571824 611118 780518 761104 432317 824645 1086679 737667 810296
5152H10296K19771m92129J0317N01153n4860p24748L42854J33137l59820r809
$$ 810296 1030067 537938 548255 1049408 994548 269800 612654 745791 385971 376162
5142C76162M24239o3819k13707Q2289J07666j08214l22154M45583K945m55639
$$ 376162 800401 736582 522875 605164 712830 604616 282462 728045 730990 275351
5132B75351N70309M69701o90224J12850O70259l96955o57547P33871p2748l82448
$$ 275351 845660 1315361 625137 737987 1408246 1011291 353744 1087615 1014867 632419
5122F32419J56866J65722m18870r4400K85643O2614k33125J78473K75941k97240
$$ 632419 789285 955007 536137 441737 727380 789994 556869 735342 1011283 714043
5112G14043R5842M40781j94445l29785N17305j22372o44052K65404M21480l13698
$$ 714043 809885 1250666 1056221 726436 1243741 1121369 477317 742721 1164201 850503
5102H50503k20703j2161k17470J27419K34488K67625l8814j17790L38621j7002
$$ 850503 629800 617639 400169 527588 762076 1029701 990887 873097 1211718 1194716
5092A194716m94148J77448J43491r8872l5938J74130m54985j1100L60400j14516
$$ 1194716 700568 878016 1021507 922635 886697 1060827 605842 594742 955142 840626
5082H40626l41956K25395R5064l06765J49155J76467k0449l64361P6027K03442
$$ 840626 498670 724065 819129 512364 661519 837986 817537 453176 529203 732645
5072G32645j28031j96540L06763m249L5310K86836l7311k36741j5095M8643n8870
$$ 732645 604614 408074 714837 710588 745898 1032734 995423 758682 743587 792230 733360
5061G33360j56531L09812O3066k31730P1837j81951k31532N57458m779l16486
$$ 733360 576829 886641 949707 717977 789814 607863 376331 933789 929010 612524
5051F12524j95414K57850M9463j39060l7897K67395j51196j19002N60251l96447
$$ 612524 417110 674960 724423 585363 547466 814861 663665 544663 1104914 708467
5041G08467m38471L30691R1003p7466J30632J65200K1404j17013J05060P4470
$$ 708467 269996 600687 691690 614224 744856 910056 931460 814447 919507 993977
5031I93977j60864Q6639K9608p2035J08328r7840J57183q0069j731P816j75930
$$ 993977 833113 919752 949360 877325 985653 887813 1044996 964927 963196 971012 795082
5020G95082n1192M86758j91192j76623P8837k01945j19513O708K71269j16728
$$ 795082 743890 1230648 1039456 862833 941670 739725 620212 626920 898189 781461
5010G81461k12891J46670J57285m84758K27800J14441j50733K31594J54067k62576
$$ 781461 568570 715240 872525 387767 615567 730008 579275 810869 964936 702360
5000G02360k74752J67690L17191j71859j9596L56485j23706j34686k77958K3165
$$ 702360 427608 595298 912489 740630 721034 1077519 953813 819127 541169 564334
4990E64334j83578o8258N43865K56603j06279K4717L4128l291j64712J96990j99519
$$ 564334 380756 312498 856363 1112966 1006687 1031404 1065532 1062241 897529 1094519 895000
4979H95000m97663J56110M0360o0085j0294m9998J97775K33460j20811K77909
$$ 895000 397337 553447 593807 533722 523428 473430 671205 904665 783854 1061763
4969A061763k51841J39577K32656k94797k44128P3212p4401J81750J44363J18374
$$ 1061763 809922 949499 1182155 887358 643230 716442 642041 823791 968154 1086528
4959A086528K6947l50623j1111J05667m01120K51054J37960o4372J12561l02476
$$ 1086528 1113475 762852 751741 857408 456288 707342 845302 780930 893491 591015
4949E91015J43216O6803o9912L09647q0558j24328K33601m01998P5778K90970
$$ 591015 734231 801034 731122 1040769 960211 835883 1069484 667486 743264 1034234
4939A034234j3300L7567k53766J68540M5076j59498K19417j98501k36786J95537
$$ 1034234 1020934 1058501 804735 973275 1018351 858853 1078270 879769 642983 838520
4929H38520M3557k9455J82214k22734R6513L8394N611J0631j19735R443J18021
$$ 838520 882077 852622 1034836 812102 908615 947009 952620 963251 843516 852959 970980
4918I70980m03907L79306K93335m72195K9364k59253M6695L77410j43428j34883
$$ 970980 567073 946379 1239714 767519 796883 537630 584325 961735 818307 683424
4908F83424r382l30970L4515R1556j07932L12261R3101l63292O4009J02477j1265
$$ 683424 674042 343072 377587 469143 361211 673472 766573 403281 467290 569767 558502
4897E58502K24953J89162M2469k25182Q3180K63280k89455j83250O8846j27324
$$ 558502 783455 972617 1015086 789904 873084 1136364 846909 663659 732505 605181
4887F05181K88746n785o8081J14904j26702J64648K15635n23444J47031K13557
$$ 605181 893927 888142 820061 934965 808263 972911 1188546 665102 812133 1025690
4877A025690m06375k42391M59615j31275k37068K83270k10325k36552M80998m7146
$$ 1025690 619315 376924 836539 705264 468196 751466 541141 304589 785587 738441
4867G38441L9253n3344p1835J27027j19716j28701N15689q5652k52829L41324
$$ 738441 777694 724350 652515 779542 659826 531125 1046814 961162 708333 1049657
4857A049657K51650n42423k83862N35350l81859k22220L34794K35259l48163K31688
$$ 1049657 1301307 758884 475022 1010372 628513 406293 741087 976346 628183 859871
4847H59871R1460j81610M34306k57708k37546j42452K59744K00730p91591L05269
$$ 859871 951331 769721 1204027 946319 708773 566321 826065 1026795 235204 540473
4837E40473L76142K916k72911K08292K7793n51545J01557N36075k20601k5617
$$ 540473 916615 919531 646620 854912 882705 331160 432717 968792 748191 722574
4827G22574K74742l06901j38943J04271M2940P0080l2353l2227J64954n2602m7633
$$ 722574 997316 690415 551472 655743 698683 768763 736410 704183 869137 816535 768902
4816G68902L3716l34349k12895O63978Q3402k65932K88730j38321l59368r5799
$$ 768902 802618 468269 255374 919352 1002754 736822 1025552 887231 527863 432064
4806D32064K82892j6231N2992J19547J99029j39751k24636k31142K12257J5353
$$ 432064 714956 698725 751717 871264 1070293 930542 705906 474764 687021 702374
4796G02374J95785Q539k05244k11176L81256j38765k89139K28921M26445k37624
$$ 702374 898159 906698 701454 490278 871534 732769 443630 672551 1098996 861372
4786H61372j44261j63736m1841M31979l82855L8911M69603l84027j94881K28423
$$ 861372 717111 553375 511534 943513 560658 599569 1069172 685145 490264 718687
4776G18687k83415L05270M3524q0300L45029J44863k01583m47417l6136L29416
$$ 718687 435272 740542 784066 703766 1048795 1193658 992075 544658 508522 837938
4766H37938K40351k75393N0934K99450j90275r1889j56235m6537R3430K6010L01492
$$ 837938 1078289 802896 853830 1153280 963005 871116 714881 668344 761774 787784 1089276
4755A089276r9135j657J66340m88233O6336K97160j44490j57242J88177j22965
$$ 1089276 990141 988484 1154824 666591 732927 1030087 885597 728355 916532 793567
4745G93567Q6654j46467M307J56925k34261J29021N07065o51253k0173R8940J22760
$$ 793567 880221 733754 738061 894986 660725 789746 1296811 645558 625385 724325 847085
4734H47085J49035j82572J08047k58206j18357L93649k01976q9834L05408k26736
$$ 847085 996120 813548 921595 663389 545032 938681 736705 646871 952279 725543
4724G25543l4224k10218m2654O05703j77353k42559L03222k40655L33438J25862
$$ 725543 691319 481101 438447 1044150 866797 624238 927460 686805 1020243 1146105
4714A146105k86079K5582j23329k13983K12171K10179j9820n4608k65318j23802
$$ 1146105 860026 885608 762279 548296 760467 970646 950826 896218 630900 507098
4704E07098K42429J68716r6723K76986L3461q0818Q0173j97296r7310K47325P311
$$ 507098 749527 918243 821520 1098506 1131967 1051149 1131322 934026 836716 1084041 1091352
4693A091352n7511j92128J34864j68998j06994P2496j24206K09922M0469k83106
$$ 1091352 1033841 841713 976577 807579 700585 773081 648875 858797 899266 616160
4683F16160N06084J58265n33596L97567j8698k36402J71958p1971r2654J50309
$$ 616160 1122244 1280509 746913 1144480 1125782 889380 1061338 989367 896713 1047022
4673A047022l22790K12462J66945k78104P6445p5915k24118j9770K32430L21301
$$ 1047022 724232 936694 1103639 825535 901980 826065 601947 582177 814607 1135908
4663A135908o4513k48736K14686l20065O1265J08516K9853L60057j868k41540
$$ 1135908 1071395 822659 1037345 717280 778545 887061 916914 1276971 1275103 1033563
4653A033563P7807O3545k29552q9806l97662J02082L04704m29966J32592K12232
$$ 1033563 1111370 1174915 945363 855557 457895 559977 864681 434715 567307 779539
4643G79539J23696n8722j66113j15879J78359J14915J31699N6428j53996j0400
$$ 779539 903235 844513 678400 562521 740880 855795 987494 1043922 889926 879526
4633H79526n9229l8751p0599K12575J07663k39244m31788J24441J55572j51337
$$ 879526 820297 781546 710947 923522 1031185 791941 360153 484594 640166 488829
4623D88829K34488R6909q933J54189l92528L59242J60492j86310L36039l73349
$$ 488829 723317 820226 811293 965482 572954 932196 1092688 906378 1242417 869068
4613H69068n3670M08336j84240r2371K01436r6548o1391m5168Q5541J37454n49261
$$ 869068 815398 1223734 1039494 947123 1148559 1052011 990620 945452 1030993 1168447 619186
4602F19186M21990j4254k46416J59173J5563l1668l16260J46655K03354l83347
$$ 619186 1041176 1026922 780506 939679 955242 923574 607314 753969 957323 573976
4592E73976K99027L68978l11357K36360L60123m13970k03457L17600j2646m39721
$$ 573976 873003 1241981 930624 1166984 1527107 1113137 909680 1227280 1214634 774913
4582G74913L4435J7763k17824J08570L23015J0621j27789j30573J04133l35107
$$ 774913 809348 827111 609287 717857 1040872 1051493 923704 793131 897264 562157
4572E62157J39541K88181j04703j83753p0734K71757q0971j96346L49983j94684
$$ 562157 701698 989879 885176 701423 630689 902446 821475 625129 975112 780428
4562G80428k20809M36719j06665q6307p33J03806j4624j92717j96859L62383K841
$$ 780428 559619 996338 889673 803366 802633 906439 891815 699098 502239 864622 867463
4551H67463r1990L42476k99524j57563L21996J84433J81352j70341l97754n4816
$$ 867463 775473 1117949 818425 660862 982858 1167291 1348643 1178302 780548 725732
4541G25732J92936o8270N4880m5854n32536K0474L81030j18578L3738O7921J70645
$$ 725732 918668 850398 905278 859424 326888 347362 728392 609814 643552 711473 882118
4530H82118J86592j323O6346j44286p0563m6928j17373J62636n7800k20761L43335
$$ 882118 1068710 1067387 1133733 989447 918884 871956 754583 917219 859419 638658 981993
4519I81993q3607j70979K57069l26653k6122L56112j105l12744J33449L3668O8998
$$ 981993 898386 727407 984476 657823 631701 987813 986708 673964 807413 841081 910079
4508I10079K11876j09895L41967j50624K5015J14930m04135R3298K27962Q3127
$$ 910079 1121955 1012060 1354027 1203403 1228418 1343348 939213 1032511 1260473 1343600
4498A343600l25146j50666K66132j05907l77346L91087j93889j60744N85583k83755
$$ 1343600 1018454 867788 1133920 1028013 650667 1041754 847865 687121 1272704 988949
4488I88949k53507K90530j51220J36209J4906L96196K38531r25760j18781M80476
$$ 988949 735442 1025972 874752 1010961 1025867 1422063 1660594 734834 616053 1096529
4478A096529k17360R0119K51686j77988k665k9286m4057J1189k06822J59907J35567
$$ 1096529 879169 969288 1220974 1042986 1040321 1011035 966978 978167 771345 931252 1066819
4467A066819k8435P5035J31115p5548l3823K87484j65589l73594K68834q046j53067
$$ 1066819 1038384 1113419 1244534 1168986 1135163 1422647 1257058 883464 1152298 1144252 991185
4456I91185J69025m0014K16838j69292k44242k6441K38035p898k96289K59358
$$ 991185 1160210 1120196 1337034 1167742 923500 897059 1135094 1127196 830907 1090265
4446A090265j47168J22253K81865O8465p2673j04616J32434j80285q5706J84873
$$ 1090265 943097 1065350 1347215 1415680 1343007 1238391 1370825 1190540 1104834 1289707
4436A289707K11754l03107j49831K31229m37260R6237L41413j46586j09397L8559
$$ 1289707 1501461 1198354 1048523 1279752 842492 938729 1280142 1133556 1024159 1062718
4426A062718L8306j72682n6379K27031M9501k99736K81120K77541n12706n4589
$$ 1062718 1101024 928342 871963 1098994 1148495 848759 1129879 1407420 894714 840125
4416H40125K22902k50773o1291M65011j19119k22813j60918J72555O6681l60957
$$ 840125 1063027 812254 750963 1215974 1096855 874042 713124 885679 952360 591403
4406E91403M24730P7218k48420K52944K69774k17863J8166L20862J87541k30164
$$ 591403 1016133 1093351 844931 1097875 1367649 1149786 1167952 1488814 1676355 1446191
4396A446191N3680J86092k56839l99896K51779l0513l1457K64663J15653l72994
$$ 1446191 1499871 1685963 1429124 1029228 1281007 1250494 1219037 1483700 1599353 1226359
4386A226359k25049J33541M5592k95959J02590J63765j81183K80659N2169o3255
$$ 1226359 1001310 1134851 1180443 884484 987074 1150839 969656 1250315 1302484 1239229
4376A239229J08179j62806q1984j08678j76233N28854l96550l43565L66357l17745
$$ 1239229 1347408 1184602 1102618 993940 817707 1346561 950011 606446 972803 655058
4366F55058J31175L85103j852J74207k87869k98500M26574n34952K65692J33659
$$ 655058 786233 1171336 1169484 1343691 1055822 757322 1183896 648944 914636 1048295
4356A048295k63023L66187m05465J40941K70145l25494L44227j57566p2303K9642
$$ 1048295 785272 1151459 745994 886935 1157080 831586 1175813 1018247 945944 975586
4346I75586j01721K85253j12915j00502L30402m9844k11965j07750j50835K56261
$$ 975586 873865 1159118 1046203 945701 1276103 1226259 1014294 906544 755709 1011970
4336A011970J72939k93710L9446r2390K45653K35322j81032K30012O8693l84079
$$ 1011970 1184909 891199 930645 838255 1083908 1319230 1138198 1368210 1436903 1052824
4326A052824N08722J51868k30764J76322r7467N61967K22629j05664p535m21808
$$ 1052824 1561546 1713414 1482650 1658972 1561505 2123472 2346101 2240437 2232902 1811094
4316A811094j92600J44708o20910j18801M581J64779O2093k01967J71614N7772
$$ 1811094 1618494 1763202 1142292 1023491 1028072 1192851 1254944 1052977 1224591 1282363
4306A282363k19262N5094j4970j06143M41510j06988j54991J30734m06354l9969
$$ 1282363 1063101 1118195 1103225 997082 1438592 1331604 1176613 1307347 900993 861024
4296H61024L05449l7148J64075j91327L5849M71745m67036j15018N9646j05413
$$ 861024 1166473 1129325 1293400 1102073 1137922 1609667 1142631 1027613 1087259 981846
4286I81846j4101P3797m1782n7810k16366O00322k91645j06118L07580m90680
$$ 981846 967745 1041542 999760 941950 725584 1325906 1034261 928143 1235723 745043
4276G45043J690J63691k77948M59032K47231k66260K11945l113p6320O7615k32602
$$ 745043 746733 910424 632476 1091508 1338739 1072479 1284424 1281311 1204991 1272606 1040004
4265A040004q887K12832m26577K32294M03362k71019m485o8154n7046j6145k06559
$$ 1040004 1031117 1243949 817372 1049666 1453028 1182009 1177524 1109370 1052324 1036179 829620
4254H29620J68624K0544m68787M53963L31999j76402k06965k455J83350M7110
$$ 829620 998244 1018788 550001 1003964 1335963 1159561 952596 950141 1133491 1180601
4244A180601J93307P2106j95673O6577K44360n25076j05199L35445r2197J44114
$$ 1180601 1373908 1446014 1250341 1316918 1561278 1036202 931003 1266448 1174251 1318365
4234A318365L78346l50857k18579K48255l57618K61591J55971m09411O20611j29173
$$ 1318365 1696711 1345854 1127275 1375530 1017912 1279503 1435474 1026063 1646674 1517501
4224A517501M786J10917j14069L3160j87712k01701R0906j03941M9542j56861
$$ 1517501 1522287 1633204 1519135 1552295 1364583 1162882 1253788 1149847 1199389 1042528
4214A042528J68483M93691n58543n4767M25021o57531L14151L67290k54597K06803
$$ 1042528 1211011 1704702 1146159 1091392 1516413 858882 1173033 1540323 1285726 1492529
4204A492529J48491L9535q1144o7765K43978l1449N2880Q7337l77994P360L3143
$$ 1492529 1641020 1680555 1599411 1531646 1775624 1744175 1797055 1884392 1506398 1513758 1546901
4193A546901N7966k9790k41189n1070P8326m31681L26375K21442l50392O68309
$$ 1546901 1604867 1575077 1333888 1282818 1361144 929463 1255838 1477280 1126888 1795197
4183A795197k52850l36890M85955q5056l84191j65416o1020J35039P248L0231
$$ 1795197 1542347 1205457 1691412 1606356 1222165 1056749 995729 1130768 1138016 1168247
4173A168247J53648K850J3089M891k1183J44250J8945q804m44765L1388N80329
$$ 1168247 1321895 1324745 1337834 1342725 1321542 1465792 1484737 1475933 1031168 1062556 1642885
4162A642885O2714n08422J91120J24792l97468J63554o0736J93999J54943k6330
$$ 1642885 1705599 1197177 1388297 1513089 1115621 1279175 1218439 1412438 1567381 1541051
4152A541051j26021l53968l41620L97447r5872l1940K05647L25804l95357P5797
$$ 1541051 1415030 1061062 719442 1116889 1021017 989077 1194724 1520528 1125171 1200968
4142A200968J97915k24299J343K92782J34932k17939J10192J73085j47727j13746
$$ 1200968 1398883 1174584 1175927 1468709 1603641 1385702 1495894 1668979 1521252 1407506
4132A407506K55289m8356n7698l98029J69022K52245l38071J83999J68929n22829
$$ 1407506 1662795 1614439 1556741 1158712 1327734 1579979 1241908 1425907 1594836 1072007
4122A072007L31414K66127l64452K47678j28854J8694q036r9518L52676l96935
$$ 1072007 1403421 1669548 1305096 1552774 1423920 1442614 1434578 1335060 1687736 1290801
4112A290801k69409N01523J72414l50554k7656J67727k6936o9119M72690M9598
$$ 1290801 1021392 1522915 1695329 1344775 1317119 1484846 1457910 1388791 1861481 1911079
4102A911079k41384K71499k6675n10365J51161J19661m9037o9108q9798Q9074
$$ 1911079 1669695 1941194 1914519 1404154 1555315 1674976 1625939 1556831 1467033 1556107
4092A556107J61198l01810N9956L8460l32055K16706O1651j81735L21488K33778
$$ 1556107 1717305 1415495 1475451 1513911 1181856 1398562 1460213 1278478 1599966 1833744
4082A833744j92480j41296j79089J23796N6716N3643L68951l15234j0156K27347
$$ 1833744 1641264 1499968 1320879 1444675 1501391 1555034 1923985 1608751 1598595 1825942
4072A825942j96575L07278l52835L7902M19277o99589R8466M84029m54283M12618
$$ 1825942 1629367 1936645 1583810 1621712 2040989 1341400 1439866 1923895 1469612 1882230
4062A882230N5209m28939K47282L4597j82201J06136j51739K43180j88507r3150
$$ 1882230 1937439 1508500 1755782 1790379 1608178 1714314 1562575 1805755 1617248 1524098
4052A524098K87581m16928K1413M1068R188K07850q7098L43182K48674j60490
$$ 1524098 1811679 1394751 1416164 1457232 1466420 1674270 1587172 1930354 2179028 2018538
4042B018538j99541p8499j12615K36212M8273l39971l886K01515k25940K09473
$$ 2018538 1818997 1740498 1627883 1864095 1912368 1572397 1568511 1770026 1544086 1753559
4032A753559m5964j60997N26593j75101j66374o4309L3855J69847K0198J9067
$$ 1753559 1707595 1546598 2073191 1898090 1731716 1667407 1701262 1871109 1891307 1910374
4022A910374J43071k00168j09245K85001l48490J37621q4493R5725K59992j30937
$$ 1910374 2053445 1853277 1744032 2029033 1680543 1818164 1733671 1829396 2089388 1958451
4012A958451L77638k55080m41843k27153J21985k26309J89070j46485L7124N19957
$$ 1958451 2336089 2081009 1639166 1412013 1533998 1307689 1496759 1350274 1387398 1907355
4002A907355j5596K87849J06810l84941J90332k24481k55845O13728j9591n33577
$$ 1907355 1891759 2179608 2286418 1901477 2091809 1867328 1611483 2225211 2205620 1672043
3992A672043J71060L6K62828J71619k7850Q1305l04743N20347r6151o25445L50382
$$ 1672043 1843103 1843139 2105967 2277586 2249736 2331041 2026298 2546645 2450494 1825049 2175431
3981B175431R0458k57943K29937j63968J1368J55220j81772K60817l11631m7989
$$ 2175431 2265889 2007946 2237883 2073915 2085283 2240503 2058731 2319548 2007917 1959928
3971A959928O64093n70590j6306L08956k34119l6432J03449j80581j09252J17048
$$ 1959928 2624021 2053431 2037125 2346081 2111962 2075530 2178979 1998398 1889146 2006194
3961B006194N05985o2107J1988q088k52222l38464Q1017K73365J13170J67270
$$ 2006194 2512179 2450072 2462060 2453972 2201750 1863286 1944303 2217668 2330838 2498108
3951B498108k10866J14749j82664l13280M08100M1171j42728O127k85510R8872
$$ 2498108 2287242 2401991 2219327 1906047 2314147 2355318 2212590 2218717 1933207 2032079
3941B032079K01978q3149M9573L31783r8158J13248J56643L9506k64702j24094
$$ 2032079 2234057 2150908 2200481 2532264 2434106 2547354 2703997 2743503 2478801 2354707
3931B354707M89286r3914j14980J95618k7815K31173k27646j29590K00550j59968
$$ 2354707 2843993 2750079 2635099 2830717 2802902 3034075 2806429 2676839 2877389 2717421
3921B717421N0279J08529n82648J69668L34865k22413k517j86467M9061J41456
$$ 2717421 2767700 2876229 2293581 2463249 2798114 2575701 2573184 2386717 2435778 2577234
3911B577234j37639N64658j33808j70667K38186Q5385k15798q4810l5033P4660
$$ 2577234 2439595 3004253 2870445 2699778 2937964 3023349 2807551 2722741 2687708 2762368
3901B762368r899k1475K96223j73528M2535J27428m54445K17152J95740k29578
$$ 2762368 2752469 2730994 3027217 2853689 2896224 3023652 2569207 2786359 2982099 2752521
3891B752521L29643j53198O394j12901j16662L55813M515k44807L56568l61130
$$ 2752521 3082164 2928966 2935360 2822459 2705797 3061610 3066125 2821318 3177886 2816756
3881B816756K8127L05482o8535L52888k92076l3605j5821k44183j2858K14624
$$ 2816756 2844883 3150365 3081830 3434718 3142642 3109037 3093216 2849033 2836175 3050799
3871C050799j90817j6753K34518q2322N3620J1925l3029N9030k23936K41651P3270
$$ 3050799 2859982 2843229 3077747 2995425 3049045 3060970 3027941 3086971 2863035 3104686 3177956
3860C177956l34953L7553m3152J1202L31534j73796m2312K28187j81675M94687
$$ 3177956 2843003 2880556 2837404 2848606 3180140 3006344 2964032 3192219 3010544 3505231
3850C505231m7708k22790J09801j66461J67438L65712l53297j49006j46065P450
$$ 3505231 3457523 3234733 3344534 3178073 3345511 3711223 3357926 3208920 3062855 3070305
3840C070305k6814k67849K90668K93381l33583R9401J51502j93535K59156j15236
$$ 3070305 3043491 2775642 3066310 3359691 3026108 3125509 3277011 3083476 3342632 3227396
3830C227396k80309J66888J39590K79053k64498l02989J21223J00271l35626R9356
$$ 3227396 2947087 3113975 3253565 3532618 3268120 2965131 3086354 3186625 2850999 2950355
3820B950355K15790j77170j7321o0016j72743j9628J13402J55516j36385l942
$$ 2950355 3166145 2988975 2971654 2911638 2738895 2719267 2832669 2988185 2851800 2847858
3810B847858J86781j29320k49725M07927j02775k98701K94382J34598l8640m25450
$$ 2847858 3034639 2905319 2655594 3063521 2960746 2662045 2956427 3091025 3052385 2626935
3800B626935K28858L54531o53242K52555M74320m53102M23473K18899n26096j78039
$$ 2626935 2855793 3210324 2557082 2809637 3283957 2830855 3254328 3473227 2947131 2769092
3790B769092N2197j687l3379m35954P47686O9853m24208L52897r3550j95384L95727
$$ 2769092 2821289 2819602 2786223 2350269 3097955 3167808 2743600 3096497 3002947 2807563 3203290
3779C203290j39532J11415j86396p3619J42073n00409K17188K90500n67238K45623
$$ 3203290 3063758 3175173 2988777 2915158 3057231 2556822 2774010 3064510 2497272 2742895
3769B742895M07732k25326K7837K89473m099k55672j53575M42456j16156n24760
$$ 2742895 3150627 2925301 2953138 3242611 3238512 2982840 2829265 3271721 3155565 2630805
3759B630805P54981k93505l45894O48155P9759j50237p2251j4541j76008l01546
$$ 2630805 3385786 3092281 2746387 3394542 3474301 3324064 3251813 3237272 3061264 2759718
3749B759718O99307J91245p08853Q384M13677p5626Q9651j85296R477k06426l28839
$$ 2759718 3459025 3650270 2941417 2949801 3363478 3287852 3377503 3192207 3201684 2995258 2666419
3738B666419M57566r9461k12795J90021l60451O201L21917P2915j87703R2478
$$ 2666419 3123985 3024524 2811729 3001750 2641299 2647500 2969417 3042332 2854629 2947107
3728B947107J15617o2240P5147J56684r4682j39563n1504O2608R7651k94320J14419
$$ 2947107 3062724 3000484 3075631 3232315 3137633 2998070 2946566 3009174 3106825 2812505 2926924
3717B926924J4933m79248O7577K44622j75928K21835J42534J676L5966M7662O3323
$$ 2926924 2941857 2462609 2530186 2774808 2598880 2820715 2963249 2964925 3000891 3048553 3111876
3706C111876l18346j10899K3882l0375O09745j21958l06079K84658n41243J38119
$$ 3111876 2793530 2682631 2706513 2676138 3285883 3163925 2857846 3142504 2601261 2739380
3696B739380L18234l59603N631K40473k22538k15643L45380N1994j4737K84103
$$ 2739380 3057614 2698011 2703642 2944115 2721577 2505934 2851314 2903308 2888571 3172674
3686C172674j01370j42156p5941M6879J80805l0260j57643K53293M061l68771
$$ 3172674 3071304 2929148 2853207 2900086 3080891 3050631 2892988 3146281 3150342 2781571
3676B781571l2389L57721K09885j75129j10390o9901p353r0930j39415j37038
$$ 2781571 2749182 3106903 3316788 3141659 3031269 2961368 2954015 2863085 2723670 2586632
3666B586632J5991K2396L20470j48148q2573J17287K17722m77630K53712J63644
$$ 2586632 2602623 2625019 2945489 2797341 2714768 2832055 3049777 2572147 2825859 2989503
3656B989503l66741K47358P7064N997K00472j85575J38439J86753j88162K77400
$$ 2989503 2622762 2870120 2947184 2953181 3153653 2968078 3106517 3293270 3105108 3382508
3646C382508l70452j28730K14729j54833j52811J55203k0543r7669l814K97086
$$ 3382508 3012056 2883326 3098055 2943222 2790411 2945614 2925071 2827402 2823588 3120674
3636C120674J36232j98576J65668r9899m60289K35421J1864k99114L55447r9489
$$ 3120674 3256906 3058330 3223998 3124099 2663810 2899231 2911095 2611981 2967428 2867939
3626B867939J65377N8166j95284J40668P8263j97215M567j9957J31731M00986
$$ 2867939 3033316 3091482 2896198 3036866 3115129 2917914 2922481 2902524 3034255 3435241
3616C435241k26002j99617j72661j73646L99322K9200k20716K48739K14044J2660
$$ 3435241 3209239 3009622 2836961 2663315 3062637 3091837 2871121 3119860 3333904 3346564
3606C346564n5278k62488L07126k1714q2446M99891l22128k22523L69132K444
$$ 3346564 3291286 3028798 3335924 3314210 3231764 3731655 3409527 3187004 3556136 3558580
3596C558580L7253K26360k63176k7377l71208J77236L94813l74379J52802J28895
$$ 3558580 3595833 3822193 3559017 3531640 3160432 3337668 3732481 3358102 3510904 3639799
3586C639799m17486M8594M24129K30789n35432K13817K70743m53395P1343L02802
$$ 3639799 3222313 3270907 3695036 3925825 3390393 3604210 3874953 3421558 3492901 3795703
3576C795703q0508r840J17456J05912j35390K62090q4378j76838l0780n5078J9291
$$ 3795703 3715195 3705355 3822811 3928723 3793333 4055423 3971045 3794207 3763427 3708349 3727640
3565C727640J93755K62262K91774j46476j09483M78528n44743p1552O01444k05896
$$ 3727640 3921395 4183657 4475431 4328955 4219472 4698000 4153257 4081705 4683149 4477253
3555D477253k59306J04704M10746K59077j50095L32154n0752o34542K47600K51253
$$ 4477253 4217947 4322651 4733397 4992474 4842379 5174533 5123781 4489239 4736839 4988092
3545D988092J06570O468j31866n4045L18777M7968N7730M9869j31347N91057j53821
$$ 4988092 5094662 5101130 4969264 4915219 5233996 5281964 5339694 5389563 5258216 5849273 5695452
3534E695452r4876N14981k50227J29290M22414k59266J8151l8935J8731L10282
$$ 5695452 5600576 6115557 5865330 5994620 6417034 6157768 6175919 6136984 6155715 6465997
3524F465997o4604K74407j23134k45411M92970L57068j98009J40563l855K9351
$$ 6465997 6401393 6675800 6552666 6307255 6800225 7157293 6959284 7099847 7095992 7125343
3514G125343L78646J24333N26976k24295K91715Q7551j658K77236M62577o4592
$$ 7125343 7503989 7628322 8155298 7931003 8222718 8310269 8308611 8585847 9048424 8983832
3504H983832K41744M09027L47675N18114J63722J99817M68143O93904P17485M70386
$$ 8983832 9225576 9634603 9982278 10500392 10664114 10863931 11332074 12025978 12743463 13213849
3494A3213849M99995N26997P86098O22847R70518J553648R40532J097074J607975
$$ 13213849 13713844 14240841 15026939 15649786 16620304 18173952 19114484 20211558 21819533
3485B1819533J054762R48507R74679M85301m1245m05478o93607j339578j312345
$$ 21819533 22874295 23822802 24797481 25282782 25241537 24836059 24142452 22802874 21490529
3476B1490529j301176j414694j413566j166690j107953p32438j038059o40403
$$ 21490529 20189353 18774659 17361093 16194403 15086450 14354012 13315953 12675550
3468A2675550k96517r02272k34365j78936p10569l05502j74089l55476m2978r6186
$$ 12675550 12379033 11476761 11242396 11063460 10352891 10047389 9873300 9517824 9474846 9378660
3458I378660m52177L196r1355l81147j81888o7557j06762j05034l54766J8733
$$ 9378660 8926483 8929679 8838324 8457177 8275289 8207732 8100970 7995936 7641170 7659903
3448G659903M8596k7607R0947k48357k41050j51468j99985Q8635l66150j81589
$$ 7659903 7708499 7680892 7771839 7523482 7282432 7130964 6930979 7019614 6653464 6471875
3438F471875L03074o22463l00106J22698l11125j85062k07772J72718R9146j95657
$$ 6471875 6774949 6152486 5852380 5975078 5663953 5478891 5271119 5443837 5542983 5347326
3428E347326J60109k18443k62535O2884j63957q6740M6733l43733J1013M8061
$$ 5347326 5507435 5288992 5026457 5089341 4925384 4838644 4885377 4541644 4552657 4600718
3418D600718r4756J16847m31543n9124R9300l16420M28988R3490j07759k42457
$$ 4600718 4505962 4622809 4191266 4132142 4231442 3915022 4344010 4437500 4329741 4087284
3408D087284k33241j48612N5977O2174p1146p6526m3582J75217j88201K7961j47106
$$ 4087284 3854043 3705431 3761408 3823582 3752436 3675910 3632328 3807545 3619344 3647305 3500199
3397C500199k15652K01308N7055j04292QJ49556j52331Q2504J19826k61062k44002
$$ 3500199 3284547 3485855 3542910 3438618 3438626 3588182 3435851 3518355 3638181 3377119 3133117
3386C133117Q2892K00164l76174L37735n430O8730o6527p7818k34071j13863K16641
$$ 3133117 3216009 3416173 3039999 3377734 3372304 3441034 3374507 3296689 3062618 2948755 3165396
3375C165396R7551j32750n0454j632J05212J83691j18881L6289j40278p47461
$$ 3165396 3262947 3130197 3079743 3078111 3183323 3367014 3248133 3284422 3144144 2396683
3365B396683L65562J96267n63366M82153J5989j45030m752P0089j0454l87793
$$ 2396683 2762245 2958512 2395146 2877299 2893288 2748258 2743506 2813595 2803141 2415348
3355B415348p852L00539j20384J1399K07515k71832k6399M68086j22151j90304
$$ 2415348 2407496 2708035 2587651 2599050 2806565 2534733 2508334 2976420 2854269 2663965
3345B663965k3300K29827q1123k21803N9247J19624k15641j06840K13148k08901
$$ 2663965 2640665 2870492 2789369 2567566 2626813 2746437 2530796 2423956 2637104 2428203
3335B428203m3520j43925K32923K67077m06089K45323m53533R6195K95554k91699
$$ 2428203 2384683 2240758 2473681 2740758 2334669 2579992 2126459 2222654 2518208 2226509
3325B226509P467L10369k73132J49871j20641m7799R6516k80213J82152N6381
$$ 2226509 2233976 2544345 2271213 2421084 2300443 2252644 2349160 2068947 2251099 2307480
3315B307480m22630R0856m7571J1358J78924Q491n6442J74874K74536k63549k44479
$$ 2307480 1884850 1975706 1928135 1939493 2118417 2126908 2070466 2245340 2519876 2256327 2011848
3304B011848J70484L02776o28904J93674J6898j90824M1646K47537Q0086r035
$$ 2011848 2182332 2485108 1856204 2049878 2066776 1875952 1917598 2165135 2245221 2236186
3294B236186j6863n3977j54885K15014j24267m88932M52015j8333k49350J68634
$$ 2236186 2219323 2165346 2010461 2225475 2101208 1612276 2064291 2045958 1796608 1965242
3284A965242l9508J96480j47865R1089J50k41334J48156K61471k98434j51660
$$ 1965242 1925734 2122214 1974349 2065438 2065588 1824254 1972410 2233881 1935447 1783787
3274A783787K88569Q8155j79193n8064K07650j25970m58942M71790k92483k89475
$$ 1783787 2072356 2160511 1981318 1923254 2130904 2004934 1545992 2017782 1725299 1435824
3264A435824M00401J15109L0709J19331o0720k81396j93585R9174M40183k78620
$$ 1435824 1836225 1951334 1982043 2101374 2040654 1759258 1565673 1664847 2105030 1826410
3254A826410k63104L76909n3519l15268Q37137J79910l05523j29362K17523l18685
$$ 1826410 1563306 1940215 1886696 1571428 2408565 2588475 2282952 2153590 2371113 2052428
3244B052428n58476P85700J90004o11206L92837J47259n67218K23376K41170j75623
$$ 2052428 1493952 2279652 2469656 1858450 2251287 2398546 1831328 2054704 2295874 2120251
3234B120251j96653R3442L70938j39093k7151L49219m70708l03554N77852j55099
$$ 2120251 1923598 2017040 2387978 2248885 2221734 2570953 2100245 1796691 2374543 2219444
3224B219444k22585M73462L65009k56657m67681J79587N0796n46668N28541M29660
$$ 2219444 1996859 2470321 2835330 2578673 2110992 2290579 2341375 1794707 2323248 2752908
3214B752908o87859j1110L47055q6813M4172r5442M86769k09074n71535O46968
$$ 2752908 2065049 2053939 2400994 2314181 2358353 2262911 2749680 2540606 1969071 2616039
3204B616039r3982m33761K23933J13978j43341K83473K55624k23252l00246L74015
$$ 2616039 2522057 2088296 2312229 2426207 2282866 2566339 2821963 2598711 2298465 2672480
3194B672480L56174l76817J73555L38123l64885R204K87617o2271j46768J30800
$$ 2672480 3028654 2651837 2825392 3163515 2798630 2807834 3095451 3033180 2886412 3017212
3184C017212P73111l84466k40747M25950K9781l17937N23211K65250J62365j10855
$$ 3017212 3790323 3405857 3165110 3591060 3620841 3302904 3826115 4091365 4253730 4142875
3174D142875P0537L14177k08808J7778J86399p0569J21386N11060n9773j72136
$$ 4142875 4213412 4527589 4318781 4336559 4522958 4452389 4573775 5084835 5025062 4852926
3164D852926P2310o5001k70745l4461M56042K34752j58019K04162j96130n4810
$$ 4852926 4925236 4860235 4589490 4555029 5011071 5245823 5087804 5291966 5095836 5041026
3154E041026L92216O47085l4539J48010J06722L97632M97971K71326L10445K37551
$$ 5041026 5433242 6080327 6045788 6193798 6300520 6698152 7196123 7467449 7777894 8015445
3144H015445J93546O60458J24959k82335L25222j46970n80562p18758m13502j46223
$$ 8015445 8208991 8869449 8994408 8712073 9037295 8890325 8309763 7591005 7177503 7031280
3134G031280n12368Q2940j9711o14820o8100O53536j00758j70291J99648N40410
$$ 7031280 6518912 6601852 6582141 5967321 5899221 6552757 6451999 6281708 6481356 7021766
3124G021766K76781R9300N69436o929J77558M57267k2853J6451K62413J21112
$$ 7021766 7298547 7397847 7967283 7960354 8137912 8595179 8572326 8588777 8851190 8972302
3114H972302j49274J0006M7006l05929n01574m25674j39370m87544n58522k59004
$$ 8972302 8823028 8833034 8880040 8574111 8072537 7646863 7507493 7019949 6461427 6202423
3104F202423o5332l88819L3361q1797l9189j69606J88004R8813q816L13686o0306
$$ 6202423 6137091 5748272 5781633 5699836 5660647 5491041 5679045 5777858 5769042 6082728 6022422
3093F022422q3004J68367J04674j14192l16284l84515k8100k50042k62721m86842
$$ 6022422 5939418 6107785 6212459 6098267 5781983 5397468 5369368 5119326 4856605 4369763
3083D369763j51986k4162j68944l58175k05296R448k11040j22881K62791K8145
$$ 4369763 4217777 4193615 4024671 3666496 3461200 3470648 3259608 3136727 3399518 3427663
3073C427663l68857q5588q785k66371j50816l1830j3178m3761k3666K44731k12817
$$ 3427663 3058806 2973218 2964433 2698062 2547246 2515416 2502238 2458477 2434811 2679542 2466725
3062B466725j46105n098r722j9809M1161k37061k61393j07387l8022K64598j74757
$$ 2466725 2320620 2315522 2305800 2285991 2327152 2090091 1828698 1721311 1683289 1947887 1773130
3051A773130j65023O9317n11936L72792J30814q3072K85927q5580j02348l36264
$$ 1773130 1608107 1677424 1165488 1538280 1669094 1586022 1871949 1786369 1684021 1347757
3041A347757L9771j56146j38266R1457J69483k34299P9898J85013k38445o8414
$$ 1347757 1387528 1231382 1093116 1184573 1354056 1119757 1199655 1384668 1146223 1077809
3031A077809L1847m5189K10391k82763l5945J46119o5247J10769j7711j13310
$$ 1077809 1109656 1064467 1274858 992095 956150 1102269 1037022 1147791 1130080 1016770
3021A016770j05233L12836l25636q4740O7417K46172k5922k07304K15057j26934
$$ 1016770 911537 1224373 898737 813997 881414 1127586 1101664 894360 1109417 982483
3011I82483j33820J01148l17593Q9360K23800K4797j25371j77147K70666j3438
$$ 982483 848663 949811 632218 721578 945378 970175 844804 667657 938323 924885
3001I24885m883J04021K32522N3411l17373n8526J86329j27376O0945O4423k12836
$$ 924885 920002 1024023 1256545 1309956 992583 934057 1120386 993010 1053955 1118378 905542
2990I05542j61312l525j46250J0809q1427L88377l9276p2569L01227N4319n22128
$$ 905542 744230 740705 594455 605264 523837 912214 872938 800369 1101596 1155915 633787
2979F33787L9329J44962j65780M2095r1020K4200l9418N476J97383j51937K86117
$$ 633787 673116 818078 652298 694393 603373 627573 588155 593631 791014 639077 925194
2968I25194O5337n55919J28715K05309J58073k99092j78429K90869R3959m02284
$$ 925194 990531 434612 563327 768636 926709 627617 449188 740057 834016 431732
2958D31732L25674r0519O4137L18098j13284j48505j59156K7353j5621l32565
$$ 431732 757406 666887 731024 1049122 935838 787333 628177 655530 639909 307344
2948C07344M60113J64904m33540O1733o2968m5906K24839p5100K21392n59915
$$ 307344 767457 932361 498821 560554 497586 451680 676519 601419 822811 262896
2938B62896k04092M60255P7814j58847K58756k41485j90894J90692J74740K24700
$$ 262896 58804 519059 596873 438026 696782 455297 264403 455095 629835 854535
2928H54535m00302M4550J73280M4051Q4935L040j0591L4062k63567J10011j63779
$$ 854535 454233 498783 672063 716114 801049 804089 793498 827560 563993 674004 510225
2917E10225n8899K94413m20493j25306N81276j42974l6607L80293j40809k79053
$$ 510225 451326 745739 325246 199940 781216 638242 601635 981928 841119 562066
2907E62066l9662J63733j8550R5899L69846l51225J4655j45439j11460J85113
$$ 562066 522404 686137 667587 763486 1133332 782107 796762 651323 539863 724976
2897G24976j28743m8490M00736m87550q087J29263j21402K03147O515r8860J7375
$$ 724976 596233 547743 948479 460929 452842 582105 460703 663850 670365 571505 588880
2886E88880J73724L84272l30649k62404N9754j14058M11913k53950k58415M42425
$$ 588880 762604 1146876 816227 553823 613577 499519 911432 657482 399067 841492
2876H41492n01682J41040M40397n98859N67910j5361m96094N41353j19341j37836
$$ 841492 339810 480850 921247 322388 890298 874937 378843 920196 800855 663019
2866F63019O933n01055O24360o6646q997N5332l69343K54584k62632j34593M56014
$$ 663019 669952 168897 793257 726611 717614 772946 403603 658187 395555 260962 716976
2855G16976k39005J18617N32380m25925k05786L68635l95974J58591J22677k63820
$$ 716976 477971 596588 1128968 703043 497257 865892 469918 628509 751186 487366
2845D87366K60878J86513m6186j1192l71903j78780J56120K7480K50185o064J44958
$$ 487366 748244 934757 888571 877379 505476 326696 482816 510296 760481 754417 899375
2834H99375j33232l2802M91312l22103k41390K74048j10833J8492N3244j68493
$$ 899375 766143 733341 1224653 902550 661160 935208 824375 842867 896111 727618
2824G27618K62128j69809n5131K52965k72590K23210J12622n41457K40841K86098
$$ 727618 989746 819937 764806 1017771 745181 968391 1081013 539556 780397 1066495
2814A066495j62251N8818K7131M7042l01979j97706L35309m0692k7051J16874
$$ 1066495 904244 963062 990193 1037235 735256 537550 872859 832167 805116 921990
2804I21990l18109J14008k8496l5192R6657m5542N8971J01364j85615L64599J2077
$$ 921990 603881 717889 689393 654201 750858 705316 764287 865651 680036 1044635 1056712
2793A056712l71439j75616K5821K9514O7916K04608q6170m42491N1520K89935
$$ 1056712 685273 509657 535478 564992 632908 837516 751346 308855 360375 650310
2783F50310j61092K43548J16591k82500K01568j84781K24203J78300o60012L39236
$$ 650310 489218 732766 849357 566857 768425 583644 807847 986147 326135 665371
2773F65371K8921k66206L95364j88103q9904M52603j08700m6112l1145j94063
$$ 665371 694292 428086 823450 635347 545443 998046 889346 843234 812089 618026
2763F18026K31291j1694Q8268j47137j98202J47802j95913O6187K17298J0818
$$ 618026 849317 837623 925891 778754 580552 728354 532441 598628 815926 826744
2753H26744q4401k2280K1136J574l03156R1996K09268K2321J28187J25624k26277
$$ 826744 742343 720063 741199 742773 439617 531613 740881 763202 891389 1017013 790736
2742G90736j84906o9457j3699k656J25295M984k62032K89578j40562l40915o0735
$$ 790736 605830 536373 522674 520018 645313 650297 388265 677843 537281 196366 135631
2731A35631j10077M71674P6334k5605Q2343q6738L49948j50955k48523M37395
$$ 135631 25554 497228 573562 547957 630300 543562 893510 742555 494032 931427
2721I31427q5554M6197j00646J10556K51354l79919j57179K80157l60391n1282
$$ 931427 845873 892070 791424 901980 1153334 773415 616236 896393 536002 484720
2711D84720R389R2870M84498k18155J31061k34266j81634K21333J3906m3292J79518
$$ 484720 494109 586979 1071477 853322 984383 750117 568483 789816 803722 760430 939948
2700I39948j6212o3555j35258J76078R0783k87545J16969J1837j98562L54464
$$ 939948 923736 860181 724923 901001 991784 704239 821208 833045 634483 988947
2690I88947q2815p0868n6270l9694R7851n6902J27827l20343R8671L70457k8158
$$ 988947 906132 835264 778994 739300 837151 780249 908076 587733 686404 1056861 1028703
2679A028703k77823j25448J13446J73563n1330J03407j06391p1665k42544K48746
$$ 1028703 750880 625432 738878 912441 861111 964518 858127 786462 543918 792664
2669G92664L58740j54375k14406J12266k89861Q4752J45589N3407J98027p0743
$$ 792664 1151404 997029 782623 894889 605028 689780 835369 888776 1086803 1016060
2659A016060k26481j3107k33969K77721J03133j2000J09689P2525j26014n8055
$$ 1016060 789579 776472 542503 820224 923357 911357 1021046 1093571 967557 909502
2649I09502K50335l94496J91326K13560r5455p4914J48169j87599J35197r5250
$$ 909502 1159837 765341 956667 1170227 1074772 999858 1148027 960428 1095625 1000375
2639A000375r4731m2374k4072k20897O2016J61616K44425P2287p9552k8358J23995
$$ 1000375 905644 863270 839198 618301 680317 841933 1086358 1158645 1079093 1050735 1174730
2628A174730j49606m2905J17147j59516J21639L09195r3705l53529K16456N04241
$$ 1174730 1025124 982219 1099366 939850 1061489 1370684 1276979 923450 1139906 1644147
2618A644147k96213J79074J29346r7807M00727M64052M95998L21229l7532l54719
$$ 1644147 1347934 1527008 1656354 1558547 1959274 2423326 2919324 3240553 3203021 2848302
2608B848302k59184m34217k44226K7928m79351O5578M5364j31466j31694k02362
$$ 2848302 2589118 2154901 1910675 1938603 1459252 1524830 1570194 1438728 1307034 1104672
2598A104672M1446j86421J76919O14501k28479J1053q6976k29948L52166k62568
$$ 1104672 1146118 959697 1136616 1751117 1522638 1533691 1446715 1216767 1568933 1306365
2588A306365k53771j4384j62426L49570j04755m238K47446n5569k8995J40328
$$ 1306365 1052594 1038210 875784 1225354 1120599 1116361 1363807 1308238 1279243 1419571
2578A419571k09323k13363K79507J06326k31649J27249K42934q7970j61331l1938
$$ 1419571 1210248 996885 1276392 1382718 1151069 1278318 1521252 1433282 1271951 1240013
2568A240013J10741j36037r1492K06939j64732m9790N55632J6174k47996k57247
$$ 1240013 1350754 1214717 1123225 1330164 1165432 1115642 1671274 1687448 1439452 1182205
2558A182205N21610q9213o19134L0500K11095m07704M95137J05631o6867j51764
$$ 1182205 1703815 1614602 995468 1025968 1237063 829359 1324496 1430127 1363260 1211496
2548A211496l80489K86293J72057M8846M89323m42843N4889K35766l46193L9170
$$ 1211496 831007 1117300 1289357 1338203 1827526 1384683 1439572 1675338 1329145 1368315
2538A368315Q3977J25963N48l71725M79151J47103m43921K98726k30335j93400
$$ 1368315 1452292 1578255 1578803 1207078 1686229 1833332 1389411 1688137 1457802 1264402
2528A264402L18893k39014j26455K96780J31934Q4017j16359J40983J27986o89350
$$ 1264402 1583295 1344281 1217826 1514606 1646540 1730557 1614198 1755181 1883167 1193817
2518A193817O7113N09042n42871K9805L95257O0937k40898J40719L61307Q6446
$$ 1193817 1260930 1769972 1227101 1256906 1652163 1713100 1472202 1612921 1974228 2060674
2508B060674j88660K00400J48323j92168j67825j60657J71189J28531J20401j09639
$$ 2060674 1872014 2072414 2220737 2028569 1860744 1700087 1871276 1999807 2120208 2010569
2498B010569k15468J22684K42065l99882J06184M13930m34434j22364M12280m0099
$$ 2010569 1795101 1917785 2159850 1759968 1866152 2280082 1845648 1723284 2135564 2095465
2488B095465l67066L34732J53951l15262K79684P2588j01813k04590J77207J99508
$$ 2095465 1728399 2063131 2217082 1901820 2181504 2254092 2152279 1947689 2124896 2324404
2478B324404l31011M9410M36878j95331Q3234K93332j61567J16667K9822P8130
$$ 2324404 1993393 2042803 2479681 2284350 2367584 2660916 2499349 2616016 2645838 2723968
2468B723968m77803J91856L46495j03666r4112L76523O2156J02061J21760j43774
$$ 2723968 2246165 2438021 2784516 2680850 2586738 2963261 3025417 3127478 3249238 3105464
2458C105464O5328j94649J6518J97238o8741J35312K01130m17703j3838m4761
$$ 3105464 3170792 2976143 2992661 3189899 3121158 3256470 3457600 3039897 3026059 2981298
2448B981298n4148N7240K23857J22730k48613L45912K10410O2729K01224P6086
$$ 2981298 2927150 2984390 3208247 3330977 3082364 3428276 3638686 3701415 3902639 3978725
2438C978725j54224j66205J63956J07486l1054J15639J53184R7682J55017p3572
$$ 3978725 3824501 3658296 3822252 3929738 3898684 4014323 4167507 4265189 4420206 4346634
2428D346634K86028Q5684j97071K11193j46487j01989M84882j09648M8649K0080
$$ 4346634 4632662 4718346 4521275 4732468 4585981 4483992 4968874 4859226 4907875 4927955
2418D927955K7432J89546j3626K36761q6700l9130L39416r3080m1409K79136k6953
$$ 4927955 4955387 5144933 5131307 5368068 5281368 5242238 5581654 5488574 5447165 5726301 5699348
2407E699348J49514j60352J80686M01910r8603L84085J01597k44681N66015L28861
$$ 5699348 5848862 5688510 5869196 6271106 6172503 6556588 6658185 6413504 6979519 7308380
2397G308380m2985L99400K53638J04004J22340j17162N36866j42461M42378K40918
$$ 7308380 7265395 7664795 7918433 8022437 8144777 8027615 8564481 8422020 8864398 9105316
2387I105316Q5024K40643K73453J21653L12741L17406P16045L29742L31878N26924
$$ 9105316 9190340 9430983 9704436 9826089 10138830 10456236 11172281 11502023 11833901 12360825
2377A2360825O22079N38994O81228Q93138P06134P65553R45628L61458J058729
$$ 12360825 12982904 13521898 14203126 15096264 15802398 16567951 17513579 17875037 18933766
2368A8933766J265796J368226J538646J911265J867301K640468L184025M140104
$$ 18933766 20199562 21567788 23106434 25017699 26885000 29525468 32709493 36849597
2360C6849597M684613L856740J551504P75486R74591K381156M030363O405393
$$ 36849597 41534210 45390950 46942454 47717940 48692531 51073687 55104050 61509443
2352F1509443P883274J1110220J4074667K1936086L7135456O9254802J02190086
$$ 61509443 69392717 80502937 94577604 116513690 153649146 222903948 325094034
2345C25094034J19141181P3696692k8693249q3067302j00517767q3100231n7386835
$$ 325094034 444235215 517931907 489238658 406171356 305653589 222553358 165166523
2338A65166523m0284854k9405142k2106641j6319781j1463004p000303l795665
$$ 165166523 124881669 95476527 73369886 57050105 45587101 38586798 34791133
2331C4791133j378111o81977p89225l081581m205530l862209l387396j945107
$$ 34791133 33413022 32731045 31941820 28860239 24654709 20792500 17405104 15459997
2323A5459997j611271j701815o46672j099065q80367l69405p65260p02563l28942
$$ 15459997 13848726 12146911 11500239 10401174 9520807 9151402 8386142 7683579 7354637
2314G354637o21069K79402l30468m81897N5789m53300k25824k40060p04437K6092
$$ 7354637 6733568 7012970 6682502 6200605 6256394 5803094 5577270 5337210 4632773 4658865
2304D658865n28474K63690j85913l43905k71511n435j92252L66027n62674q7952
$$ 4658865 4130391 4394081 4208168 3864263 3592752 3587317 3395065 3761092 3198418 3110466
2294C110466m7570l96474k12384l9190j51647K20083r5567j0209R2905n6696q5401
$$ 3110466 3062896 2666422 2454038 2414848 2263201 2483284 2387717 2377508 2470413 2413717 2328316
2283B328316j65046k16651n8004p5666m29478J82124k9335l37808L4551k89033
$$ 2328316 2163270 1946619 1888615 1812949 1383471 1565595 1536260 1198452 1233003 943970
2273I43970j6207o3897J53420J68223o39260J54298M85625m37118O1877m3749
$$ 943970 927763 863866 1017286 1185509 546249 700547 1186172 749054 810931 767182
2263G67182k54075K26065p2920l8350J40116m30166K0703j07114J303M62113j40617
$$ 767182 513107 739172 666252 627902 768018 337852 358555 251441 252744 714857 574240
2252E74240r4454n3735k31383Q8395N603j81267R4226j38763J52351J60545j77927
$$ 574240 479786 426051 194668 283063 288666 107399 201625 62862 215213 375758 197831
2241A97831M045k35153O4497j0212K9546R2858Q780N0562K19126k83228j39229
$$ 197831 201876 -33277 31220 21008 50554 143412 152192 202754 421880 138652 -577
2230e77L12787m09682m24573M08055J77980m23819J90481J29987l08856N9463
$$ -577 312210 -97472 -522045 -113990 63990 -359829 -169348 -39361 -348217 -288754
2220b88754K17582J36214k40547j16748L49217k65980j24321M23824k87894j27163
$$ -288754 -71172 65042 -175505 -292253 56964 -209016 -333337 90487 -197407 -324570
2210c24570L55135j35096j81410J75350M17558l54562j57069N56447l0243o22618
$$ -324570 30565 -104531 -285941 -110591 306967 -47595 -204664 351783 321540 -301078
2200c01078K65523O3574k47224J70310J49437k32928l1783J84508N882n35955
$$ -301078 -35555 28019 -219205 -48895 100542 -132386 -164169 20339 26221 -509734
2190e09734k66901K30835k85083j08920O60940j71824k48764O2716k3225k7354
$$ -509734 -776635 -545800 -830883 -939803 -278863 -450687 -699451 -636735 -659960 -687314
2180f87314k72596L55561N01941k84026L71422j17682n64554M35099j07489n3936
$$ -687314 -959910 -604349 -102408 -386434 -15012 -132694 -697248 -262149 -369638 -423574
2170d23574J61969j64511J93181j38427j75142K63060j08195J49946P3235M6940
$$ -423574 -261605 -426116 -232935 -371362 -546504 -283444 -391639 -241693 -168458 -121518
2160a21518m5772Q9081Q3163m37383J41634p1932n49278L13979L85026o6772n2659
$$ -121518 -167290 -78209 4954 -432429 -290795 -362727 -912005 -598026 -213000 -279772 -332431
2149c32431j31593j16063k9273J25436N78673k16374j99412K54083j75701N1784
$$ -332431 -464024 -580087 -609360 -483924 94749 -121625 -321037 -66954 -242655 -190871
2139a90871J05047j13228k43676Q6824J03613k19431L1041J19985J24043j10301
$$ -190871 -85824 -199052 -442728 -355904 -252291 -471722 -440681 -320696 -196653 -306954
2129c06954k01207L09416j04574n8895J14431k16003L6612J5351J46243L0604
$$ -306954 -508161 -198745 -303319 -362214 -247783 -463786 -427174 -411823 -265580 -234976
2119b34976l09772J6612o5138J4347M06109J74443m44279J58703q9520R6069k65839
$$ -234976 -544748 -528136 -593274 -578927 -172818 1625 -442654 -283951 -373471 -277402 -543241
2108e43241R3084K94214l65412R2279P1050l99055M28377K19552l55504L9983
$$ -543241 -450157 -155943 -521355 -429076 -358026 -757081 -328704 -109152 -464656 -424673
2098d24673K8418N87937J4238n39952M03651m0230l26270L63436m3760J93589
$$ -424673 -396255 191682 205920 -334032 69619 29389 -296881 66555 22795 216384
2088B16384L555j81112Q6050j68763L83238j18475k10317J71270L17861q5467
$$ 216384 219939 38827 124877 -43886 339352 220877 10560 181830 499691 414224
2078D14224R2013O33068M09785M39994O3490J24847n69610l71705k49756m94750
$$ 414224 506237 1139305 1549090 1989084 2052574 2177421 1607811 1236106 986350 491600
2068D91600o43644K95669J97688j69658j28143M516j60892k084n2201K26895j98801
$$ 491600 -152044 143625 341313 171655 43512 48028 -112864 -114948 -167149 59746 -139055
2057a39055P723K12436k26927j53885K39184R6065k22784n4275L65727j85179
$$ -139055 -131332 81104 -145823 -299708 -60524 35541 -187243 -241518 124209 -60970
2047f0970k13165p5670j84503K88680R6661j00118o0956J29822K24469l6222k14446
$$ -60970 -274135 -349805 -534308 -245628 -148967 -249085 -310041 -180219 44250 8028 -206418
2036b06418L9110l961K0235j48413q6479j00848J05919K8991P6622l53654J63094
$$ -206418 -167308 -171269 -151034 -299447 -385926 -486774 -380855 -351864 -275242 -628896 -465802
2025d65802K13932O1357l9676j88736M9281l803k09314M39451P9137j35550J42826
$$ -465802 -251870 -190513 -230189 -418925 -369644 -373447 -582761 -143310 -64173 -199723 -56897
2014e6897j63962M4128j55921j09622K26775q0704J58708J78328k75714J94211
$$ -56897 -220859 -176731 -332652 -442274 -215499 -296203 -137495 40833 -234881 -40670
2004d0670r9271n3722l3477j16180K22363j4707k79250j16738K48089K32485O7112
$$ -40670 -139941 -193663 -227140 -343320 -120957 -135664 -414914 -531652 -283563 -51078 16034
1993A6034L311k38602p0917K22209J33059L1660L1515k30019k9977j66662K06126
$$ 16034 19345 -219257 -290174 -67965 65094 96754 128269 -101750 -131727 -298389 -92263
1982i2263J26763n0616J31419l92170K3268J10198l2402J45321k22611j66983
$$ -92263 34500 -16116 115303 -276867 -253599 -143401 -175803 -30482 -253093 -420076
1972d20076K58355j33992k06102j19598L94459Q9577O558j18841K2449R2373k09214
$$ -420076 -161721 -295713 -501815 -621413 -226954 -137377 -130819 -249660 -227211 -134838 -344052
1961c44052k6670M65060j74167l33100K88587l20571M59088n3094k38738J64490
$$ -344052 -370722 94338 -79829 -412929 -124342 -444913 14175 -38919 -277657 -113167
1951a13167r1984N681N5782p3852K19659l55307j30354J63377q2652N2256k5448
$$ -113167 -205151 -199470 -143688 -217540 2119 -353188 -483542 -320165 -402817 -350561 -376009
1940c76009k6543L69046j09462j80481O9111k00252J46667k8697N9114K22914
$$ -376009 -402552 -33506 -142968 -323449 -254338 -454590 -307923 -336620 -277506 -54592
1930e4592j94941M8389j06281j80531K26496k27430j45038J68790K05288J89267
$$ -54592 -249533 -201144 -307425 -487956 -261460 -488890 -633928 -465138 -259850 -70583
1920g0583M3291j09392j23181j51836K05671M4197J14262j77478L5782j8219p2619
$$ -70583 -27292 -136684 -259865 -411701 -206030 -161833 -47571 -225049 -189267 -207486 -280105
1909b80105p1166o5514q3012q0165L56602K96096m44632q2125K08292k01124j81888
$$ -280105 -351271 -416785 -499797 -579962 -223360 72736 -371896 -454021 -245729 -446853 -628741
1898f28741M50771L7300n3108J25507J7691K3312j9359j9381p0219k95572j51356
$$ -628741 -177970 -140670 -193778 -68271 -50580 -27268 -46627 -66008 -136227 -431799 -583155
1887e83155L87626k53081J13377L19270k71506j76183K70007j24529q1585K26226
$$ -583155 -195529 -448610 -335233 -15963 -287469 -463652 -193645 -318174 -399759 -173533
1877a73533K47560k05290k02200J34615J75489L2752J98433j76792l96298L81545
$$ -173533 74027 -131263 -333463 -198848 -23359 9393 207826 31034 -365264 16281
1867A6281r60l85480R4308r0985K81565o5950o3263K85163j18789o8264M4901
$$ 16281 15321 -370159 -275851 -366836 -85271 -151221 -214484 70679 -48110 -116374 -71473
1856g1473J36268k5998K008l2445q0170l10700K51614K52928l03821J98912J14072
$$ -71473 64795 38797 40805 8360 -71810 -382510 -130896 122032 -181789 17123 131195
1845A31195l43392n9460J56622M574l39576q7665J36899J80561q65J37362j39538
$$ 131195 -212197 -271657 -115035 -110461 -450037 -537702 -400803 -220242 -221107 -83745 -223283
1834b23283k01106p5242p1263O8009K20235N5585P9868J39580q704k69515m7852
$$ -223283 -424389 -499631 -570894 -502885 -282650 -227065 -147197 -7617 -16321 -285836 -333688
1823c33688K66421M8307O3513N4443k29974J14199j26499O1834n9729k34881M30919
$$ -333688 -67267 -18960 44553 98996 -130978 -16779 -143278 -81444 -141173 -376054 54865
1812E4865R912k27436J96395j293m82395P5305K96758N00449m54504k40542K44600
$$ 54865 64777 -162659 33736 32443 -449952 -374647 -77889 422560 -31944 -272486 -27886
1801b7886J9071J15239M6653l22933J39813p1746L21575p6990k32977J01854j81028
$$ -27886 -8815 106424 153077 -169856 -30043 -101789 219786 142796 -90181 11673 -169355
1790a69355k11103M78824k67391r5536J22029M08341j3524k70114K34195k91126
$$ -169355 -380458 98366 -169025 -264561 -142532 265809 252285 -17829 216366 -74760
1780g4760k37580L39577n2993k57844K23032j62221k1625k32271L1326K98702
$$ -74760 -312340 27237 -25756 -283600 -60568 -222789 -244414 -476685 -445359 -146657
1770a46657L4778L10941J14788l56040k15891j96736L05196J38861Q0004j424
$$ -146657 -111879 199062 313850 -42190 -258081 -454817 -149621 -10760 69244 67820
1760F7820k22824j17362Q1664k01848J27408P0010j7893q0223L30199J37309o9942
$$ 67820 -155004 -272366 -190702 -392550 -265142 -195132 -213025 -293248 36951 174260 104318
1749A04318L6416m6881l75594J9338K36704K1099M238r1342j0783J07562l42191
$$ 104318 140734 93853 -281741 -262403 -25699 -4600 -362 -91704 -102487 5075 -337116
1738c37116L08943j24050j03721N63316o5922n84624J26359o3778J90813j49880
$$ -337116 -28173 -152223 -255944 307372 241450 -343174 -216815 -280593 -89780 -239660
1728b39660j9643M76928j00576k02363q1820L20797j02510k96319J74215K67524
$$ -239660 -259303 217625 117049 -85314 -167134 153663 51153 -245166 -70951 196573
1718A96573l0082J61180l15098j37861J01444j62504L44997j4913m48639P0018
$$ 196573 166491 327671 12573 -125288 -23844 -186348 158649 143736 -304903 -234885
1708b34885j2147L73709J11968j2187q8122k97601j99996K58915R0612k30158
$$ -234885 -247032 126677 238645 226458 138336 -159265 -359261 -100346 -9734 -239892
1698b39892J42334j3023J10622J11542k03825L33585m41633L06624K25143m57396
$$ -239892 -97558 -110581 41 111583 -92242 241343 -200290 106334 331477 -125919
1688a25919o5287J11717K7092J80924j20l4368l25286N4190J65979m47271J88001
$$ -125919 -191206 -79489 -52397 128527 128407 94039 -231247 -177057 -11078 -458349 -270348
1677b70348K14758j16960J45702l27466j06777M51537n2464l2443j91826n7490
$$ -270348 -55590 -172550 -26848 -354314 -461091 -9554 -62018 -94461 -286287 -343777
1667c43777M41171P4632k68191L66991J06514k67122r6657M81980m70492j84845
$$ -343777 97394 172026 -96165 270826 377340 110218 13561 495541 25049 -159796
1657a59796J94059j77646K7827J8931N5263R6500l8496k50305k04466k21632M02382
$$ -159796 34263 -143383 -115556 -96625 -41362 55138 16642 -233663 -438129 -659761 -257379
1646b57379K74281j54188j63374j08739J60724l892K42216L5318n9475J61527
$$ -257379 16902 -137286 -300660 -409399 -248675 -252567 -10351 24967 -34508 127019
1636A27019p8568K80870j86986j93893J92393l8567Q7764j71381j11088k2603
$$ 127019 48451 329321 142335 -51558 140835 102268 190032 18651 -92437 -115040
1626a15040j56011K13716o6432k4615L97060j96360K0828J6310l54315M09044
$$ -115040 -271051 -57335 -123767 -148382 248678 52318 73146 89456 -264859 144185
1616A44185R3557n23796K58827l0641k26964K76589K0715j48810l0186O5957L01095
$$ 144185 237742 -286054 -27227 -57868 -284832 -8243 12472 -136338 -166524 -100567 200528
1605B00528K2172k1529k4458j87519j04809Q0839r7267j24848J63190O2777n6057
$$ 200528 222700 201171 176713 -10806 -115615 -34776 -132043 -256891 -93701 -30924 -86981
1594h6981N7126M8239J06737q2829J82449l706k15816J02006l6242o7741J3091
$$ -86981 -29855 18384 125121 42292 224741 221035 5219 107225 70983 3242 16333
1583A6333J8377k82387O3414M03007j91054l64281K00457J56493R1969k77454
$$ 16333 34710 -247677 -184263 218744 27690 -336591 -136134 20359 112328 -165126
1573a65126j3446J15486O5478K05410L78123m50225l84105L68913k3844n9305
$$ -165126 -178572 -63086 2392 207802 585925 135700 -248405 120508 96664 37359
1563C7359J05985j55781j36831k44428K22809r8718J67040L56083j30100J73115
$$ 37359 143344 -12437 -149268 -393696 -170887 -269605 -102565 253518 123418 296533
1553B96533j09630J00689j48768j1165M4698j522k20293K31178M3588n47297L04059
$$ 296533 186903 287592 138824 127659 172357 170835 -49458 181720 225308 -321989 -17930
1542a7930J060r7954L445K50779j3842j32879M13887j20447l07753M0672l9141
$$ -17930 -16870 -114824 -111379 139400 125558 -7321 406566 286119 -21634 19038 -20103
1531b0103J83806j10036n5655K01078m55360O8984L79172k89391r7306K42025
$$ -20103 163703 53667 -1988 199090 -256270 -187286 191886 -97505 -194811 47214
1521D7214j99925j05874L3519K11857k70137j05489N66218j9295k69598L45180
$$ 47214 -152711 -258585 -225066 -13209 -283346 -388835 177383 158088 -111510 233670
1511B33670l07486k16905J12423j00333o798l6756K55920j61238p7670J30633
$$ 233670 -73816 -290721 -178298 -278631 -285429 -322185 -66265 -227503 -305173 -174540
1501a74540L49050l71810K47580L57239l68877P6174j81489q0498p4085r5188
$$ -174540 174510 -197300 50280 407519 38642 114816 -66673 -147171 -221256 -316444
1491c16444K35096N8272l28242J79366J55594l07530R38K440K22937p8836K87105
$$ -316444 -81348 -23076 -351318 -171952 -16358 -323888 -322950 -320510 -97573 -176409 110696
1480A10696K27783k17758K89162K6497l99158J41482K7440k30417K76210J21565
$$ 110696 338479 120721 409883 436380 37222 178704 206144 -24273 251937 373502
1470C73502k45436l35048J35604K22690j98948K99596L36101k66384J16817l23097
$$ 373502 128066 -206982 -71378 151312 -47636 251960 588061 321677 438494 115397
1460A15397q8436J55435j52748p4404N2547Q0068P5461k34002k91529L10056K72823
$$ 115397 26961 182396 29648 -44756 7791 87859 163320 -70682 -362211 -52155 220668
1449B20668l65589J08468P8415o4073J38002K31426k26310m53924J67876J05771
$$ 220668 -144921 -36453 41962 -22111 115891 347317 121007 -332917 -165041 -59270
1439e9270l13443q1891L63480r1631j40885J2143K0980L37595J11342L3800m92430
$$ -59270 -372713 -454604 -91124 -182755 -323640 -311497 -290517 47078 158420 192220 -300210
1428c00210J10006P78590j98219o08532K63831P3493l8146j92930N3331P1692
$$ -300210 -190204 588386 390167 -218365 45466 118959 80813 -112117 -58786 12906
1418A2906j86918J55901L05000l45480k28019K87362l7600j23222J80481L17626
$$ 12906 -174012 -18111 286889 -58591 -286610 752 -36848 -160070 20411 338037
1408C38037k34517j35006J30782l05346P4713K92834J10780j05630l14358N60263
$$ 338037 103520 -31486 99296 -206050 -131337 161497 272277 166647 -147711 412552
1398D12552j01279l58558K30634l4454j94458L81308m19268J40988j87291L20508
$$ 412552 311273 -47285 183349 148895 -45563 335745 -83523 57465 -129826 190682
1388A90682K75117o98940L34361l1662l80662M59256K22154j48361j23847j8538
$$ 190682 465799 -233141 101220 69558 -311104 148152 370306 221945 98098 79560
1378G9560J80439l72702r7157M57872l13879p2540K50389P5954J27430j24752
$$ 79560 259999 -112703 -209860 248012 -65867 -138407 111982 187936 315366 190614
1368A90614J45051N1599k70020K54328j71480n58887N20944J94483j89563j6341
$$ 190614 335665 387264 117244 371572 200092 -358795 162149 356632 167069 150728
1358A50728j31586L31072j97917k99260L22829l3502j28770N24871j38812l05423
$$ 150728 19142 350214 152297 -146963 175866 142364 13594 538465 399653 94230
1348I4230j04026m5118J05096n7255L54445r209l26633J92307K24895k55671J89687
$$ 94230 -9796 -54914 50182 -7073 347372 338163 11530 203837 428732 173061 362748
1337C62748n2765k72280l83757J60643K60313k93398K0301L47399J65285j47760
$$ 362748 309983 37703 -346054 -185411 74902 -218496 -198195 149204 314489 166729
1327A66729o8877k30230J21262J48363j20542j37591l096j577P5919J20014R7984
$$ 166729 97852 -132378 -11116 137247 16705 -120886 -123982 -125559 -49640 70374 168358
1316A68358J66450r9656j90445K87843J0409l00301l0009Q6257j33228m8400J28567
$$ 168358 334808 235152 44707 332550 342959 42658 12649 98906 -34322 -82722 45845
1305D5845k48428j84101M52891L01342j92448P1243j41025k15502R1120O2918
$$ 45845 -202583 -386684 66207 367549 175101 246344 105319 -110183 -19063 43855
1295D3855j63254M5122Q3016K00944j2092j14970j59191j82036J55454L20418
$$ 43855 -119399 -74277 8739 209683 197591 82621 -76570 -258606 -103152 217266
1285B17266j57279Q533N922J67010k52371k14566K92410k24888J01934q1440j07000
$$ 217266 59987 68520 74442 241452 -10919 -225485 66925 -157963 -56029 -137469 -244469
1274b44469J59710J38740l4966P1091j34234j55131R6131Q5624l4665n0762p4766
$$ -244469 -84759 53981 19015 90106 -44128 -199259 -103128 -17504 -52169 -102931 -177697
1263a77697J63313J69130k10339n4643L43278J09823n75556L68080Q2780l02204
$$ -177697 -14384 154746 -55593 -110236 233042 342865 -232691 135389 218169 -84035
1253h4035J31008J66981J21186l79020j51719M02051m43878J69110J64128r9273
$$ -84035 46973 213954 335140 -43880 -195599 206452 -237426 -68316 95812 -3461
1243c461J8583k64976K41011J15501n15994O07219L3199m44824M02960k17596
$$ -3461 15122 -249854 -8843 106658 -409336 197883 231082 -213742 189218 -28378
1233b8378l6269J02904L24045j48655k32207L31692M7529k06846N5013o8340K8873
$$ -28378 -64647 38257 362302 213647 -18560 313132 360661 153815 208828 140488 169361
1222A69361k86589K34806M9995j39999J08273L01535n92388j51239L34464j87615
$$ 169361 -117228 117578 167573 27574 135847 437382 -155006 -306245 28219 -159396
1212a59396j47820P7501L01900M5249j95044J89794Q3178k73595J59959L89482
$$ -159396 -307216 -229715 72185 117434 -77610 112184 195362 -78233 81726 471208
1202D71208k81784l13929K67149q4994j17467n1537m3905j60029J56431M15822
$$ 471208 189424 -124505 142644 57650 -59817 -111354 -155259 -315288 -158857 256965
1192B56965k4283n93885O33204k73236J74678K61448L9556N404m86387k46365
$$ 256965 232682 -361203 272001 -1235 173443 434891 474447 479851 -6536 -252901
1182b52901K10413O3330K59994K01591k82286K85381j52333m69034J52382M05848
$$ -252901 -42488 20842 280836 482427 200141 485522 333189 -135845 16537 422385
1172D22385k8407n03257l35075M83287j92358j0348K30386p1962j68864O9174
$$ 422385 393978 -109279 -444354 38933 -153425 -163773 66613 -5349 -174213 -105039
1162a05039K3120j82831j128M89098L5740j98976Q2914K19167m70790m7390L40889
$$ -105039 -81919 -264750 -265878 223220 258960 59984 142898 362065 -108725 -156115 184774
1151A84774j15369j82048L75769J0750O9607q4530q9563O767l1868L81320k61215
$$ 184774 69405 -112643 263126 273876 343483 258953 169390 176157 144289 525609 264394
1140B64394l40386M72845k82440k02788K89337M691q8837J14799J86370o6346
$$ 264394 -75992 396853 114413 -88375 200962 205653 116816 231615 417985 351639
1130C51639m27022K50851J81084n90261M82014K00945k37932q421k01993n0799
$$ 351639 -75383 175468 356552 -233709 248305 449250 211318 202897 904 -49895
1120d9895M7092k03025N9782j32105j83731L31042M45190m27940Q1057L1998m84000
$$ -49895 -2803 -205828 -146046 -278151 -461882 -130840 314350 -113590 -32533 -535 -484535
1109d84535J99169M65216K0005l77605L09558J50648j78593j14464P5569j94791
$$ -484535 -285366 179850 199855 -177750 131808 282456 103863 -10601 64968 -129823
1099a29823k17847K82793L928n6051J1438J77270R3125l41334K63677J18246l78420
$$ -129823 -347670 -64877 -60949 -117000 -105562 71708 164833 -176501 87176 205422 -172998
1088a72998L41782j82538j3478K89071r4694n1499K04637L3687o8920k74862J72461
$$ -172998 168784 -13754 -27232 261839 167145 115646 320283 353970 285050 10188 182649
1077A82649K81160m62632M5371P5546m2388l35310q7652J25653k105K69290r0818
$$ 182649 463809 1177 46548 122094 79706 -255604 -343256 -217603 -219708 49582 -41236
1066d1236L1776l8898J17948n8800j54554J70056R0649k04449J97519J1850j27067
$$ -41236 -9460 -48358 69590 10790 -143764 26292 116941 -87508 110011 121861 -5206
1055e206p9319Q8113L25286j31239j71892m8944j30095K63301k1367J88198j7237
$$ -5206 -84525 3588 328874 197635 25743 -23201 -153296 110005 88638 276836 259599
1044B59599k15818J76235l6020j91897K87981l7401j46176j11319j71418P1937
$$ 259599 43781 220016 183996 -7901 280080 242679 96503 -14816 -186234 -114297
1034a14297K31244q6557l8855J83390R445j07002J60872m3215j12517J3938k26169
$$ -114297 116947 30390 -8465 174925 184370 77368 238240 195025 82508 96446 -129723
1023a29723K76145k33329K21183K69041k15736k3141K69517l15523Q5500O156
$$ -129723 146422 -86907 134276 403317 187581 164440 433957 118434 203934 210090
1013B10090j041J19410k13941J7572l2292j59981L43917J27179k54643j10843
$$ 210090 209049 328459 114518 132090 99798 -60183 283734 410913 156270 45427
1003D5427k52223M74323l08188J13452J74788j75923J93549j44776J0640m1191
$$ 45427 -206796 267527 -40661 72791 247579 71656 265205 120429 131069 89878
993H9878r3884j65671J274l958M25332j0871P6231m30902j01068L88126n7307
$$ 89878 -4006 -169677 -168403 -172361 252971 242100 318331 -112571 -213639 174487 117180
982A17180j02234m6256r7297J63649K15066k08107J07325n4142j13389m4492J35446
$$ 117180 14946 -31310 -128607 35042 250108 42001 149326 95184 -18205 -62697 72749
971G2749p8914j14546J11390J54342L55511n488l28948l6520j86821j17419L19332
$$ 72749 -6165 -120711 -9321 145021 500532 495044 166096 129576 -57245 -174664 144668
960A44668k0983k59813k81115K91799J31466j83851N90708j06992m00306L37340
$$ 144668 123685 -136128 -417243 -125444 6022 -177829 412879 305887 -94419 242921
950B42921j51320l0297J56931m6906J90525l10790k13803J32087k18356N3097
$$ 242921 91601 61304 218235 171329 361854 51064 -162739 -30652 -249008 -195911
940a95911L26435L0389l22845M672L89349k6740m16676L19667M2768l14818L11801
$$ -195911 130524 160913 -161932 -157260 232089 205349 -211327 108340 151108 -163710 148091
929A48091n996n3086J44378o6654q7103j16229J87619J49168n05338J06008P58631
$$ 148091 142095 89009 233387 166733 79630 -36599 151020 300188 -205150 -99142 659489
918F59489m12916j10421L24944l36950j80156J76122m3148q5546P5749P4602k6540
$$ 659489 246573 136152 461096 124146 -56010 120112 76964 -8582 67167 141769 115229
907A15229j26508M39794j26248k00643M63589k56085k06603J76968k05351K16326
$$ 115229 -11279 428515 302267 101624 565213 309128 102525 279493 74142 290468
897B90468l32989j00022M95462j47661k44627J04530j14811j29455L64008J71654
$$ 290468 -42521 -142543 352919 205258 -39369 65161 -49650 -179105 184903 356557
887C56557j99814k48928K29184R5475O7390k0998k4046p4780r1347J09422j42887
$$ 356557 156743 -92185 136999 232474 299864 278866 254820 180040 88693 198115 55228
876E5228J58626K1491n8508m2665j03644m9436l2382j44230K14853K79291k23209
$$ 55228 213854 235345 176837 134172 30528 -18908 -51290 -195520 19333 298624 75415
865G5415O0085k76714O4194K36823o34916N49322K41967k41562L53088k43988
$$ 75415 135500 -141214 -77020 159803 -475113 74209 316176 74614 427702 183714
855A83714p5937j04506m44323N71362J89663j55851M3104N4483P7359j55648m8705
$$ 183714 107777 3271 -441052 130310 319973 164122 207226 261709 339068 183420 134715
844A34715P7858l70472l2822J79757J25960L48330k26029j50488J94166j74840
$$ 134715 212573 -157899 -190721 -10964 114996 463326 237297 86809 280975 106135
834A06135M3968j18615K9781K89693p1468n07106j8261J52055M4891j04622K70802
$$ 106135 150103 31488 61269 350962 279494 -227612 -245873 -93818 -48927 -153549 117253
823A17253K61922k33441j5308q4979L23908K7909k47649P4638q939k10268q13
$$ 117253 379175 145734 130426 45447 369355 397264 149615 224253 215314 5046 4233
812D233P539L84675j20760J13396k62849k68866M07830K35796n38772P1618o4506
$$ 4233 11772 396447 275687 389083 126234 -142632 265198 500994 -37778 33840 -30666
801c0666j99738J86753R3972l1600j4486K9223R7941K6074j56866J6902j02593
$$ -30666 -230404 -43651 50321 18721 4235 33458 131399 157473 607 17509 -85084
790h5084l5658N23957o371m53626j9359J9097j56217K983M31790j21780l36605
$$ -85084 -120742 403215 396844 -56782 -76141 -57044 -213261 -210278 221512 99732 -236873
779b36873L90555o2360p6764L29571j08245o630q7015k07956R7039j67141k24110
$$ -236873 153682 91322 14558 344129 235884 229254 142239 -65717 31322 -135819 -359929
768c59929L64375m42032J30925J21292L7946L33457j8635k24752M6006J77635
$$ -359929 4446 -437586 -306661 -185369 -147423 186034 167399 -57353 -11347 166288
758A66288Q1368k56276j04495P0143J06083k1763J19655j06497L1808q8344j08595
$$ 166288 247656 -8620 -113115 -42972 63111 41348 161003 54506 86314 -2030 -110625
747a10625L08324j82671j1920m2252m7322N4467n57j60146Q8675M18629l93120
$$ -110625 197699 15028 3108 -39144 -86466 -31999 -32556 -192702 -104027 314602 -78518
736g8518k3694J35272q3747J86749R3772j44915j09850k23795j87312m7415J21876
$$ -78518 -102212 33060 -50687 136062 229834 84919 -24931 -248726 -436038 -483453 -361577
725c61577K74594j24706O7343L30352Q5402j68456j59358o9010K89363j01042
$$ -361577 -86983 -211689 -144346 186006 271408 102952 -56406 -125416 163947 62905
715F2905j63231K5200p1364J28927J9179k59090J72902M8773J62950o7871J70246
$$ 62905 -100326 -75126 -146490 -17563 1616 -257474 -84572 -35799 127151 59280 229526
704B29526J17888m49521J4269J24351r1844K55851O90K37202l48913l27282J81477
$$ 229526 347414 -102107 -87838 36513 -55331 200520 201210 438412 89499 -237783 -56306
693e6306K13091k44911L47773J17999k37519j75137K31837j54500J100J94298
$$ -56306 156785 -88126 259647 377646 140127 -35010 196827 42327 43427 237725
683B37725m5234J19269l3242R6085m35397l18418J67750L4190r6400K48171k25605
$$ 237725 192491 311760 278518 374603 -60794 -379212 -211462 -177272 -273672 -25501 -251106
672b51106L6551O8363o9648K12953k9973N4370J56427j35174K93216j36063k90223
$$ -251106 -214555 -146192 -215840 -2887 -32860 21510 177937 42763 335979 199916 -90307
661i0307R5849J7304K47857J03942m93898L86931N7648l38793n4178p5225K9241
$$ -90307 5542 22846 270703 374645 -119253 267678 325326 -13467 -67645 -142870 -113629
650a13629l9406j74942L01634o5941K9966L73244m53237J93976M08584l41254
$$ -113629 -153035 -327977 -26343 -92284 -62318 310926 -142311 51665 460249 118995
640A18995m1869j1583l83009j6183J06587K23194m5646n76524L09082K79230j10635
$$ 118995 77126 65543 -317466 -333649 -227062 -3868 -49514 -626038 -316956 -37726 -148361
629a48361O713j72452L40194J14637l92975N89148j88314k44151K90829k35486
$$ -148361 -141648 -314100 26094 140731 -252244 336904 148590 -95561 195268 -40218
619d0218m5440L25942l85849m281K88718M3352O5960k99046k21226J72708J43211
$$ -40218 -85658 240284 -145565 -149846 138872 182224 248184 -50862 -272088 -99380 43831
608D3831J64507N1873k34119J11472J77817p2093j88879l22472L00790k4516j41748
$$ 43831 208338 260211 26092 137564 315381 243288 54409 -268063 32727 8211 -133537
597a33537L10881K1008o2744k26946L13062o1866j65685p8877J04213P9242n6637
$$ -133537 177344 198352 135608 -91338 221724 159858 -5827 -84704 19509 98751 42114
586D2114J12408m3669k23909L62833J74008l45922J9193N235M4935L3466R7580
$$ 42114 154522 110853 -113056 249777 423785 77863 97056 102291 147226 180692 278272
575B78272P9743l82861K8913K93654n9938l1449K26792l78470l11952J36743J58160
$$ 278272 358015 -24846 4067 297721 237783 206334 433126 54656 -257296 -120553 37607
564C7607j6288K21096j34368n0893o6536k11636K15195L9973L72026q3863k11693
$$ 37607 21319 242415 108047 57154 -9382 -221018 -5823 34150 406176 322313 110620
553A10620J60490k48266l7753K00882k52377j37319J73260J32324K63885q5452
$$ 110620 271110 22844 -14909 185973 -66404 -203723 -30463 101861 365746 280294
543B80294k31412J56693k51457K97506J50995j22878J28964k15742J01674J97119
$$ 280294 48882 205575 -45882 251624 402619 279741 408705 192963 294637 491756
533D91756k61943M7964o3510m32453L93106r9940j67664N54474q4954j43729N8877
$$ 491756 229813 277777 214267 -218186 174920 74980 -92684 461790 376836 233107 291984
522B91984p0658P2797j32324j15967J06652k47468q8858L46378m44050K01J40827
$$ 291984 221326 294123 161799 45832 152484 -94984 -183842 162536 -281514 -281313 -140486
511a40486l2576P8999k3856J12665K51235k83280K67320l0655k35267M00184j32275
$$ -140486 -173062 -94063 -117919 -5254 245981 -37299 230021 199366 -35901 364283 232008
500B32008n6591J65414p8102N2990L87950k06423k23442p3473l60935N8746p0013
$$ 232008 175417 340831 262729 315719 703669 497246 273804 200331 -160604 -101858 -171871
489a71871j56782K65921n465M05050N1454k68372J03207J00873m5230K48404j26189
$$ -171871 -328653 -62732 -68197 336853 388307 119935 223142 324015 278785 527189 401000
478D01000J7714j90437O054j9922k10637P2558J32354r1558K26874J45999k98731
$$ 401000 418714 228277 234331 214409 3772 76330 208684 117126 344000 489999 191268
467A91268r2535k06762j62715j1333j659L78109K78156o40682M10786R4979n80690
$$ 191268 98733 -108029 -270744 -282077 -283736 94373 372529 -268153 142633 237612 -343078
456c43078L87949J6707j96324M9662K9053J48703j55334J58894o4878l08426J08445
$$ -343078 44871 61578 -134746 -85084 -56031 92672 -62662 96232 31354 -277072 -168627
445a68627K87297j37201J62852j20686P6218l3286r0716J76020l57654J1174J24690
$$ -168627 118670 -18531 144321 23635 99853 66567 -24149 151871 -205783 -194609 -69919
434f9919J33038k65341j94734M9053J65568n666L64819Q2126k39475J87632J8532
$$ -69919 63119 -202222 -396956 -347903 -182335 -188001 176818 258944 19469 207101 225633
423B25633k86609Q2168J78152P93j02100j29165Q8531q6428j18596O4461J51710
$$ 225633 -60976 21192 199344 200137 98037 -31128 57403 -29025 -147621 -83160 68550
412F8550j07335L50076p4330n49232O6792K58472L8750j4798o4362K21604j12755
$$ 68550 -38785 311291 236961 -312271 -245479 12993 51743 36945 -27417 194187 81432
401H1432j54313R2197k02434K29384L4695j2609j9978l83837K43971O0194j67632
$$ 81432 -72881 19316 -183118 46266 80961 68352 48374 -335463 -91492 -31298 -198930
390a98930M22171j57244m3619m6424k67121K03873K31278j11222P2132P4283j01713
$$ -198930 223241 65997 22378 -24046 -291167 -87294 143984 32762 104894 179177 77464
379G7464k5882j61083L82131Q480k55393P9648k41044J28686o2335K01023M1420
$$ 77464 51582 -109501 272630 281110 25717 105365 -135679 -6993 -69328 131695 173115
368A73115j95724K67785P0576J64108k55258j75690j79171j43411M9601q241L31271
$$ 173115 -22609 245176 315752 479860 224602 48912 -130259 -273670 -224069 -232310 98961
357I8961L37979n483k83442R40p9818M3364j97016q130J28298j48812K5210J24923
$$ 98961 436940 431457 148015 148955 69137 112501 -84515 -92645 35653 -113159 -87949 36974
345C6974k03977L3550q433p4487J66308j69452L16821j70367j58265K45796J29371
$$ 36974 -167003 -133453 -141886 -216373 -50065 -219517 97304 -73063 -231328 14468 143839
334A43839j81503k9743K43257m1901J85127k09203k010n9848K64699L10020m75005
$$ 143839 -37664 -67407 175850 133949 319076 109873 107863 48015 312714 622734 147729
323A47729k99122L66823l42806j94115M47362m2036j66499Q4507K90250k57717
$$ 147729 -151393 215430 -127376 -321491 125871 83835 -82664 1843 292093 34376
313C4376M1801o312o6843J45231N5744n15430J3928K88066o8388K74699j38603
$$ 34376 76177 69865 3022 148253 203997 -311433 -297505 -9439 -77827 196872 58269
302E8269J3066K57972j34890k01900K13248l24831M050J88073p1443J46498j59340
$$ 58269 71335 329307 194417 -7483 205765 -119066 -115016 73057 1614 148112 -11228
291a1228J47007k6871j03005P8842N6054k86666K8140K67790m8072k67157L09971
$$ -11228 135779 108908 5903 84745 140799 -145867 -117727 150063 101991 -165166 144805
280A44805J00290l7648R7576l90703M2156j34543K00255J21674L109K52552l27928
$$ 144805 245095 207447 305023 -85680 -43524 -178067 22188 143862 146971 399523 71595
269G1595J2609K21477j53868k4242J93272n83150K35799L74905n600J81939l51984
$$ 71595 84204 305681 151813 127571 320843 -262307 -26508 348397 342797 524736 172752
258A72752n0261o3880l50542N05042M8179R3477J67653l96535L664L2884j76740
$$ 172752 122491 58611 -291931 213111 261290 354767 522420 125885 129549 162433 -14307
247a4307Q4822P4914j0616O4837j45743P1991j20322N3858J8531j0497J24611
$$ -14307 70515 145429 134813 199650 53907 125898 5576 59434 77965 67468 192079
236A92079l0165j48756K51057j22469k65242K05246K5735r9529m605K38923k82050
$$ 192079 161914 13158 264215 141746 -123496 81750 107485 7956 3351 242274 -39776
225c9776Q6787M2652J5281j07166k80858J86436K9524n2324J99583k5894m42797
$$ -39776 47011 89663 104944 -2222 -283080 -96644 -67120 -119444 80139 54245 -388552
214c88552K41032L94857Q208n79997J40107L63174k88610P7746L00373l41824
$$ -388552 -147520 247337 255545 -324452 -184345 178829 -109781 -32035 268338 -73486
204g3486P2402K41560j96278R0190L29134J24263j55368j45215l06448q2033j16773
$$ -73486 -1084 240476 44198 134388 463522 587785 432417 287202 -19246 -101279 -218052
193b18052K69222M1645j75082J34157j6941n5241j56219o7711P2114O6311J6986
$$ -218052 51170 92815 -82267 51890 34949 -20292 -176511 -244222 -172108 -105797 -88811
182h8811K75686k86453q80K24233k39541m9008P4520Q9632J83640j11046J23344
$$ -88811 186875 -99578 -100458 123775 -115766 -164774 -90254 -622 183018 71972 195316
171A95316N3168k43190P4868m4358J1493K68765M0918J38987j86842m07470J8667
$$ 195316 248484 5294 80162 35804 47297 316062 356980 495967 309125 -98345 -79678
160g9678j80332J23391R2488k73854J55223J01779N0286J29931k29957K21229
$$ -79678 -260010 -136619 -44131 -317985 -162762 -60983 -10697 119234 -110723 110506
150A10506Q8735l01405M1716R2348k11556J79824P9097j76473J10065Q9265j01488
$$ 110506 199241 -102164 -60448 31900 -179656 168 79265 -97208 12857 102122 634
139F34k0774r2270r1015K61185j43753J20265K32692p547k25865q7277K55375
$$ 634 -20140 -112410 -203425 57760 -85993 34272 266964 259417 33552 -53725 201650
128B01650r2463k0812J0632j56237J31342k22479j16386K80814k41023j17489
$$ 201650 109187 88375 99007 -57230 74112 -148367 -264753 16061 -224962 -342451
118c42451J66429k05123J19833J29024k01750L60859j84580j58623O9545r8048
$$ -342451 -176022 -381145 -261312 -132288 -334038 26821 -157759 -316382 -246837 -344885
108c44885M47149k06980j46840O0535M4363K85765j76646j85822M31680j62773
$$ -344885 102264 -104716 -251556 -191021 -146658 139107 -37539 -223361 208319 45546
98D5546m5376K75143l37069M82121n0351k21163K72253j54912n8639J05243j48798
$$ 45546 170 275313 -61756 420365 370014 148851 421104 266192 207553 312796 163998
87A63998j91288J50042r3772J35601K5959k4421K9487m9269L4578j26123n2110
$$ 163998 -27290 122752 28980 164581 190540 166119 195606 146337 180915 54792 2682
76B682J40457p857k17412J60936L3267r7084K06646j91736J17945L4724k60440
$$ 2682 143139 135282 -82130 78806 112073 14989 221635 29899 147844 182568 -77872
65g7872k4211j19486J27576K11482o2061J0383J85539j04207k50619r6051o5211
$$ -77872 -102083 -221569 -93993 117489 55428 65811 251350 147143 -103476 -199527 -264738
54b64738J05896L8600K93519m8011l26796K90218r7937o199O5073j70609K88J30103
$$ -264738 -158842 -120242 173277 125266 -201530 88688 -9249 -15448 49625 -120984 -120696 9407
42I407Q6278J81707j83052J56792K00763j83738k01640L22078j27919j82106K7145
$$ 9407 95685 277392 94340 251132 451895 268157 66517 388595 260676 78570 105715
31A05715l0913k05018j00779j8753K66211N5573l2947m4050p1686M6713L6909
$$ 105715 74802 -130216 -230995 -249748 16463 72036 39089 -4961 -76647 -29934 6975
20F975n0102j23364J98706L27950j26390j46380J39000j98527k00338K36961j21864
$$ 6975 -43127 -166491 32215 360165 233775 87395 226395 27868 -172470 64491 -57373
9e7373K7156L41993j99981j62690n4950J63147k65064R0723K65710
$$ -57373 -30217 311776 111795 -50895 -105845 57302 -207762 -117039 148671
0A48671
$$ 148671
$$ Imaginary data points
##PAGE= N=2
##DATA TABLE= (X++(I..I)), XYDATA
16383d39007L1444j03766K4752J32931N3363J5550l67261J53912K17598l10550
$$ -439007 -407563 -511329 -486577 -353646 -300283 -284733 -651994 -498082 -280484 -591034
16373e91034J7814L62350j95979r5167J47296j45225q9692L29903P0261j72435
$$ -591034 -573220 -210870 -406849 -502016 -354720 -499945 -589637 -259734 -189473 -361908
16363c61908J37069R8875p9514j16280l2861K56134j03967J6827L66269j80644
$$ -361908 -224839 -125964 -205478 -321758 -354619 -98485 -202452 -185625 180644 0
16353@m0932K33038j34767k65936J81453R2181j44824q461K42654k58487m2579
$$ 0 -40932 192106 57339 -208597 -27144 65037 -79787 -88248 154406 -104081 -146660
16342a46660J71167k35250M5124O4048L9243J10069j7263m15K87931j68560r2435
$$ -146660 24507 -210743 -165619 -101571 -62328 47741 30478 30063 317994 149434 56999
16331E6999N05136k83588r7985J974j09342J3665L5484J15146N0852k0667K68612
$$ 56999 562135 278547 180562 182536 73194 86859 122343 237489 288341 267674 536286
16320E36286l90351L9078L3803m7774J33010m9474J29535J72706M9073l52493
$$ 536286 145935 185013 218816 171042 304052 254578 384113 556819 605892 253399
16310B53399L7790k8803J41829J85822j09334J69671O7792l65190Q1373n0797
$$ 253399 291189 262386 404215 590037 480703 650374 718166 352976 434349 383552
16300C83552J6025K21055j69503m8808o721k39882M29099J79476j18436j55307
$$ 383552 399577 620632 451129 402321 395600 155718 584817 764293 645857 490550
16290D90550n5075R347O0331k95069o319J1143R6721M27727k07137p7086J61021
$$ 490550 435475 444822 505153 210084 203765 214908 311629 739356 532219 455133 616154
16279F16154j15535M66242J7817k75711L08379r0998l68889L59602j60222q8106
$$ 616154 500619 966861 984678 708967 1017346 926348 557459 917061 756839 668733
16269F68733R5223k05586k8156j04781K90993P5063m11451K82052K72841j25191
$$ 668733 763956 558370 530214 425433 716426 791489 380038 662090 934931 809740
16259H09740K95012j10871l8727J23719L0650q1316l64370j78519M77796r6020
$$ 809740 1104752 993881 955154 1078873 1109523 1028207 663837 485318 963114 867094
16249H67094j7356K71174j92452j65156J75989p8750j05708K15857j67411N6119
$$ 867094 849738 1120912 928460 763304 939293 860543 754835 970692 803281 859400
16239H59400M9943Q8740j03247l23173M11941J39647k17898L59959L9662k12811
$$ 859400 909343 998083 894836 571663 983604 1123251 905353 1265312 1304974 1092163
16229A092163j01903J12762n7539l35924o6939N16859j83929o0635L17764k82772
$$ 1092163 990260 1103022 1045483 709559 642620 1159479 975550 914915 1232679 949907
16219I49907n6459J94001Q8199j37256j28660J98093R3462M0356o1126J27018
$$ 949907 893448 1087449 1175648 1038392 909732 1107825 1201287 1241643 1180517 1307535
16209A307535j18157j11533K51626k1752k60983K74340J26895j99971K09586j49942
$$ 1307535 1189378 1077845 1329471 1307719 1046736 1321076 1447971 1248000 1457586 1307644
16199A307644j968J59718J34732o22742j0889K72898J75593k21274j07409M2529
$$ 1307644 1305676 1465394 1600126 977384 966495 1239393 1414986 1193712 1086303 1128832
16189A128832J33417K6824k12191K27434j56670O3333K13579k5574k47621K44819
$$ 1128832 1262249 1289073 1076882 1304316 1147646 1210979 1424558 1398984 1151363 1396182
16179A396182J2455l87824O6715K56481l32830M8986J60378o0673k9765j65988
$$ 1396182 1408637 1020813 1087528 1344009 1011179 1060165 1220543 1159870 1130105 964117
16169I64117K96487K4848l92057q2699M10450l51010P2854K33854m7502M3422
$$ 964117 1260604 1285452 893395 810696 1221146 870136 942990 1176844 1129342 1172764
16159A172764K71784J41647l42935j89526K69318p9464j52322K72379K08163p1952
$$ 1172764 1444548 1586195 1243260 1053734 1323052 1243588 1091266 1363645 1571808 1499856
16149A499856l65465K05349K47443k45312Q6975L28597k37894j96471J18517m0644
$$ 1499856 1134391 1339740 1587183 1341871 1428846 1757443 1519549 1323078 1441595 1400951
16139A400951N5020L63380j55582k40224j05670r6235J27450k45539K01683J85230
$$ 1400951 1455971 1819351 1663769 1423545 1317875 1221640 1349090 1103551 1305234 1490464
16129A490464m10356J76151Q9862j11671K55492l2802p0500j84417L0075l548
$$ 1490464 1080108 1256259 1346121 1234450 1489942 1457140 1386640 1202223 1232298 1228750
16119A228750j03462K3685L99339l7029k02970j52837K19243J72650k30967o7840
$$ 1228750 1125288 1148973 1548312 1511283 1308313 1155476 1374719 1547369 1316402 1248562
16109A248562K86500k25130o2410K87773m29453L6732M25223n4759J0732N6761
$$ 1248562 1535062 1309932 1247522 1535295 1105842 1142574 1567797 1513038 1523770 1580531
16099A580531N6339j58608j80321l595l4698M5764n2701J88878M2992k8863j96852
$$ 1580531 1636870 1478262 1297941 1294346 1259648 1305412 1252711 1441589 1484581 1455718 1258866
16088A258866J81452Q7980M7934p7049k92547K8747L49426k13821l5310J25031
$$ 1258866 1440318 1528298 1576232 1499183 1206636 1235383 1584809 1370988 1335678 1460709
16078A460709M9321L50914k25013j49576J95424j63081j39218J38818q233L2505
$$ 1460709 1510030 1860944 1635931 1486355 1681779 1518698 1379480 1518298 1510065 1542570
16068A542570J45907R7229l01627J18327j35935l99075L47056k02183M267J19319
$$ 1542570 1688477 1785706 1484079 1602406 1466471 1067396 1414452 1212269 1216536 1335855
16058A335855j89131k8246K08360P8741J55059l2044p4443k9697K57914n8643
$$ 1335855 1146724 1118478 1326838 1405579 1560638 1528594 1454151 1424454 1682368 1623725
16048A623725o00322M45658K75094n43664K82048l1375j89737L27729j61809L0176
$$ 1623725 1023403 1469061 1744155 1200491 1482539 1451164 1261427 1589156 1427347 1457523
16038A457523o459m33057N74677n0538p5018L79583J1972l66450k0708J75713
$$ 1457523 1451064 1018007 1592684 1542146 1467128 1846711 1858683 1492233 1471525 1647238
16028A647238j46986j77390K84144p0572n13994K62353L25233k83027q3807J80469
$$ 1647238 1500252 1322862 1607006 1536434 1022440 1284793 1610026 1326999 1243192 1423661
16018A423661j73848k52526K17264L25087k46607l45349M00987L99942n36228
$$ 1423661 1249813 997287 1214551 1539638 1293031 947682 1348669 1748611 1212383
16009A212383L75843m3053m83291J35928N57817k94116J29325O3030j20330j41448
$$ 1212383 1588226 1545173 1061882 1197810 1755627 1461511 1590836 1653866 1533536 1392088
15999A392088P6495L07968l17806m8750J18854M40727m18527N2665J74090l14567
$$ 1392088 1468583 1776551 1458745 1409995 1528849 1969576 1551049 1603714 1777804 1463237
15989A463237J13649L22981j21247k99609J76546N4799m75272L43724K01057l50640
$$ 1463237 1576886 1899867 1778620 1479011 1655557 1710356 1235084 1578808 1779865 1429225
15979A429225k95662K51758R0416j19957J82138J98884l91806j33248O01986j43226
$$ 1429225 1133563 1385321 1475737 1355780 1537918 1736802 1344996 1211748 1813734 1670508
15969A670508q4076j504L01606k97877l2790K48548j20477m26465K25807l4359
$$ 1670508 1586432 1584928 1886534 1588657 1555867 1804415 1683938 1257473 1483280 1448921
15959A448921l5229J27370J13180o563j01855K25460M7402l54407j09076K45525
$$ 1448921 1413692 1541062 1654242 1647679 1545824 1771284 1818686 1464279 1355203 1600728
15949A600728j22041k04455m0534j19387j10746P8648K79201M6596p0312M36572
$$ 1600728 1478687 1274232 1233698 1114311 1003565 1082213 1361414 1408010 1337698 1774270
15939A774270l13790j42870L54112k67762m0388Q5415l7678K79306N0553l20664
$$ 1774270 1460480 1317610 1671722 1403960 1363572 1448987 1411309 1690615 1741168 1420504
15929A420504N9136j32652k8522J04579j40157Q5383J54551m4821N8621j58535
$$ 1420504 1479640 1346988 1318466 1423045 1282888 1368271 1522822 1478001 1536622 1378087
15919A378087L9448n4297m20145J20185K15182j10158J11990l576j6336Q4048
$$ 1378087 1417535 1363238 943093 1063278 1278460 1168302 1280292 1276716 1260380 1344428
15909A344428n9560K63203M3372m75994L63922K10137l30024L28107k69275p6100
$$ 1344428 1284868 1548071 1591443 1115449 1479371 1689508 1359484 1687591 1418316 1342216
15899A342216K93446k66288J67008P1440n36284M45802p1177J47907R3571o7385
$$ 1342216 1635662 1369374 1536382 1607822 1071538 1517340 1446163 1594070 1687641 1620256
15889A620256N9014k97802J8411M36256m15221M499J39852l52108L61115l34958
$$ 1620256 1679270 1381468 1399879 1836135 1420914 1425413 1565265 1213157 1574272 1239314
15879A239314O4711M47941j94934L21820r1044m44296N48644k84554j40519N24159
$$ 1239314 1304025 1751966 1557032 1878852 1787808 1343512 1892156 1607602 1467083 1991242
15869A991242m41730j76469L05913k61044J50797k84339Q6946J34053n3971L35759
$$ 1991242 1549512 1373043 1678956 1417912 1568709 1284370 1371316 1505369 1451398 1787157
15859A787157N1915l19106L23997j80244k59653M89710L8972k08052p7491k84168
$$ 1787157 1839072 1519966 1843963 1663719 1404066 1893776 1932748 1724696 1647205 1363037
15849A363037L29949o5959k14030L84831p49555J36013K69303j83317L78080N4644
$$ 1363037 1692986 1627027 1412997 1797828 1048273 1184286 1453589 1270272 1648352 1702996
15839A702996R895q493l24233M11523j02355k21581L26751o2475j56931N9953
$$ 1702996 1712891 1704398 1380165 1791688 1689333 1467752 1794503 1732028 1575097 1635050
15829A635050O897J26328l11853M8340J91113m00061M1116N44987j20123j73237
$$ 1635050 1641947 1768275 1456422 1504762 1695875 1295814 1336930 1881917 1761794 1588557
15819A588557R3293k68247n9346J48796O3313P9376l54294J94942K60895k24456
$$ 1588557 1681850 1413603 1354257 1503053 1566366 1645742 1291448 1486390 1747285 1522829
15809A522829P1338L07124k48134n0328Q9683R8992K9680p0947J70460j31485
$$ 1522829 1594167 1901291 1653157 1602829 1692512 1791504 1821184 1750237 1920697 1789212
15799A789212k47870J06346J0139R3239K8335j26401J35061j44500M7848J67988
$$ 1789212 1541342 1647688 1657827 1751066 1779401 1653000 1788061 1643561 1691409 1859397
15789A859397m05063J50600M938l56224J77766K02960m2165N7949k22144J0863
$$ 1859397 1454334 1604934 1609872 1253648 1431414 1634374 1592209 1650158 1428014 1438877
15779A438877K32933j75895K34753j15052n6352J35566n3077J23875j01126r1015
$$ 1438877 1671810 1495915 1730668 1615616 1559264 1694830 1641753 1765628 1664502 1573487
15769A573487l5419l90754K63606J49925r4177J55431l3045l22483K47323L666
$$ 1573487 1538068 1147314 1410920 1560845 1466668 1622099 1589054 1266571 1513894 1517560
15759A517560l58418R8278N2444L49081Q8834k53076K5709k57062L03555M7393
$$ 1517560 1159142 1257420 1309864 1658945 1747779 1494703 1520412 1263350 1566905 1614298
15749A614298r6620k6637Q7678M6317K04816j54674L01236p105m60229r1318r5158
$$ 1614298 1517678 1491041 1578719 1625036 1829852 1675178 1976414 1969309 1509080 1417762 1322604
15738A322604k8483P4393n1714K99029L35628o79255Q1373L75820k98594J30571
$$ 1322604 1294121 1368514 1316800 1615829 1951457 1272202 1353575 1729395 1430801 1561372
15728A561372J15904L1869k84265J50367J57424q2611J76214j34935j49441J25834
$$ 1561372 1677276 1709145 1424880 1575247 1732671 1650060 1826274 1691339 1541898 1667732
15718A667732J05993n98093j15479Q579L76010N2140j48936K47388k43606j26081
$$ 1667732 1773725 1175632 1060153 1068732 1444742 1496882 1347946 1595334 1351728 1225647
15708A225647N22009k12340m40481L44234Q2985l33805j70669N25745J83615l82580
$$ 1225647 1747656 1535316 1094835 1439069 1522054 1188249 1017580 1543325 1726940 1344360
15698A344360M45533j82425l82232L50733L8720K4282j04825K1472K37011L0326
$$ 1344360 1789893 1607468 1225236 1575969 1614689 1638971 1534146 1555618 1792629 1822955
15688A822955n96223n8865j82942J6181O95176l93625n6847O58186k12673k60211
$$ 1822955 1226732 1167867 984925 1001106 1696282 1302657 1245810 1903996 1691323 1431112
15678A431112Q2058P7639R9408j24979K17533q7468k22560K43112k90692n878
$$ 1431112 1513170 1590809 1690217 1565238 1782771 1695303 1472743 1715855 1425163 1419285
15668A419285Q1929L836N44506o15862l9906N39328k93997k55198O12004n06535
$$ 1419285 1501214 1505050 2049556 1433694 1393788 1933116 1639119 1383921 1995925 1489390
$$ [...]
##END NTUPLES=NMR SPECTRUM
##END=
