##TITLE=1H_DE-80H_X3
 200.13MHz, d2o
 8 sc
 
 19ns.26.2.2025
##JCAMPDX= 6.0         $$ Bruker NMR JCAMP-DX V2.0
##DATA TYPE= NMR SPECTRUM
##DATA CLASS= NTUPLES
##ORIGIN= UXNMR, Bruker Analytische Messtechnik GmbH
##OWNER= pz
$$ XWIN-NMR		Version 3.5
$$ Thu Dec 25 10:42:28 2025 Russian Standard Time (UT+4h)  Yarkov@DPX200
##.OBSERVE FREQUENCY= 200.1313
##.OBSERVE NUCLEUS= ^1H
##.ACQUISITION MODE= SIMULTANEOUS
##.ACQUISITION SCHEME= undefined
##.AVERAGES= 8
##.DIGITISER RES= 18
##SPECTROMETER/DATA SYSTEM= spect
##.PULSE SEQUENCE= zg30
##.SOLVENT NAME= DMSO
##.SHIFT REFERENCE= (INTERNAL, DMSO, 0, 15.4957)
##AUDIT TRAIL= $$ (NUMBER, WHEN, WHO, WHERE, WHAT)
$$ ##TITLE= Audit trail, XWIN-NMR		Version 3.5
$$ ##JCAMPDX= 5.01
$$ ##ORIGIN= Bruker BioSpin GmbH
$$ ##OWNER= Yarkov
$$ C:/Bruker/XWIN-NMR/data/yarkov2/nmr/H-C/1/pdata/1/auditp.txt
$$ ##AUDIT TRAIL=  $$ (NUMBER, WHEN, WHO, WHERE, WHAT)
(   1,<2025-12-25 10:41:26.67 +0400>,<Yarkov>,<DPX200>,
      <created by zg, POWCHK disabled, PULCHK disabled
       configuration hash MD5:
       00 E9 B6 7A A2 85 ED C7 34 08 36 98 17 FE 4E 26
       data hash MD5: 16K
       C3 E0 29 0E 1D B2 31 3E 10 EE B7 68 20 B3 C5 A0>)
(   2,<2025-12-25 10:41:30.40 +0400>,<Yarkov>,<DPX200>,
      <Start of raw data processing
       efp BC_mod = 2 LB = 0.25 FT_mod = 6 PKNL = 1 PHC0 = -5299.955 PHC1 = 10.82193 SI = 16K 
       data hash MD5: 16K
       48 4B BB 4F 79 55 A8 5C F7 29 21 2C 94 C1 54 11>)
(   3,<2025-12-25 10:41:44.31 +0400>,<Yarkov>,<DPX200>,
      <pk PHC0 = -6.2 PHC1 = 0 
       data hash MD5: 16K
       BE 3A 7A 85 9B 21 B4 9D 4C 3A D6 56 B6 D1 13 01>)
$$ ##END=
$$ 
$$ hash MD5
$$ 15 CB 35 61 24 17 19 0B 4A 17 12 76 19 6B DE 63
##$RELAX= 
##$RELAX= 
##$RELAX= 
##$RELAX= 
##$RELAX= 
##$RELAX= 
$$ Bruker specific parameters
$$ --------------------------
##$DU= <C:/Bruker/XWIN-NMR>
##$EXPNO= 1
##$NAME= <H-C>
##$PROCNO= 1
##$TYPE= <nmr>
##$USER= <yarkov2>
##$AMP= (0..31)
100 100 100 100 100 100 100 100 100 100 100 100 100 100 100 100 100 100 
100 100 100 100 100 100 100 100 100 100 100 100 100 100 
##$AQSEQ= 0
##$AQ_mod= 1
##$AUNM= <au_zg>
##$AUTOPOS= <>
##$BF1= 200.13
##$BF2= 200.13
##$BF3= 200.13
##$BF4= 200.13
##$BF5= 200.13
##$BF6= 200.13
##$BF7= 200.13
##$BF8= 200.13
##$BYTORDA= 1
##$CFDGTYP= 0
##$CFRGTYP= 5
##$CHEMSTR= <none>
##$CNST= (0..31)
1 1 145 1 1 1 1 1 1 1 1 1 1 1 1 1 1 1 1 1 1 1 1 1 1 1 1 1 1 1 1 1 
##$CPDPRG= <>
##$CPDPRG1= <>
##$CPDPRG2= <>
##$CPDPRG3= <>
##$CPDPRG4= <mlev>
##$CPDPRG5= <mlev>
##$CPDPRG6= <mlev>
##$CPDPRG7= <mlev>
##$CPDPRG8= <mlev>
##$CPDPRGB= <>
##$CPDPRGT= <>
##$D= (0..31)
0 0.7 0 0 0 0 0 0 0 0 0 0.03 0 0 0 0 0 0 0 0 0 0 0 0 0 0 0 0 0 0 0 0 
##$DATE= 1766644886
##$DBL= (0..7)
120 120 120 120 120 120 120 120 
##$DBP= (0..7)
150 150 150 150 150 150 150 150 
##$DBP07= 0
##$DBPNAM0= <>
##$DBPNAM1= <>
##$DBPNAM2= <>
##$DBPNAM3= <>
##$DBPNAM4= <>
##$DBPNAM5= <>
##$DBPNAM6= <>
##$DBPNAM7= <>
##$DBPOAL= (0..7)
0.5 0.5 0.5 0.5 0.5 0.5 0.5 0.5 
##$DBPOFFS= (0..7)
0 0 0 0 0 0 0 0 
$$ [...]
##$SUBNAM2= <"">
##$SUBNAM3= <"">
##$SUBNAM4= <"">
##$SUBNAM5= <"">
##$SUBNAM6= <"">
##$SUBNAM7= <"">
##$SUBNAM8= <"">
##$SUBNAM9= <"">
##$SW= 18.0517328524113
##$SWIBOX= (0..15)
0 0 2 0 0 0 0 0 0 0 0 0 0 0 0 0 
##$SW_h= 3612.71676300578
##$TD= 16384
##$TD0= 1
##$TE= 0
##$TE2= 300
##$TE3= 300
##$TEG= 300
##$TL= (0..7)
0 120 120 120 120 120 120 120 
##$TP= (0..7)
150 150 150 150 150 150 150 150 
##$TP07= 0
##$TPNAME0= <>
##$TPNAME1= <>
##$TPNAME2= <>
##$TPNAME3= <>
##$TPNAME4= <>
##$TPNAME5= <>
##$TPNAME6= <>
##$TPNAME7= <>
##$TPOAL= (0..7)
0.5 0.5 0.5 0.5 0.5 0.5 0.5 0.5 
##$TPOFFS= (0..7)
0 0 0 0 0 0 0 0 
##$TUNHIN= 0
##$TUNHOUT= 0
##$TUNXOUT= 0
##$USERA1= <user>
##$USERA2= <user>
##$USERA3= <user>
##$USERA4= <user>
##$USERA5= <user>
##$V9= 5
##$VALIST= <valist>
##$VCLIST= <CCCCCCCCCCCCCCC>
##$VD= 0
##$VDLIST= <DDDDDDDDDDDDDDD>
##$VPLIST= <PPPPPPPPPPPPPPP>
##$VTLIST= <TTTTTTTTTTTTTTT>
##$WBST= 1024
##$WBSW= 4
##$XGAIN= (0..3)
0 0 0 0 
##$XL= 0
##$YL= 0
##$YMAX_a= 193166
##$YMIN_a= -150840
##$ZGOPTNS= <>
##$ZL1= 120
##$ZL2= 120
##$ZL3= 120
##$ZL4= 120
##$ABSF1= 0
##$ABSF2= 0
##$ABSG= 0
##$ABSL= 0
##$ALPHA= 0
##$AQORDER= 0
##$ASSFAC= 0
##$ASSFACI= 0
##$ASSFACX= 0
##$ASSWID= 0
##$AUNMP= <proc_1d>
##$AZFE= 0.1
##$AZFW= 0.1
##$BCFW= 0
##$BC_mod= 2
##$BYTORDP= 0
##$COROFFS= 0
##$CY= -3
##$DATMOD= 1
##$DC= 0
##$DFILT= <>
##$DTYPP= 0
##$F1P= 0
##$F2P= 0
##$FCOR= 1
##$FTSIZE= 16384
##$FT_mod= 6
##$GAMMA= 0
##$GB= 0
##$INTBC= 1
##$INTSCL= 3.241238e-09
##$ISEN= 128
##$LB= 0.25
##$LEV0= 0
##$LPBIN= 0
##$MAXI= 10000
##$MC2= 0
##$MEAN= 0
##$ME_mod= 0
##$MI= 1.114404
##$NCOEF= 0
##$NC_proc= -7
##$NLEV= 6
##$NOISF1= 3.799351
##$NOISF2= 2.8
##$NSP= 0
##$NTH_PI= 0
##$NZP= 0
##$OFFSET= 15.4957
##$PC= 1
##$PHC0= -5306.155
##$PHC1= 10.82193
##$PH_mod= 1
##$PKNL= yes
##$PPARMOD= 0
##$PSCAL= 0
##$PSIGN= 0
##$REVERSE= no
##$SF= 200.130005203579
##$SI= 16384
##$SIGF1= 3
##$SIGF2= 2
##$SINO= 0.751879
##$SIOLD= 32768
##$SREGLST= <19F.Aceton>
##$SSB= 0
##$STSI= 16384
##$STSR= 0
##$SW_p= 3612.71676300578
##$SYMM= 0
##$S_DEV= 0
##$TDeff= 16384
##$TDoff= 0
##$TI= <>
##$TILT= no
##$TM1= 0
##$TM2= 0
##$TOPLEV= 0
##$USERP1= <user>
##$USERP2= <user>
##$USERP3= <user>
##$USERP4= <user>
##$USERP5= <user>
##$WDW= 1
##$XDIM= 16384
##$YMAX_p= 353296296
##$YMIN_p= -792771
$$ End of Bruker specific parameters
$$ ---------------------------------
##NTUPLES= NMR SPECTRUM
##VAR_NAME=  FREQUENCY,     SPECTRUM/REAL,   SPECTRUM/IMAG
##SYMBOL=    X,             R,               I
##VAR_TYPE=  INDEPENDENT,   DEPENDENT,       DEPENDENT
##VAR_FORM=  AFFN,          ASDF,            ASDF
##VAR_DIM=   16384,         16384,           16384
##UNITS=     HZ,            ARBITRARY UNITS, ARBITRARY UNITS
##FACTOR=    0.220516191357247, 1,           1
##FIRST=     3101.15449811929, 0,            0
##LAST=      -511.562264886491, 0,           0
##MIN=       -511.562264886491, -792771,     0
##MAX=       3101.15449811929, 353296296,    0
$$ Real data points
##PAGE= N=1
##DATA TABLE= (X++(R..R)), XYDATA
$$ [...]
8721A6756898O14661J089024J326971J796619J808159K282526K311792J815397
$$ 16756898 17371559 18460583 19787554 21584173 23392332 25674858 27986650 29802047
8713B9802047R34014J42571l57905m05512N97577J466012K731163L542091M426034
$$ 29802047 30736061 30878632 30520727 30115215 30712792 32178804 34909967 38452058 42878092
8704D2878092M713046L439602K161282O16905j476473j895446k310702j744131
$$ 42878092 47591138 51030740 53192022 53808927 52332454 50437008 48126306 46382175
8696D6382175p20401n30648J020489J399224K181999K685372J294362O84199o32375
$$ 46382175 45661774 45131126 46151615 47550839 49732838 52418210 53712572 54396771 53764396
8687E3764396o50450r00870q43899M4915J37376Q80282J324234K402590L130201
$$ 53764396 53113946 52213076 51369177 51414092 51551468 52431750 53755984 56158574 59288775
8678E9288775L612798M670839N850760P096077Q279374R356942R864314J1279083
$$ 59288775 62901573 67572412 73423172 80519249 88798623 98155565 108019879 119298962
8670A19298962J1515659R363655M138417j787323m766475o406144n446236m421800
$$ 119298962 130814621 140178276 144316693 142529370 137762895 131356751 125910515 121488715
8662A21488715l150158j900677p23640J023902J967462L562093L266034K355633
$$ 121488715 118338557 116437880 115714240 116738142 118705604 122267697 125533731 127889364
8654A27889364m48494l479308m886798o365937o356482o350596n624107m789941
$$ 127889364 127440870 123961562 119074764 112708827 106352345 100001749 94377642 89587701
8646H9587701m686823m364668m107201l960528l533648k742169k957806k180727
$$ 89587701 84900878 80536210 76429009 72468481 68934833 66192664 63234858 61054131
8638F1054131k187100j712627j081729j095661k64946o85535l00459l80521K34919
$$ 61054131 58867031 57154404 56072675 54977014 54712068 54026533 53726074 53345553 53580472
8629E3580472J9155k99941N07287K22584N95959l06906r81137q14395q75648l44963
$$ 53580472 53599627 53299686 53806973 54029557 54625516 54318610 53337473 52523078 51647430 51302467
8619E1302467l95933k10816j02538m6372K26350J02636N71395K16893L1469M7562
$$ 51302467 50906534 50695718 50593180 50546808 50773158 50875794 51447189 51664082 51695551 51743113
8609E1743113k27942M09611l78131j56617P54771L19508M92897O4039l73103J24740
$$ 51743113 51515171 51924782 51546651 51390034 52144805 52464313 52957210 53021249 52648146 52772886
8599E2772886k46249j4798J75277k58627k78928q93861j110959q17662j312007
$$ 52772886 52526637 52511839 52687116 52428489 52149561 51255700 50144741 49327079 48015072
8590D8015072j093529j226672o62312m52111p96821l13058p98690J53047q5627
$$ 48015072 46921543 45694871 45032559 44580448 43783627 43470569 42671879 42824926 42739299
8581D2739299l77462M68592k10685N54423J62126L60911O72589N41389J638359
$$ 42739299 42361837 42830429 42619744 43174167 43336293 43697204 44369793 44911182 46549541
8572D6549541J186865J844712J747230J611550J196229R57215R37248k23628j89403
$$ 46549541 47736406 49581118 51328348 52939898 54136127 55093342 56030590 55806962 55617559
8563E5617559k34204n67681j96460j027508j543284j820551k312613j889020j755663
$$ 55617559 55383355 54815674 54619214 53591706 52048422 50227871 47915258 46026238 44270575
8554D4270575j996001j375346j762809j896700r84671j353705r41882j143015
$$ 44270575 42274574 40899228 39136419 37239719 36255048 34901343 33959461 32816446
8546C2816446p82274n09361o96961m74391j358346q20154q86589o33340M1187
$$ 32816446 32034172 31524811 30827850 30353459 28995113 28174959 27288370 26655030 26696217
8537B6696217p28260n02399q15494m21422n357m66671m48540n06360n66271m4801
$$ 26696217 25967957 25465558 24650064 24228642 24223285 23756614 23308074 22801714 22235443 22190642
8527B2190642k17404l57346l11932m22260m3107j8262l9235P139l31654k71059
$$ 22190642 21973238 21615892 21303960 20881700 20838593 20820331 20781096 20788235 20456581 20185522
8517B0185522k47977K15503m24275j64476l56250l39654P75956k41401R9621J9712
$$ 20185522 19937545 20153048 19728773 19564297 19208047 18868393 19644349 19402948 19502569 19522281
8507A9522281l68373K65029j47469J54153J98129l68172k04322Q3412J36766J73752
$$ 19522281 19153908 19418937 19271468 19425621 19623750 19255578 19051256 19134668 19271434 19445186
8497A9445186r9184J42339K14615J83599J35661k36306K97603k86977M6714K21036
$$ 19445186 19346002 19488341 19702956 19886555 20022216 19785910 20083513 19796536 19843250 20064286
8487B0064286j44657M16516l28957J39985L78798o4500K79024k95424M0771K7081
$$ 20064286 19919629 20336145 20007188 20147173 20525971 20461471 20740495 20445071 20485842 20512923
8477B0512923K7026Q5162J14340K97098k0719J3705P1064n6023L78212k46607
$$ 20512923 20539949 20625111 20739451 21036549 21015830 21029535 21100599 21044576 21422788 21176181
8467B1176181p1336J87064k34291K85631r0843K95290K05062j48260M83185K14028
$$ 21176181 21104845 21291909 21057618 21343249 21252406 21547696 21752758 21604498 22087683 22301711
8457B2301711L07442j30382j0311J71117Q6188K33996k34927R358L67945K46426
$$ 22301711 22609153 22478771 22468460 22639577 22725765 22959761 22724834 22734192 23102137 23348563
8447B3348563J46236J59967K00392J82291K37107j25764M23283j7122J82772L08885
$$ 23348563 23494799 23654766 23855158 24037449 24274556 24148792 24572075 24554953 24737725 25046610
8437B5046610K47923P82803k92617L99114P7159O38998N93535R2182O45867P0832
$$ 25046610 25294533 26077336 25784719 26183833 26260992 26899990 27493525 27585707 28231574 28302406
8427B8302406J227425Q98845P66218J034465Q07995J285904Q48932J508466R74389
$$ 28302406 29529831 30428676 31194894 32229359 33037354 34323258 35172190 36680656 37655045
8418C7655045O78529J119524J358674J893035J142876J011929J264720J350488
$$ 37655045 38333574 39453098 40811772 42704807 43847683 44859612 46124332 47474820
8410D7474820J556086J883510J306075J250198J446040J378777K168702J727280
$$ 47474820 49030906 50914416 52220491 53470689 54916729 56295506 58464208 60191488
8402F0191488J870186J109240L39984k79181j256330j318416k263251k341033
$$ 60191488 62061674 63170914 63510898 63231717 61975387 60656971 58393720 56052687
8394E6052687k716141k793894k698462k878256k029678j635265j137147r67109
$$ 56052687 53336546 50542652 47844190 44965934 42936256 41300991 40163844 39196735
8386C9196735p79929n99453q8641j08030o3644M27082M6782J64470L08622L63876
$$ 39196735 38416806 37817353 37728712 37620682 37557038 37984120 38030902 38195372 38503994 38867870
8376C8867870M52762K92207L15058L18201O80929P53884Q45768J018348J007941
$$ 38867870 39320632 39612839 39927897 40246098 40927027 41680911 42526679 43545027 44552968
8367D4552968J530108J022597P81020M52634j21021O160n04973j354418j494914
$$ 44552968 46083076 47105673 47886693 48339327 48218306 48224466 47719493 46365075 44870161
8358D4870161k372157k394219k150522k562199j876417k116541j738388k064945
$$ 44870161 42498004 40103785 37953263 35391064 33514647 31398106 29659718 27594773
8350B7594773j871748j188764j273783n85831j111011q59662p73737j013839n65102
$$ 27594773 25723025 24534261 23260478 22674647 21563636 20703974 19930237 18916398 18351296
8341A8351296n71616m84907k53789k98581l46771o2008o03699m94745j21773l63017
$$ 18351296 17779680 17294773 17040984 16742403 16395632 16333624 15729925 15235180 15113407 14750390
8331A4750390K32915l60342k73903j71740n49853J17331m36185r9393k79320m57735
$$ 14750390 14983305 14622963 14349060 14177320 13627467 13744798 13308613 13209220 12929900 12472165
8321A2472165J33392k28209j9050k77196k49848J15633k26886J89332j56553k29391
$$ 12472165 12605557 12377348 12358298 12081102 11831254 11946887 11720001 11909333 11752780 11523389
8311A1523389o0166k62260j75521k07084l62172k49832L7414o4407K58375l3895
$$ 11523389 11463223 11200963 11025442 10818358 10456186 10206354 10243768 10179361 10437736 10403841
8301A0403841k51876j84190l00742L04914k1852o020l63086m41095J83543m44148
$$ 10403841 10151965 9967775 9667033 9971947 9950095 9944075 9580989 9139894 9323437 8879289
8291H879289K02712q4709J35919K64574m84777k8176k38577P1005k36515j04996
$$ 8879289 9082001 8997292 9133211 9397785 8913008 8884832 8646255 8717260 8480745 8375749
8281H375749m4792j75567K15667l26437J85040k5584k00479j65310k68330L6098
$$ 8375749 8330957 8155390 8371057 8044620 8229660 8204076 8003597 7838287 7569957 7606055
8271G606055m2061l8295k27158J06824k20303J00165r5274k46491M61861j67023
$$ 7606055 7563994 7525699 7298541 7405365 7185062 7285227 7189953 6943462 7405323 7238300
8261G238300k42903l49708j82630J97258k25159j36618n6340J55953J85008q9543
$$ 7238300 6995397 6645689 6463059 6660317 6435158 6298540 6242200 6398153 6583161 6493618
8251F493618J26029l43755k36555N1593l49584O56012k10208n57453M86060o32009
$$ 6493618 6619647 6275892 6039337 6090930 5741346 6397358 6187150 5629697 6115757 5483748
8241E483748M25350L9421k60192L28465l97401L47085n9643m88062k31550j81739
$$ 5483748 5909098 5948519 5688327 6016792 5619391 5966476 5906833 5418771 5187221 5005482
8231E005482M20177m406J62568l74000k03485K94235Q208J23105J834n60644Q5303
$$ 5005482 5425659 5421253 5583821 5209821 5006336 5300571 5308779 5431884 5433718 4873074 4958377
8220D958377J33583q0111M53936o40642J01215J28224k44524L04468l92881k84841
$$ 4958377 5091960 5011849 5465785 4825143 4926358 5054582 4810058 5114526 4721645 4436804
8210D436804M9419J25100J69524l19215k08461L24444M68462L3371j80440k83567
$$ 4436804 4486223 4611323 4780847 4461632 4253171 4577615 5046077 5079448 4899008 4615441
8200D615441k91343k88123L06912k84357K34040J83831o63251M19673L40616L83444
$$ 4615441 4324098 4035975 4342887 4058530 4292570 4476401 3813150 4232823 4573439 4956883
8190D956883q3804p95487L39715j67797m0078J02657n68247J03392k18782J55010
$$ 4956883 4873079 4077592 4417307 4249510 4209432 4312089 3743842 3847234 3628452 3783462
8180C783462J17351J2584Q1778j00195l3087k07166J20433Q3804k33810J53618
$$ 3783462 3900813 3913397 3995175 3894980 3861893 3654727 3775160 3858964 3625154 3778772
8170C778772N0417k26504J63456k03405k9106M9885k37077L20183j19913M5043
$$ 3778772 3829189 3602685 3766141 3562736 3533630 3583515 3346438 3666621 3546708 3591751
8160C591751l0743k57291J80374M4654K07573l46764J0153O3147k07425K50101
$$ 3591751 3561008 3303717 3484091 3528745 3736318 3389554 3399707 3462854 3255429 3505530
8150C505530p08077K65823k45192j41495N64657l08370N67907l36572j40028K38879
$$ 3505530 2797453 3063276 2818084 2676589 3241246 2932876 3500783 3164211 3024183 3263062
8140C263062j6578L96806n97746j69328j33656m5135K44563j94581M09055j68300
$$ 3263062 3246484 3643290 3045544 2876216 2742560 2697425 2941988 2747407 3156462 2988162
8130B988162l300k2707m6157K53038k80110Q781l2454J01463P8417l60263q7134
$$ 2988162 2984862 2962155 2915998 3169036 2888926 2897707 2865253 2966716 3045133 2684870 2597736
8119B597736M0397L29142L4579j5647j78959k99861K38217k19081J86673J46054
$$ 2597736 2638133 2967275 3001854 2986207 2807248 2507387 2745604 2526523 2713196 2859250
8109B859250j42299j1535j96020L89268Q6641k16120j09947k31450J33511M9915
$$ 2859250 2716951 2705416 2509396 2898664 2985305 2769185 2659238 2427788 2561299 2611214
8099B611214O5973j62417q694J16507J8099J84543j4486m5941k18758r6491j6363
$$ 2611214 2677187 2514770 2506076 2622583 2640682 2825225 2810739 2764798 2546040 2449549 2433186
8088B433186J21621j46485k17063L2449J51455K89692Q3794q6076l42656O3313
$$ 2433186 2554807 2408322 2191259 2223708 2375163 2664855 2748649 2662573 2319917 2383230
8078B383230K25461Q0680l51024l04072O762J35797K90373l0841Q8929j69482
$$ 2383230 2608691 2689371 2338347 2034275 2041037 2176834 2467207 2436366 2525295 2355813
8068B355813j29142J77879r8067L38281q9641l08606J77791j99766J96035k38541
$$ 2355813 2226671 2404550 2306483 2644764 2555123 2246517 2424308 2224542 2420577 2182036
8058B182036J51040N4198J01980j0472m33728M65140j70264M2620k58267k07197
$$ 2182036 2333076 2387274 2489254 2478782 2045054 2510194 2339930 2382550 2124283 1917086
8048A917086O34114j31839J82192j084O5229r0788k90895k59166J96663L23084
$$ 1917086 2551200 2419361 2601553 2600469 2665698 2574910 2284015 2024849 2221512 2544596
8038B544596m61743J93075K47874J35677Q2245k74741j0167M18589J97413l51187
$$ 2544596 2082853 2275928 2523802 2659479 2741724 2466983 2456816 2875405 3072818 2721631
8028B721631q0295l27628K36374K16672m55297M66486l17158L45558J68231j53656
$$ 2721631 2641336 2313708 2550082 2766754 2311457 2777943 2460785 2806343 2974574 2820918
8018B820918L90435m47395p8855l7264K96048K13614l46476J0695q2071K83453
$$ 2820918 3211353 2763958 2685103 2647839 2943887 3157501 2811025 2821720 2739649 3023102
8008C023102q5209j42826J46924j16612Q1840M96232l26271p4322J19541k65848
$$ 3023102 2937893 2795067 2941991 2825379 2907219 3403451 3077180 3002858 3122399 2856551
7998B856551Q65094R918j11478K21231m31100Q1026p8164l15814L54968k84888
$$ 2856551 3721645 3731563 3620085 3841316 3410216 3491242 3413078 3097264 3452232 3167344
7988C167344J09917J42272k53857M17344n645J5154k16430m5539p6994j60641
$$ 3167344 3277261 3419533 3165676 3583020 3577375 3592529 3376099 3330560 3253566 3092925
7978C092925l002j58332R7547k09609r6306L86278J64954o579J84412m11911J52581
$$ 3092925 3089923 2931591 3029138 2819529 2723223 3109501 3274455 3267876 3452288 3040377 3192958
7967C192958K89969l15824J16811l44055J88753L43423j8442m700j08502j79060
$$ 3192958 3482927 3167103 3283914 2939859 3128612 3472035 3453593 3448893 3340391 3161331
7957C161331N415O40653k81936K67622j36019j93868O25208o35405L14027j91104
$$ 3161331 3166746 3807399 3525463 3793085 3657066 3463198 4088406 3453001 3767028 3575924
7947C575924j19130L51427M8959k40451o33341K9815l55290M88879L3807n10707
$$ 3575924 3456794 3808221 3857180 3616729 2983388 3013203 2657913 3146792 3180599 2669892
7937B669892L93174n90547M71841j7460l55306j00642m91685J59968L4002M06189
$$ 2669892 3063066 2472519 2944360 2926900 2571594 2470952 1979267 2139235 2173237 2579426
7927B579426j82017Q1664k27944k32559O57705k64497K10946k40737l87965L93358
$$ 2579426 2397409 2479073 2251129 2018570 2676275 2411778 2622724 2381987 1994022 2387380
7917B387380k22149j53718j55221J75465J70257J87604m4636K21313K83269k76316
$$ 2387380 2165231 2011513 1856292 2031757 2202014 2389618 2344982 2566295 2849564 2573248
7907B573248j09349J88042k43382K66924k59668k28619L78629n72556N3418k93945
$$ 2573248 2463899 2651941 2408559 2675483 2415815 2187196 2565825 1993269 2046687 1752742
7897A752742k10990M60535l21025r2088j05366N9539Q9638O1478J43182p9912
$$ 1752742 1541752 2002287 1681262 1589174 1483808 1543347 1632985 1694463 1837645 1757733
7887A757733J30248j70088l59037M2360j42144K07066K07343m62883N9732K1629
$$ 1757733 1887981 1717893 1358856 1401216 1259072 1466138 1673481 1210598 1270330 1291959
7877A291959J5362M89958l07498L3368J20684l96088K10439j84259m5433o4665
$$ 1291959 1307321 1797279 1489781 1523149 1643833 1247745 1458184 1273925 1228492 1163827
7867A163827L8618J64751j46453J7887j63942L43536j12431R9547P3668j29729
$$ 1163827 1202445 1367196 1220743 1238630 1074688 1418224 1305793 1405340 1479008 1349279
7857A349279J36922l95841M6293O0507Q9160j18324m3506N454n28Q656m7213J21805
$$ 1349279 1486201 1090360 1136653 1197160 1286320 1167996 1124490 1129944 1129416 1138072 1090859 1212664
7845A212664k67618r3895J51943J72215J43242p6042J4607l37264K47812J61534
$$ 1212664 945046 851151 1003094 1175309 1318551 1242509 1257116 919852 1167664 1329198
7835A329198j38772J36409p01054q033K41411J46486K79989k57173k8398L3943
$$ 1329198 1190426 1326835 625781 617748 859159 1005645 1285634 1028461 1000063 1034006
7825A034006P6561J98271k79831N6536N180j32511M776j12979j08266L66671J44158
$$ 1034006 1110567 1308838 1029007 1085543 1090723 958212 962988 850009 741743 1108414 1252572
7814A252572q8967L3915j99321l63018m8235M16619L2718k65632r1126q3388K34288
$$ 1252572 1163605 1197520 998199 635181 586946 1003565 1036283 770651 679525 596137 830425
7803H30425J76894j26465k1813r3662L61330k04822l6248k9430j12095J61923
$$ 830425 1007319 880854 859041 765379 1126709 921887 885639 856209 744114 906037
7793I06037K4886m5918J5481J66737o2194j06407P1831j36015J23346k42257K17617
$$ 906037 930923 885005 900486 1067223 1005029 898622 970453 834438 957784 715527 933144
7782I33144K71989o1449L0761k48047J40679K77225k3751l43944l11548J77843
$$ 933144 1205133 1143684 1174445 926398 1067077 1344302 1320551 976607 665059 842902
7772H42902o2671M5632m9997N2607O5248p7770J60316K31445R7325q6168j49034
$$ 842902 780231 825863 775866 828473 893721 815951 976267 1207712 1305037 1218869 1069835
7761A069835m66659K48482j13401k1938J59425l37941K11171Q827j47002J93599
$$ 1069835 603176 851658 738257 716319 875744 537803 748974 757801 610799 804398
7751H04398J16773j27358N7225J65424l0942J30822k96789p0847J09360J30521
$$ 804398 921171 793813 851038 1016462 985520 1116342 819553 748706 858066 988587
7741I88587j08633j89566j1402k8605K73850o4538K7156j28924k39070M58247
$$ 988587 879954 690388 678986 650381 924231 859693 886849 757925 518855 977102
7731I77102J13261J03319j10147m05716o2245J43512N3202k90727m4289k05454
$$ 977102 1090363 1193682 1083535 677819 615574 759086 812288 521561 477272 271818
7721B71818L44967M34554j44481J58928k29232j25763K97512j00283R4841O0274
$$ 271818 616785 1051339 906858 1065786 836554 710791 1008303 908020 1002861 1063135
7711A063135k36391m3483K0357J6495k78480j04846J65460J56329L55079l30796
$$ 1063135 826744 783261 803618 820113 541633 436787 602247 758576 1113655 782859
7701G82859j39180N0144j38812M19951j54650n9903N2192j02986j36556K9847
$$ 782859 643679 693823 555011 974962 820312 760409 812601 709615 573059 602906
7691F02906R4963m9765J68915j7712J5590Q6352o2478m9678O4493j6626l1982
$$ 602906 697869 648104 817019 799307 814897 901249 838771 789093 853586 836960 804978
7680H04978J78374m63571K15311l2604j98289L22888m42032J84546N2642n4098
$$ 804978 983352 519781 735092 702488 504199 827087 385055 569601 622243 568145
7670E68145L04247q888K86273l39363k77044r8464L34088K11636k61961r5162
$$ 568145 872392 863504 1149777 810414 533370 434906 768994 980630 718669 623507
7660F23507r6949o4712L59951K26596l14954L74853k91408J25003J87732m58504
$$ 623507 526558 461846 821797 1048393 733439 1108292 816884 941887 1129619 671115
7650F71115K38065m76823M0720N07828j50391N1140l02528k0369J49891J66937
$$ 671115 909180 432357 473077 980905 830514 881654 579126 558757 708648 875585
7640H75585p3860k65219J25690j2986J91529L69622m49469j97509m6859J5040
$$ 875585 801725 536506 662196 649210 840739 1210361 760892 563383 516524 531564
7630E31564P77891k24861l81604l10097L7756N36962J15976J8666k71383J11004
$$ 531564 1309455 1084594 702990 392893 430649 967611 1083587 1102253 830870 941874
7620I41874j68213M15753R4290l76668L5446n61182L32297L46597j00982k36298
$$ 941874 773661 1189414 1283704 907036 942482 381300 713597 1060194 959212 722914
7610G22914j48840N10076N9909K61073n89999j87380L53043n2256K05853k46896
$$ 722914 574074 1084150 1144059 1405132 815133 627753 980796 928540 1134393 887497
7600H87497j92990n0725J61390J79965J69567k11042k03448K08184O2133J92485
$$ 887497 694507 643782 805172 985137 1154704 943662 740214 948398 1010531 1203016
7590A203016j26066k65048k51244M2685M26973J02696J64187m82336k5800J67828
$$ 1203016 1076950 811902 560658 603343 1030316 1133012 1297199 814863 789063 956891
7580I56891j2617J87019l54901L7855K27718o7583k10002K07895K5354J65114
$$ 956891 944274 1131293 776392 814247 1041965 974382 764380 972275 997629 1162743
7570A162743o031l68842K02120j11362k5377M0444K62611m5296M8159K29250j78332
$$ 1162743 1156712 787870 989990 878628 853251 893695 1156306 1111010 1159169 1388419 1210087
7559A210087Q97046l31753l8054j45404m36934Q54095k43730Q6416n880J39172
$$ 1210087 2107133 1775380 1737326 1591922 1154988 2009083 1765353 1851769 1845889 1985061
7549A985061N30609K5387K87867k72186M82798N4785l9894O39741l58O05519N49568
$$ 1985061 2515670 2541057 2828924 2556738 3039536 3094321 3054427 3694168 3693810 4299329 4848897
7538D848897L63361O81545P49891N40030J573232J924189L216353M782121O779513
$$ 4848897 5212258 5893803 6643694 7183724 8756956 10681145 13897498 18679619 25459132
7529B5459132J0312719J0846298O213114j347284n492208p543162p742391o405330
$$ 25459132 35771851 46618149 52831263 51483979 45991771 38448609 30706218 24300888
7521B4300888n807533m244967l646279k465137j281168j081912l82294q10836
$$ 24300888 18493355 14248388 10602109 8136972 6855804 5773892 5391598 4580762
7513D580762o49226m02386l45487P4569m0380k37828l52021j2458j86298j91640
$$ 4580762 3931536 3529150 3183663 3258232 3217852 2980024 2628003 2615545 2429247 2237607
7503B237607k06068r8415L189K13661J32682j75884N8186m73388o0742j30436
$$ 2237607 2031539 1933124 1936313 2149974 2282656 2106772 2164958 1691570 1630828 1500392
7493A500392k9940L70188m34084P4724r7344J86869L10352n31657M9267N4726
$$ 1500392 1470452 1840640 1406556 1481280 1383936 1570805 1881157 1349500 1398767 1453493
7483A453493j51178K5543K02338n2221O0145k78363l55896J80374P7190J56736
$$ 1453493 1302315 1327858 1530196 1477975 1538120 1259757 903861 1084235 1161425 1318161
7473A318161k10563j1090J8351p5458k61202j59878K87093J57888L51633j63095
$$ 1318161 1107598 1096508 1114859 1039401 778199 618321 905414 1063302 1414935 1251840
7463A251840k51148j22682k13839K58853K51487l8656m54045k1020k66008M79567
$$ 1251840 1000692 878010 664171 923024 1174511 1135855 681810 660790 394782 874349
7453H74349J19206k65356K13047k57056K98574n3376p6502j74797j29297P6936
$$ 874349 993555 728199 941246 684190 982764 929388 852886 678089 548792 625728
7443F25728j06640J76774j24270J12379O6369j19845K59164k09702m7953j43247
$$ 625728 519088 695862 571592 683971 750340 630495 889659 679957 632004 488757
7433D88757Q7701O4350J53638j25959l1518J076j62752J76274k30458K34395J6572
$$ 488757 576458 640808 794446 668487 636969 638045 475293 651567 421109 655504 672076
7422F72076p390r9857q962J85573l15830L25023k7551m8540J19906k33277L78392
$$ 672076 664686 564829 555867 741440 425610 750633 723082 674542 794448 561171 939563
7411I39563k48960k07140n4391K5145J76871j37225N348M4117R8127J00639j47944
$$ 939563 690603 483463 429072 454217 631088 493863 499211 543328 641455 742094 594150
7400E94150p0617N3856j684j86274q9373j19543P5155n5215J0312L33506p0424
$$ 594150 523533 577389 575705 389431 300058 180515 255670 200455 210767 544273 473849
7389D73849J3502k58067K74142K69203j37701k5058o99758J58332K22572J43842
$$ 473849 487351 229284 503426 772629 634928 609870 -89888 68444 291016 434858
7379D34858J90536m09653K41742j14209J05127q2528o7856K69527o7749J15497
$$ 434858 625394 215741 457483 343274 448401 365873 298017 567544 499795 615292
7369F15292n7607j54913J20739j62374J51292Q2105R551O7985l43902r6526J69195
$$ 615292 557685 402772 523511 361137 512429 594534 604085 672070 328168 231642 400837
7358D00837m3157J09149l26173K50919N28634k24905j7861k30516J1251J74710
$$ 400837 357680 466829 140656 391575 920209 695304 677443 446927 458178 632888
7348F32888k46741j49225J38477J42614m2324Q1281j9660l9962R4773j05454N6214
$$ 632888 386147 236922 375399 518013 475689 556970 537310 497348 592121 486667 542881
7337E42881J96884j72652k12564k22096J31835N71372l70187j87836k14323J56040
$$ 542881 739765 567113 354549 132453 264288 835660 465473 277637 63314 219354
7327B19354N23741k17076J8503l65242L14209j62996j05976M73630m86003M97536
$$ 219354 743095 526019 544522 179280 493489 330493 224517 698147 212144 709680
7317G09680m96266K6385K59971l81160M22821l41355K60530j01223J67064p5765
$$ 709680 213414 239799 499770 118610 541431 200076 460606 359383 526447 450682
7307D50682k10103M97783j85518K86327m03097k52361J14159r0812K26904o2645
$$ 450682 240579 738362 552844 839171 436074 183713 297872 207060 433964 371319
7297C71319j21580J9693J60590L4239J84263o9761j70872J68958l19473K11358
$$ 371319 249739 269432 430022 464261 648524 578763 407891 576849 257376 468734
7287D68734q036k7998k05393K4043J52984O5121J42299l60169L52519m07894N5463
$$ 468734 460698 432700 227307 251350 404334 469455 611754 251585 604104 196210 251673
7276B51673L31139j20988J95102l21849Q5945l7185J97090j46075l69733L96368
$$ 251673 582812 461824 656926 335077 421022 383837 580927 434852 65119 461487
7266D61487q6394L67341k63819m24623K76794j13238L37542J22750j83640J20918
$$ 461487 375093 742434 478615 53992 330786 217548 555090 677840 494200 615118
7256F15118k622k62122J98043K09945k16689k23821j27409Q5304K15799Q650j37290
$$ 615118 612496 350374 548417 758362 541673 317852 190443 275747 491546 500196 362906
7245C62906J42271J09630o3893J78623m12195K23715Q0343m40107K84353k94791
$$ 362906 505177 614807 550914 729537 317342 541057 621400 181293 465646 170855
7235A70855N1308j09959m9536N04283L16813M5624m80023K6847j52563R6477K11308
$$ 170855 222163 112204 62668 566951 883764 929388 449365 476212 323649 420126 631434
7224F31434m36564K96791j4810j30635R093l52101J38267J46622N9324Q9948J93961
$$ 631434 194870 491661 476851 346216 355309 3208 141475 288097 347421 437369 631330
7213F31330j83864j1092j57254k05589L93448j8334j50082J193J42225j76552
$$ 631330 447466 436374 279120 73531 466979 448645 298563 299756 441981 265429
7203B65429P5344k62372O7989O23704m12241K19670j61726p4552J83778m02600
$$ 265429 340773 78401 146390 770094 357853 577523 415797 341245 525023 122423
7193A22423K30730m01839P0365J83036J667J23776m1896J41487k33700j45L88213
$$ 122423 353153 -48686 21679 204715 206382 330158 288262 429749 196049 195904 584117
7182E84117L5969J65135j77452l22301R7436k67681l49577K94303J8594L16991
$$ 584117 620086 785221 607769 285468 382904 115223 -234354 59949 78543 395534
7172C95534K34037q5712j09829k64393m0831K36235K71997J52757j52530l06293
$$ 395534 629571 543859 434030 169637 128806 365041 637038 789795 637265 330972
7162C30972k91072P6596N9248O662J73720J56637k54958N2133J10127p0186J69569
$$ 330972 39900 116496 175744 182406 356126 512763 257805 309938 420065 349879 519448
7151E19448l68422Q6167K71086J44706j28491k41417N2447N1325m3798k61050
$$ 519448 151026 237193 508279 652985 524494 283077 335524 386849 343051 82001
7141H2001L0286K75273O223Q074j01060J17880L00323k49681p0924J17848k8064
$$ 82001 112287 387560 393783 401857 300797 418677 719000 469319 398395 516243 488179
7130D88179J672l64861n7034K65324J2787j56737o6455K10006K45603K63744k59077
$$ 488179 489851 124990 67956 333280 346067 189330 122875 332881 578484 842228 583151
7119E83151j75785K11146k40125j3270J0258L74276l3654j01792k88882j42774
$$ 583151 407366 618512 378387 365117 375375 749651 715997 614205 325323 182549
7109A82549L18662p814R3051j9017j08980j3339m00538J46178K38457P3559j03234
$$ 182549 501211 493397 586448 567431 458451 445112 44574 190752 429209 502768 399534
7098C99534k16234j0537K10784K4146k39630P2579j17455K94093J6097j59010
$$ 399534 183300 172763 383547 407693 168063 240642 123187 417280 433377 274367
7088B74367K02725j63867K63531q2865R6668n0580l81320L47448k10162J80414
$$ 274367 477092 313225 576756 493891 590559 539979 158659 506107 295945 476359
7078D76359J7177n06082J81489J5352N49439l9696n37979J6068j41940K54442
$$ 476359 493536 -12546 168943 184295 733734 694038 156059 172127 30187 284629
7068B84629P4995K0255j28848k03375Q2558L7619J08133o755j88506O5842L02994
$$ 284629 359624 379879 251031 47656 130214 167833 275966 269211 80705 146547 449541
7057D49541P9073j28938Q7810l69288J79358J58786J0483r3581k54732J59798
$$ 449541 528614 399676 487486 118198 297556 456342 466825 373244 118512 278310
7047B78310J16106m5544l53528O3807K70291k36556K74531R1679p399N8399m14691
$$ 278310 394416 348872 -4656 59151 329442 92886 367417 459096 451697 510096 95405
7036I5405L28333Q6476j34895o8083k12455K03952J60121j39125l08078J19994
$$ 95405 423738 510214 375319 307236 94781 298733 458854 319729 11651 131645
7026A31645K64873Q9519J67721K2588j82366r1492k64828r0564K92011k4003J23489
$$ 131645 396518 486037 653758 676346 493980 402488 137660 47096 339107 315104 438593
7015D38593p0854j61064L11269k18950J58456j40725R0830L31303k87604K452
$$ 438593 367739 206675 517944 298994 457450 316725 407555 738858 451254 453706
7005D53706k20083J4167K6620j18393R5787Q9444n2816K78515k03006J58096j24718
$$ 453706 233623 247790 274410 156017 251804 341248 288432 566947 363941 522037 397319
6994C97319l86881K99803k2115L26706J67527l62110N2486m48663J27569K929
$$ 397319 10438 310241 288126 614832 782359 420249 472735 24072 151641 154570
6984A54570j17650M51082l18022K97356k25566k01936K63942j15178K49081J1594
$$ 154570 36920 488002 169980 467336 241770 39834 303776 188598 437679 449273
6974D49273O7514J35399l24982k84371j60293K0554J60806J97514p5291K968K03646
$$ 449273 516787 652186 327204 42833 -117460 -96906 63900 261414 186123 189091 392737
6963C92737J75462j38941q0620K9486q1847J41474q6944L7291O296l80849L50740
$$ 392737 568199 429258 348638 378124 296277 437751 350807 388098 394394 13545 364285
6952C64285k05264J51732K56156m49193K73592q267o7837P4931k81047O0970J03428
$$ 364285 159021 310753 566909 117716 391308 383041 315204 390135 109088 170058 273486
6941B73486L0294o2260m3530O8106q0331J74866q4481m0470L1891j88676N12507
$$ 273486 303780 241520 197990 266096 185765 360631 276150 235680 267571 78895 591402
6930E91402P402k16212j3865n17910M66502R8764J94736q8881k24610K11448m24765
$$ 591402 598804 382592 368727 -149183 317319 416083 610819 521938 297328 508776 84011
6919H4011J43972j33341L49350J66955k87418K74382l29632J23776j40035K8734
$$ 84011 227983 94642 443992 610947 323529 597911 268279 392055 252020 280754
6909B80754K24912J40075l76612k22655J39999j5544N51508m09267P9179P8549
$$ 280754 505666 645741 269129 46474 186473 170929 722437 313170 392349 470898
6899D70898n72505N61237m90735M70361P8330n22172K41171l25619O53643j77171
$$ 470898 -101607 459630 -31105 439256 517586 -4586 236585 -89034 564609 387438
6889C87438q5856J15298j06267L86887l13370l4284J01438q6837L19266m37762
$$ 387438 301582 416880 310613 697500 384130 349846 451284 364447 683713 245951
6879B45951J00903K00074k48343Q4113k52889K06002L06817k01876l46943j8747
$$ 245951 346854 546928 298585 382698 129809 335811 642628 440752 93809 75062
6869G5062L08475j5278J40884j01329J49675O6579n78355K51554Q8422L8695R4647
$$ 75062 383537 368259 509143 407814 557489 624068 45713 297267 385689 424384 519031
6858E19031k58087n6519J30519r3666j60167K54566l0971J67668l2138l14175
$$ 519031 260944 204425 334944 241278 81111 335677 304706 472374 440236 126061
6848A26061L51465j11889k76610J54087J7452L83859R7684n62089k87462M51947
$$ 126061 477526 365637 89027 243114 260566 644425 742109 180020 -107442 344505
6838C44505R717J2738N487j66913L88788k05737j15418J86972j26265K7041k21325
$$ 344505 354222 366960 372447 205534 594322 388585 273167 460139 333874 360915 139590
6827A39590J16190m3265J20703k93801R9387M79808l27268K27421l86528j62107
$$ 139590 255780 212515 333218 39417 138804 618612 291344 518765 132237 -29870
6817b9870N82056J31020j7558l17941p5734j7409j06419m3166J11468K12183k46034
$$ -29870 552186 683206 665648 347707 271973 254564 148145 104979 216447 428630 182596
6806A82596O8436k06726L18283L02593j08970m3894J9745K52110l49409l54351
$$ 182596 251032 44306 362589 665182 556212 512318 532063 784173 434764 80413
6796H0413j89531J66646L98379j83837K17004k28126P4558J51048k99050K03303
$$ 80413 -109118 57528 455907 272070 489074 260948 335506 486554 187504 390807
6786C90807J87862L32910j49700l98898r7450m2634L2943j08279K61059j11765
$$ 390807 578669 911579 761879 362981 265531 222897 255840 147561 408620 296855
6776B96855M1550n5360j80932M53051q221J12586p6446j34185O8450j43959l12469
$$ 296855 338405 283045 102113 555164 546943 659529 583083 448898 517348 373389 60920
6765F0920J85633K21383O3628M8029q4502k06725K54131O3964j89404P6958j34942
$$ 60920 246553 467936 531564 579593 495091 288366 542497 606461 417057 494015 359073
6754C59073o1699L3759p8365K27278j0642k06963n5550K25274m1715N1179l4695
$$ 359073 297374 331133 252768 480046 469404 262441 206891 432165 390450 441629 406934
6743D06934l20939M44264l11672P6126K10842n24539L59338j28720K33118J54650
$$ 406934 85995 530259 218587 294713 505555 -18984 340354 211634 444752 599402
6733E99402l69697M362j83365J19648P1580L26201P3706k77299q6387l43613L98431
$$ 599402 229705 234067 50702 170350 241930 568131 641837 364538 278151 -65462 332969
6722C32969Q7875l01724K44479j93857J76108p108j21235j71154J84712L27478
$$ 332969 420844 119120 363599 169742 345850 338742 217507 46353 231065 558543
6712E58543O199K71104o41074j22230K04728k15121N88863j55527k05586P1402
$$ 558543 564742 835846 194772 72542 277270 62149 651012 495485 289899 361301
6702C61301j41172J18976k0024n8880l096L18782j20619J368J55377l49906K66006
$$ 361301 220129 339105 319081 260201 257105 575887 455268 456636 612013 262107 528113
6691E28113K6823j4773j23733j06919o8023K78186J61627j12829k12634l60157
$$ 528113 554936 540163 416430 309511 241488 519674 681301 568472 355838 -4319
6681d319M94670L3460J10977j63828j84896K94036j30163J84148l99982J30371
$$ -4319 490351 523811 634788 470960 286064 580100 449937 634085 234103 364474
6671C64474j03248j14827O53923m93077K20412k38749k72913N24133k58637J40621
$$ 364474 261226 146399 800322 307245 527657 288908 15995 540128 281491 422112
6661D22112k2581j77008K78745k63015n0898J15774K8457L40256j94729p4611
$$ 422112 399531 222523 501268 238253 187355 303129 331586 671842 477113 402502
6651D02502j28735P4729J92403k51313K70063k16696j3966J82093j74132J75625
$$ 402502 273767 348496 540899 289586 559649 342953 328987 511080 336948 512573
6641E12573l08285o8031M50511J11842k8964m60841m25098L43823M47309k75838
$$ 512573 204288 136257 586768 698610 669646 208805 -216293 127530 574839 299001
6631B99001Q979l04217J77273K73846j06917L42356m97968K86382j03044O9790
$$ 299001 307980 3763 181036 454882 347965 690321 192353 478735 375691 445481
6621D45481j44235l72335L99249l47612P53688j68539l19090M4833l89540Q66011
$$ 445481 301246 -71089 328160 -19452 734236 565697 246607 291440 -98100 767911
6611G67911j71215j51765p6044j9285K27155L3425M0278l40641K55178k24662
$$ 767911 596696 444931 368887 349602 576757 610182 650460 309819 564997 340335
6601C40335k9999K17678k47884J2843J57969j10257Q7105n0957m50444M20240
$$ 340335 310336 528014 280130 292973 450942 340685 427790 376833 -73611 346629
6591C46629J42264J14139k5622n06000K64693L8394J38057j90661j38929J96655
$$ 346629 488893 603032 577410 71410 336103 374497 512554 321893 182964 379619
6581C79619K68544L07882n71164j67948j80906p9324O20847k19006R5660k8410
$$ 379619 648163 956045 384881 216933 36027 -43297 577550 358544 454204 425794
6571D25794l69126K87094J8142R1680J05143K1469K66081l2580j16143m95364
$$ 425794 56668 343762 361904 453584 558727 580196 846277 813697 697554 202190
6561B02190L0444J02801q500M50379l25899o0043j40463L40815k0529k96027J66654
$$ 202190 232634 335435 326935 777314 451415 391372 250909 591724 571195 275168 441822
6550D41822j63863L48646m8899K2487k4779r3912J5735m13450K91021K06323k5768
$$ 441822 277959 626605 577706 600193 575414 481502 497237 83787 374808 581131 555363
6539E55363J04680n6070k42742j31921J0378n607L97496j99159k3627o1301J60659
$$ 555363 660043 603973 361231 229310 239688 234081 631577 432418 408791 347490 508149
6528E08149J61944k66130r1183n2741L22703J1843J55378j49154k05121M7344
$$ 508149 670093 403963 312780 260039 582742 594585 749963 600809 395688 443032
6518D43032l02501K57488P5254r967k32211j00458J33196K3605J49832l36625
$$ 443032 140531 398019 473273 463306 231095 130637 263833 287438 437270 100645
6508A00645K17798K54408J24246j08359l19037J51141J05057R7265J93788K16451
$$ 100645 318443 572851 697097 588738 269701 420842 525899 623164 816952 1033403
6498A033403K7264k56142p7494j31318K94165k46671n3370j02206P7492K48098
$$ 1033403 1060667 804525 727031 595713 889878 643207 589837 487631 565123 813221
6488H13221l35017N7312k59698K62396q5748k19400Q5613J4214K85395j65549
$$ 813221 478204 535516 275818 538214 452466 233066 318679 332893 618288 452739
6478D52739J42316j38243p3565N5309l1308J51732N9001O7499l15706R346o2072
$$ 452739 595055 456812 383247 438556 407248 558980 617981 685480 369774 379120 317048
6467C17048K81143j86168j44723O6722k7410N55291m64357K00929j22891K16758
$$ 317048 598191 412023 267300 334022 306612 861903 397546 598475 475584 692342
6457F92342L16546n44626J23975l02803K07055L3193J1199K86069k83870j48861
$$ 692342 1008888 464262 588237 285434 492489 525682 536881 822950 539080 390219
6447C90219k2665J47522M07737j79809l75200N9518J1843M14759k18866k94818
$$ 390219 367554 515076 922813 743004 367804 427322 439165 853924 635058 340240
6437C40240Q6343n3575O75683j6805j75150N4316l00552J14239o5610K7984L5206
$$ 340240 426583 373008 1048691 1031886 856736 911052 610500 724739 659129 687113 722319
6426G22319j73411J4015M8608J21634n2490j06697n5092L38457N7270k16172j02952
$$ 722319 548908 562923 611531 733165 680675 573978 518886 857343 914613 698441 595489
6415E95489j04548Q0005O8730k8687j2600k7312J30531j61931K03358Q0142k38219
$$ 595489 490941 570946 639676 610989 598389 571077 701608 539677 743035 823177 584958
6404E84958J7862k43098K20575L71998p1786L00315j66593p853l13282k06693
$$ 584958 602820 359722 580297 952295 880509 1180824 1014231 1006378 693096 486403
6394D86403M55532M2231J61616l82711k97858j64642p6715M50744P4543R7819
$$ 486403 941935 984166 1145782 763071 465213 300571 223856 674600 749143 846962
6384H46962L4526N1252k20810q9412J16381l44531K67362j86793L84127j18975
$$ 846962 881488 932740 711930 622518 738899 394368 661730 474937 859064 740089
6374G40089k09382j07730k81257Q77682m96754Q4359j07451j67524P48255o62804
$$ 740089 530707 422977 141720 1019402 522648 607007 499556 332032 1080287 417483
6364D17483K25200j05530k30315M16081j41017L97909j94863j68932k52829J1098
$$ 417483 642683 537153 306838 722919 581902 979811 784948 616016 363187 374285
6354C74285M39607M4430l39312j31258K09676K41231K11559n42004K58833m39283
$$ 374285 813892 858322 519010 387752 597428 838659 1050218 508214 767047 327764
6344C27764K57472L49577n76932O34253l71151k68588L10655k03512M67443k04109
$$ 327764 585236 934813 357881 992134 620983 352395 663050 459538 926981 722872
6334G22872P0279M8172L9321l6429j46331k29408k08459L30421K30014l2788j18836
$$ 722872 793151 841323 880644 844215 697884 468476 260017 590438 820452 787664 668828
6323F68828M5481l26803K77515k1042K8861M69003n00177p8651m5517k15643M81279
$$ 668828 714309 387506 665021 643979 672840 1141843 641666 563015 517498 301855 783134
6312G83134k96478J83495J2530N8725J44094l53088J70786J24259J62121j92415
$$ 783134 486656 670151 682681 741406 885500 532412 703198 827457 989578 797163
6302G97163l83310M74376j41498J66228m5188m01325N42595l53039j22025n7557
$$ 797163 413853 888229 746731 912959 867771 466446 1009041 656002 533977 476420
6292D76420j3507M02143j09043J44155j44816K9193j23147j95755N49596J885
$$ 476420 462913 865056 756013 900168 755352 784545 661398 465643 1015239 1017124
6282A017124r044j37843l53739K19257P041J16304J0916P8370j26742J03797o0847
$$ 1017124 1008080 870237 516498 735755 742796 859100 870016 948386 821644 925441 864594
6271H64594k0381L4189k00840J31668N3796O1756k69061J82573j85241R4190L04080
$$ 864594 844213 878402 677562 809230 863026 924782 655721 838294 653053 747243 1051323
6260A051323l45043L14137o9041K2384n4258m97712M09784k22228K85588l9974
$$ 1051323 706280 1020417 951376 973760 919502 421790 831574 609346 894934 854960
6250H54960Q3840M0633l99914K97789j17401L30199M6279l02330p2257q6948N4584
$$ 854960 938800 979433 579519 877308 759907 1090106 1136385 834055 761798 674850 729434
6239G29434L72214Q0164k43541j0555j45096Q9484Q6757j26351l8352l1540L7280
$$ 729434 1101648 1181812 938271 927716 782620 872104 958861 832510 794158 762618 799898
6228G99898J60283R4592j39187o107K47247p4501K60557M892m77162J53974j29853
$$ 799898 960181 1054773 915586 909479 1156726 1082225 1342782 1347674 870512 1024486 894633
6217H94633K96208L51587p07726O5809O1719K94537P8746k06947j41245P4841
$$ 894633 1190841 1542428 834702 900511 962230 1256767 1335513 1128566 987321 1062162
6207A062162M78966m63078J34057k56752j13395L93756j37527K51403j68422k27137
$$ 1062162 1541128 1078050 1212107 955355 841960 1235716 1098189 1349592 1181170 954033
6197I54033m15438M47405K74146P7568j3352n03223L96725k24379l5346J11147
$$ 954033 538595 986000 1260146 1337714 1324362 821139 1217864 993485 958139 1069286
6187A069286J05624J49986P9833k47913j02806J17166k74320K88368Q4874j29774
$$ 1069286 1174910 1324896 1404729 1156816 1054010 1171176 896856 1185224 1270098 1140324
6177A140324P3680j20266O8933p3669M8226j41213M29237L504k41871l7676l68519
$$ 1140324 1214004 1093738 1162671 1089002 1137228 996015 1425252 1428756 1186885 1149209 780690
6166G80690N25175L21512m04127L2691j93252k3628L52079p8730j37228r6400
$$ 780690 1305865 1627377 1223250 1255941 1062689 1039061 1391140 1312410 1175182 1078782
6156A078782j84999J60942M74680l28892k30254J84035L6446M41672k6517l75025
$$ 1078782 893783 1054725 1529405 1200513 970259 1154294 1190740 1632412 1605895 1230870
6146A230870k88859P9861L37129L95629l07399l53642K31848j61035M58622M743
$$ 1230870 942011 1021872 1359001 1754630 1447231 1093589 1325437 1164402 1623024 1627767
6136A627767j30149R7027k17496Q6483J59086r4688j09461R9232J80866L22016
$$ 1627767 1497618 1594645 1377149 1463632 1622718 1528030 1418569 1517801 1698667 2020683
6126B020683n7993n87131j57625K38164L13929k3623j54612k67310J10149J10402
$$ 2020683 1962690 1375559 1217934 1456098 1770027 1746404 1591792 1324482 1434631 1545033
6116A545033J32900J75251k55504K39605j7941k87102J65740k99882J90691K61893
$$ 1545033 1677933 1853184 1597680 1837285 1819344 1532242 1697982 1398100 1588791 1850684
6106A850684j19802J10651j43031n2489j8296J78702J19590R9939j9007j89496
$$ 1850684 1730882 1841533 1698502 1646013 1627717 1806419 1926009 2025948 2006941 1817445
6096A817445R5269k33804N6151L40298q4621J48736j11440m28438r3402K14379
$$ 1817445 1912714 1678910 1735061 2075359 1990738 2139474 2028034 1599596 1506194 1720573
6086A720573J22873K88945j31506r5426Q767r3092K39111Q7431j50326K00790
$$ 1720573 1843446 2132391 2000885 1905459 1914226 1821134 2060245 2147676 1997350 2198140
6076B198140j37362P8985r449m04017J01612n849N65058o0691m0795p5812J9245
$$ 2198140 2060778 2139763 2130314 1726297 1827909 1822060 2387118 2326427 2285632 2209820 2229065
6065B229065L53381k92065N4678k14129L079K75015k98564L43294K1797L7996
$$ 2229065 2582446 2290381 2345059 2130930 2134009 2409024 2110460 2453754 2475551 2513547
6055B513547J44603M5358l908j38244O3608j30555M44877O660m19767n8239j49780
$$ 2513547 2658150 2703508 2699600 2561356 2624964 2494409 2939286 2945946 2526179 2467940 2318160
6044B318160M59967J16272l04036J01526n3331J52710J13864l65883J91436J58161
$$ 2318160 2778127 2894399 2590363 2691889 2638558 2791268 2905132 2539249 2730685 2888846
6034B888846n2690J42753j54687N0266j88281P2207K99537L7852J90719l12522
$$ 2888846 2836156 2978909 2824222 2874488 2686207 2758414 3057951 3095803 3286522 2974000
6024B974000J7915m3727J05624J68292m41226N27184J58006p0106o9568l18840
$$ 2974000 2991915 2948188 3053812 3222104 2780878 3308062 3466068 3395962 3326394 3007554
6014C007554o042J44359P3318r0556l1222O2275J98015J83611Q4655J07112j45171
$$ 3007554 3001512 3145871 3219189 3128633 3097411 3159686 3357701 3541312 3625967 3733079 3587908
6003C587908o3657j10200K43548J67276n0361q6359j52977J31277M9778P289R3164
$$ 3587908 3524251 3414051 3657599 3824875 3774514 3688155 3535178 3666455 3716233 3723522 3816686
5992C816686Q8465K52940j3821j59794j38618m3789K37900j9178Q4031O7616J64546
$$ 3816686 3905151 4158091 4144270 3984476 3845858 3802069 4039969 4020791 4104822 4172438 4336984
5981D336984N3592J73796j3179K4824J74838O1709J89077O4646J7994j74129q4181
$$ 4336984 4390576 4564372 4551193 4576017 4750855 4812564 5001641 5066287 5084281 4910152 4825971
5970D825971J37308O282Q2055j81894j51730K58296j89625J40906K8255R0385
$$ 4825971 4963279 4969561 5051616 4869722 4717992 4976288 4786663 4927569 4955824 5046209
5960E046209K48910j60666J38349K39141R7186j12669K6408j9975k54173L12783
$$ 5046209 5295119 5134453 5272802 5511943 5609129 5496460 5522868 5502893 5248720 5561503
5950E561503m6445r602J81012J94970p0477R1945J25798K63453J69915j49931
$$ 5561503 5515058 5505456 5686468 5881438 5810961 5902906 6028704 6292157 6462072 6312141
5940F312141K49838j59332J6669m2893j58220K39621L96523O4108l17495K7401
$$ 6312141 6561979 6402647 6419316 6376423 6218203 6457824 6854347 6918455 6600960 6628361
5930F628361K51970J14883R1638k37580M17772l4995K4747K99279j48242J36904
$$ 6628361 6880331 6995214 7086852 6849272 7267044 7232049 7256796 7556075 7407833 7544737
5920G544737j9669k9294L52718J63846K41937j20459j56633J5386J33147L92599
$$ 7544737 7525068 7495774 7848492 8012338 8254275 8133816 7977183 7992569 8125716 8518315
5910H518315m8250L42698l5508o3408K63698q9289M47787K9795k27451P0018J4274
$$ 8518315 8470065 8812763 8777255 8713847 8977545 8888256 9336043 9365838 9138387 9208405 9222679
5899I222679L87080M12850j86270M5821L63191K68861K44234j58720J17862L40680
$$ 9222679 9609759 10022609 9836339 9882160 10245351 10514212 10758446 10599726 10717588 11058268
5889A1058268K01603k8500j44973K10992l5252N37701K38001L15549K57449m38670
$$ 11058268 11259871 11231371 11086398 11297390 11262138 11799839 12037840 12353389 12610838 12172168
5879A2172168L88920L08798N65696L70758j14973R4502j09284N11376L90611N6880
$$ 12172168 12561088 12869886 13435582 13806340 13691367 13785869 13676585 14187961 14578572 14635452
5869A4635452K19986L3594N33584J98917K34434K86306Q6124N05121K43214L53286
$$ 14635452 14855438 14889032 15422616 15621533 15855967 16142273 16228397 16733518 16976732 17330018
5859A7330018O10747K13979N51869K24101K80789O50054K50239J047143J510483
$$ 17330018 17940765 18154744 18706613 18930714 19211503 19861557 20111796 21158939 22669422
5850B2669422J472206J621702K57081k10846k00768k40583J53660m72535o3103
$$ 22669422 24141628 25763330 26020411 25809565 25608797 25368214 25521874 25049339 24986236
5841B4986236j84926N972L14840K75796P15046K10485O28994O61640M39254Q15635
$$ 24986236 24801310 24807282 25122122 25397918 26112964 26323449 26952443 27614083 28053337 28868972
5831B8868972M47792M64869O83507K56548P02559P61452O39480Q16550N88280
$$ 28868972 29316764 29781633 30465140 30721688 31424247 32185699 32825179 33641729 34230009
5822C4230009P80520Q85616N99876Q51445Q74829J287087Q28918P90443J111416
$$ 34230009 35010529 35896145 36496021 37347466 38222295 39509382 40338300 41128743 42240159
5813D2240159O79646J427448Q26275J269335J420869J203093J589187O47034J510825
$$ 42240159 42919805 44347253 45173528 46442863 47863732 49066825 50656012 51303046 52813871
5804E2813871J414776J860958J847536J374424J971738J693632K074739J576228
$$ 52813871 54228647 56089605 57937141 59311565 61283303 62976935 65051674 66627902
5796F6627902K091060K485084K019187K347588K423630K846060K563283K785508
$$ 66627902 68718962 71204046 73223233 75570821 77994451 80840511 83403794 86189302
5788H6189302L005557L209067L731814L438736L703234L525008M232054M219043
$$ 86189302 89194859 92403926 96135740 99574476 103277710 106802718 111034772 115253815
5780A15253815M243076M709962M645879N394566N280973N531581O136651O180894
$$ 115253815 119496891 124206853 128852732 134247298 139528271 145059852 151196503 157377397
5772A57377397O577962O585060P039852P622452P534497P753757Q366084Q402793
$$ 157377397 163955359 170540419 177580271 185202723 192737220 200490977 208857061 217259854
5764B17259854Q601015R017513Q969446R432483R547552R316225R580890R212954
$$ 217259854 225860869 234878382 243847828 253280311 262827863 272144088 281724978 290937932
5756B90937932Q909683Q746708Q032160P745162P200217O352510N305460M089456
$$ 290937932 299847615 308594323 316626483 324371645 331571862 337924372 343229832 347319288
5748C47319288L016055K077123Q83830n87385j406394k635259m004742m942816
$$ 347319288 350335343 352412466 353296296 352708911 351302517 348667258 344662516 339719700
5740C39719700o141025p018402p258795q251691q380007q525258r547855r414408
$$ 339719700 333578675 326560273 319301478 311049787 302669780 294144522 284596667 275182259
5732B75182259r755934r265854q965034r401992q976869q897824q123445q120340
$$ 275182259 265426325 256160471 247195437 237793445 228816576 219918752 211795307 203674967
5724B03674967p472825p690769p404950o583380o757395o130759o134470o002669
$$ 203674967 196202142 188511373 181106423 174523043 167765648 161634889 155500419 149497750
5716A49497750n671775n125405m948340m514497m615806m485115l978534m016743
$$ 149497750 143825975 138700570 133752230 129237733 124621927 120136812 116158278 112141535
5708A12141535l342982l678176l744074l285075l213417k776528k961448k649282
$$ 112141535 108798553 105120377 101376303 98091228 94877811 92101283 89139835 86490553
5700H6490553k731573k178058k087125k830256k290835k326246k041959j532230
$$ 86490553 83758980 81580922 79493797 76663541 74372706 72046460 70004501 68472271
5692F8472271j838276j620452j802705k012024j617931j447768j443359j337836
$$ 68472271 66633995 65013543 63210838 61198814 59580883 58133115 56689756 55351920
5684E5351920j478150j510258j390032j057931j373264j092006j118269j045071
$$ 55351920 53873770 52363512 50973480 49915549 48542285 47450279 46332010 45286939
5676D5286939q17792j424671o62673j249237p35703p62256j330383o01690j126963
$$ 45286939 44469147 43044476 42381803 41132566 40396863 39634607 38304224 37702534 36575571
5667C6575571m53019r21441o22457m76616j177576k77050j178084m44365l21028
$$ 36575571 36122552 35201111 34578654 34102038 32924462 32647412 31469328 31024963 30703935
5658C0703935p29021k18059r37447p77647m90183o22935l09436j87437o92908
$$ 30703935 29974914 29756855 28819408 28041761 27551578 26928643 26619207 26431770 25738862
5649B5738862l04439p38753m91068k72464o91634j2360o52908k47087k82654n51325
$$ 25738862 25434423 24695670 24204602 23932138 23240504 23228144 22575236 22328149 22045495 21494170
5639B1494170j12250l66114k79881n71270l77605j80228m20977k87575l12103
$$ 21494170 21381920 21015806 20735925 20164655 19787050 19606822 19185845 18898270 18586167
5630A8586167l86658j81212m81116j38101M3063k43324Q020m10974o15124k50369
$$ 18586167 18199509 18018297 17537181 17399080 17442143 17198819 17206839 16795865 16180741 15930372
5620A5930372p06337K02031j42275j06994m3406q79996m7273r0644N1260l0911
$$ 15930372 15224035 15426066 15283791 15176797 15133391 14253395 14206122 14115478 14166738 14135827
5610A4135827m47598l09967j75644N0867k23909k06695k59527m41606J38683k59950
$$ 14135827 13688229 13378262 13202618 13253485 13029576 12822881 12563354 12121748 12260431 12000481
5600A2000481n5846k69509l26468N7728j76512j7118l15747k34181j3712J00467
$$ 12000481 11944635 11675126 11348658 11406386 11229874 11212756 10897009 10662828 10649116 10749583
5590A0749583K4126n85697l02088l24547j65871O98923j85620m25363l94886l77015
$$ 10749583 10773709 10188012 9885924 9561377 9395506 10094429 9908809 9483446 9088560 8711545
5580H711545M87217j88577j73264j66147k91739J89946j80573M1777k64555k89472
$$ 8711545 9198762 9010185 8836921 8670774 8379035 8568981 8388408 8430185 8165630 7876158
5570G876158j77778M3785J94824k08257J4617k91183J94749K7545l60687l25493
$$ 7876158 7698380 7742165 7936989 7728732 7743349 7452166 7646915 7674460 7313773 6988280
5560F988280j81953M79882j44965J07141p00737l85357K11019j33056M28528j50084
$$ 6988280 6806327 7286209 7141244 7248385 6547648 6162291 6373310 6240254 6668782 6518698
5550F518698R7339l30367l24690q524M7551j71436r8479N7632J5215N9999m77208
$$ 6518698 6616037 6285670 5960980 5952456 6000007 5828571 5730092 5787724 5802939 5862938 5385730
5539E385730J90915k71996m5092K08790l44368N13623m52746L26070k18157n34144
$$ 5385730 5576645 5304649 5259557 5468347 5123979 5637602 5184856 5510926 5292769 4758625
5529D758625K82407k84537L12352k09637j34985K9506j41017l5781k47718J51811
$$ 4758625 5041032 4756495 5068847 4859210 4724225 4753731 4612714 4576933 4329215 4481026
5519D481026J11072K5995j36768K91893m18753j23836l6081l30867M79037m19834
$$ 4481026 4592098 4618093 4481325 4773218 4354465 4230629 4194548 3863681 4342718 3922884
5509C922884K17848O6336j12014K3411m88823L39248K09093k3076J94306p5061
$$ 3922884 4140732 4207068 4095054 4118465 3629642 3968890 4177983 4154907 4349213 4274152
5499D274152r0683k53468k64007m967Q5362M9490J35290l96613J15908J01728
$$ 4274152 4183469 3930001 3665994 3661027 3746389 3795879 3931169 3534556 3650464 3752192
5489C752192K01294r3532k93454J33586l32152K05235p6068R3021J21772o76454
$$ 3752192 3953486 3859954 3566500 3700086 3367934 3573169 3497101 3590122 3711894 3035440
5479C035440j49378p9907O19076N9616l33236j39403k6271M28870k56999N8265
$$ 3035440 2886062 2806155 3425231 3484847 3151611 3012208 2985937 3414807 3157808 3216073
5469C216073k20423j30238K86805k39953L21641l02460j21237K98250p2693M45578
$$ 3216073 2995650 2865412 3152217 2912264 3233905 2931445 2810208 3108458 3035765 3481343
5459C481343k09352k43601j0447j39963K69486l3246l60444j72134j36529J92066
$$ 3481343 3271991 3028390 3017943 2877980 3147466 3114220 2753776 2581642 2445113 2637179
5449B637179p8396J9975j12769j98928K78739j06102J65061j46347l76291K66573
$$ 2637179 2558783 2578758 2465989 2267061 2545800 2439698 2604759 2458412 2082121 2348694
5439B348694j17568L04480j92866l65053L13364O0760J18454J4528j49099p7011
$$ 2348694 2231126 2535606 2342740 1977687 2291051 2351811 2470265 2484793 2335694 2258683
5429B258683L15496k5140J42404p1346j18423M2031j34830j14520k22350J37750
$$ 2258683 2574179 2549039 2691443 2620097 2501674 2543705 2408875 2294355 2072005 2209755
5419B209755q6119L51836j15152o26573K16241j97474M41888J85211l27418R6613
$$ 2209755 2123636 2475472 2360320 1733747 1949988 1752514 2194402 2379613 2052195 2148808
5409B148808j71994K0061L40395j63813j55311K1485Q052L87128k42148l53535
$$ 2148808 1976814 1996875 2337270 2173457 2018146 2039631 2047683 2434811 2192663 1839128
5399A839128k46491J87367J15916K17529J66801m81794L19732k63104P6935J25079
$$ 1839128 1592637 1780004 1895920 2113449 2280250 1798456 2118188 1855084 1932019 2057098
5389B057098p26838L17162L60088L01366J02474n90440n96083L30315K21509L00273
$$ 2057098 1330260 1647422 2007510 2308876 2411350 1820910 1224827 1555142 1776651 2076924
5379B076924o1449o99425K87748J82921J84387p2488j95054j77806k04351O22695
$$ 2076924 2015475 1316050 1603798 1786719 1971106 1898618 1703564 1525758 1321407 1944102
5369A944102k20386M32056m50937m69965N16450l32598L32192k67761j31516O50730
$$ 1944102 1723716 2155772 1704835 1234870 1751320 1418722 1750914 1483153 1351637 2002367
5359B002367q4511m3018m19192j02186J44003L97118O2933m41438P5181m33671
$$ 2002367 1917856 1874838 1455646 1353460 1497463 1894581 1957514 1516076 1591257 1157586
5349A157586K77310K50962k81428J73452k31475L36649L65949l50929k33169j73354
$$ 1157586 1434896 1685858 1404430 1577882 1346407 1683056 2049005 1698076 1464907 1291553
5339A291553K0785Q355J16167k55781J85693J6732R1747J52271k86561J51388
$$ 1291553 1312338 1320693 1436860 1181079 1366772 1383504 1475251 1627522 1340961 1492349
5329A492349K262J45537r687j86209j94212n1595L02172k93610K22879k22816
$$ 1492349 1494611 1640148 1630461 1444252 1250040 1198445 1500617 1207007 1429886 1207070
5319A207070k15737M19150L1226J54258l46572m2855J51883j41328N03186k64209
$$ 1207070 991333 1410483 1441709 1595967 1249395 1206540 1358423 1217095 1720281 1456072
5309A456072J1692N7147l15340K77983l06253N4660J31508K2805L05932k50276
$$ 1456072 1467764 1524911 1209571 1487554 1181301 1235961 1367469 1390274 1696206 1445930
5299A445930r7104k9865k16447K05064j69246K9874n0017k40250L98155J7159
$$ 1445930 1348826 1318961 1102514 1307578 1138332 1168206 1118189 877939 1276094 1293253
5289A293253J3297j912l11588J08044r7994J22636J20068q1653Q666j07916k45594
$$ 1293253 1306550 1304638 993050 1101094 1003100 1125736 1245804 1164151 1172817 1064901 819307
5278H19307J36891K35036r2325J53897k13099J09700J56063r0894l0811L1025
$$ 819307 956198 1191234 1098909 1252806 1039707 1149407 1305470 1214576 1183765 1214790
5268A214790J21169k71555K41744j87797k08331K40642l00652K13925l20711J95800
$$ 1214790 1335959 1064404 1306148 1118351 910020 1150662 850010 1063935 743224 939024
5258I39024J83979j47369M67168j76210J47174l89480j80150L55010J90730J16598
$$ 939024 1123003 975634 1442802 1266592 1413766 1024286 844136 1199146 1389876 1506474
5248A506474o09089r5301M3961K75947J84721l29358j40397j9794J92559J0173
$$ 1506474 897385 802084 846045 1121992 1306713 977355 836958 817164 1009723 1019896
5238A019896J72779l75813M6542n1075j71202N97205l65003J46437j36718j37904
$$ 1019896 1192675 816862 863404 812329 641127 1238332 873329 1019766 883048 745144
5228G45144K59113j66333J69927k55151p7301K97082J39010p3801R190q239j27922
$$ 745144 1004257 837924 1007851 752700 675399 972481 1111491 1037690 1046880 1038641 910719
5217I10719K76868r3027j09666j48689m3792J30246M4182J56580k27078P0281
$$ 910719 1187587 1094560 984894 836205 792413 922659 966841 1123421 896343 966624
5207I66624j91442J05551J15851k06668K31878l30189j05411J89533J27578K65776
$$ 966624 775182 880733 996584 789916 1021794 691605 586194 775727 903305 1169081
5197A169081k32307M6808J34559k34908j9316j95856j6152J67523J29106K80435
$$ 1169081 936774 983582 1118141 883233 863917 668061 651909 819432 948538 1228973
5187A228973k63948j78111j17864Q629M56259Q2180k06896k12924j89769M38920
$$ 1228973 965025 786914 669050 677679 1133938 1216118 1009222 796298 606529 1045449
5177A045449r2524r1613J0069l19665J97144l9710J18724K63482l23913J62720
$$ 1045449 952925 861312 871381 551716 748860 709150 827874 1091356 767443 930163
5167I30163j11086K5025J16831m01976K62704j96386L6617J06364k79733J38835
$$ 930163 819077 844102 960933 558957 821661 625275 661892 768256 488523 627358
5157F27358J07033K00509R3637r7127j39147j71004L00844J9337j36099j17406
$$ 627358 734391 934900 1028537 931410 792263 621259 922103 941440 805341 687935
5147F87935j58292J82620Q3644M6479r7792n0289J04775m0662K0372m2467k3974
$$ 687935 529643 712263 795907 842386 744594 694305 799080 758418 778790 736323 712349
5136G12349J6352K5082R0542l2046j01638j00892k3714J81497J32733j10053j80387
$$ 712349 728701 753783 844325 812279 710641 609749 586035 767532 900265 790212 609825
5125F09825J32648K9013J59874k27987o9213o4085k8119R6173j58246L09401k06968
$$ 609825 742473 771486 931360 703373 634160 570075 541956 638129 479883 789284 582316
5114E82316k76870K08805L9719L98646k7175l45m9904j97233J59147j85821J33322
$$ 582316 305446 514251 553970 952616 925441 925096 875192 677959 837106 651285 784607
5103G84607j30432J08170l3653j65677J23642L3583k59734K0695J17826P4718
$$ 784607 654175 762345 728692 563015 686657 720240 460506 481201 599027 673745
5093F73745L88879l81141m9510N9577k57075M08257m04740m5893O3271P4182L92826
$$ 673745 1062624 681483 631973 691550 434475 842732 437992 392099 455370 529552 922378
5082I22378M9603J21259m34093l524o8025J93151L13356n29460J01501j47636
$$ 922378 971981 1093240 659147 655623 587598 780749 1094105 564645 666146 518510
5072E18510j8718K52546m01914J74274J17070J10615J43404k6067j64393k29334
$$ 518510 499792 752338 350424 524698 641768 752383 895787 869720 705327 475993
5062D75993J07505p8464M32380j09779l23861K86365l93012L76764n5601m61456
$$ 475993 583498 505034 937414 827635 503774 790139 397127 773891 718290 256834
5052B56834L19097p7231J77986K20342k39838j90397K01617j24623R9721J80976
$$ 256834 575931 498700 676686 897028 657190 466793 668410 543787 643508 824484
5042H24484k78668J8954J25606J92839j21792Q9136j51502q1560Q9231K4090M53988
$$ 824484 545816 564770 690376 883215 761423 850559 699057 617497 706728 730818 1184806
5031A184806n32349j02551J81213l19956K44470j67480p8317L17622K3020m7893
$$ 1184806 652457 549906 731119 411163 655633 488153 409836 727458 750478 702585
5021G02585R81l96041K00277J20029o3567K30615j26024Q4825l02022P3843J67497
$$ 702585 703566 307525 507802 627831 564264 794879 668855 753680 451658 525501 692998
5010F92998J24814J02286l43203N54756k56051N8217q2334m34571L60236j6357
$$ 692998 817812 920098 576895 1131651 875600 933817 851483 416912 777148 760791
5000G60791J20678q354J40275j31051m6833j91898r0044N37660j63638n1973j22933
$$ 760791 881469 873115 1013390 882339 835506 643608 553564 1091224 927586 875613 752680
4989G52680j48545K25297k59282J98592J23930m2635k10528j75060M03214j45055
$$ 752680 604135 829432 570150 768742 892672 850037 639509 464449 867663 722608
4979G22608J097j39062j04619M39536m22077K17789p9653J84612K75716n58837
$$ 722608 723705 584643 480024 919560 497483 715272 635619 820231 1095947 537110
4969E37110L1757k98561K88250K35614J46714J95981o33904j07760J05140J11176
$$ 537110 568867 270306 558556 794170 940884 1136865 502961 395201 500341 611517
4959F11517L72741k66252k19433l146R0920L45958j91262J675j54076J01154L81553
$$ 611517 984258 718006 498573 495427 586347 932305 741043 742718 588642 689796 1071349
4948A071349j13746m0005j99536O8780L44191J94618k34781k95340K9064M73367
$$ 1071349 957603 917598 718062 786842 1131033 1325651 1090870 795530 824594 1297961
4938A297961O67905J57682L46115K37253J258932J026497L51741K96174q39872
$$ 1297961 1965866 2123548 2469663 2706916 3965848 4992345 5344086 5640260 4800388
4929D800388l37723o31255l56899o55219j024968k78111l42511N79651k77230
$$ 4800388 4462665 3831410 3474511 2819292 1794324 1516213 1173702 1753353 1476123
4920A476123j65853j02043l54067M98785k60640p8458l53590L22206K05387m0725
$$ 1476123 1310270 1208227 854160 1352945 1092305 1013847 660257 982463 1187850 1147125
4910A147125K6580o58755M46988J0730K43038K5357l72529J64895j94849P14368
$$ 1147125 1173705 514950 961938 972668 1215706 1241063 868534 1033429 838580 1552948
4900A552948l45488k28044l67802n5755L84220k26019L93065o31253K98118J73880
$$ 1552948 1207460 979416 611614 555859 940079 714060 1107125 475872 773990 947870
4890I47870j61311M75612m05958L1254o430L83898l1972m56422k95920j31099
$$ 947870 786559 1262171 856213 887467 881037 1264935 1232963 776541 480621 349522
4880C49522K64037J23038K59902j9411L3124j43496j97644N3550k92461K10792
$$ 349522 613559 736597 996499 977088 1010212 866716 669072 722622 430161 640953
4870F40953O2104J38806m9188m91190J26782m19695K31965M25063j66681K56080
$$ 640953 703057 841863 792675 301485 428267 8572 240537 665600 498919 754999
4860G54999j28291K74530K5245m39209J29451k60933J28886L1492j90177K47217
$$ 754999 626708 901238 926483 487274 616725 355792 484678 516170 325993 573210
4850E73210J71104q1337j09212o7509j3184r0908J13223K18910J75629q4976k65135
$$ 573210 744314 662977 553765 486256 473072 382164 495387 714297 889926 804950 539815
4839E39815j71414J05533M7889l6949j29826J74131M20458k30417j60032j69820
$$ 539815 368401 473934 521823 484874 355048 529179 949637 719220 559188 389368
4829C89368r7627N78811j17607J14388j0874m75614K1416k11317J31558N6645
$$ 389368 291741 870552 752945 867333 856459 380845 402261 190944 322502 379147
4819C79147J75996J54431m8882K70243k44541j67715o9866J46509M47268j09615
$$ 379147 555143 709574 660692 930935 686394 518679 448813 595322 1042590 932975
4809I32975k58469j54505m1390K72076J21640O4307N4685M2614K21159K02694
$$ 932975 674506 520001 478611 750687 872327 936634 991319 1033933 1255092 1457786
4799A457786J17798k39317L70999L20202L93823R24416L89248O81879M84900L30102
$$ 1457786 1575584 1336267 1707266 2027468 2421291 3345707 3734955 4416834 4901734 5231836
4789E231836Q9087q68500o45724q46506n40158k21461l09775K2492m84517k21906
$$ 5231836 5320923 4452423 3806699 2960193 2420035 2198574 1888799 1911291 1426774 1204868
4779A204868k03297k49872K63388O0146K53390q6321m25949p7786j18521P0946
$$ 1204868 1001571 751699 1015087 1075233 1328623 1242302 816353 738567 620046 690992
4769F90992K92307J1524l1286J23864m5462k13119j13719K24862J74418m7302
$$ 690992 983299 994823 963537 1087401 1041939 828820 715101 939963 1114381 1067079
4759A067079J68562l5407J31955j18752M193J81064j51050j8977l59337k35027
$$ 1067079 1235641 1200234 1332189 1213437 1217630 1398694 1247644 1228667 869330 634303
4749F34303K57732j72452K13578N9404k14631J21687l38619K60055R925R3874
$$ 634303 892035 719583 933161 992565 777934 899621 561002 821057 830982 924856
4739I24856O0355j15728K29983n49355j19579j83274M6565O75887R7944R5179
$$ 924856 985211 869483 1099466 550111 430532 247258 293823 969710 1067654 1162833
4729A162833k26089j56927j7481j06471K76185j2291m4676k09338J01522L1951
$$ 1162833 936744 779817 762336 655865 932050 919759 875083 665745 767267 799218
4719G99218J8818m9152k22953L97872K40993j01768m1610j40023o501O6875O9358
$$ 799218 818036 768884 545931 943803 1184796 1083028 1041418 901395 894894 961769 1031127
4708A031127j80725L0322M4804l6086J71027J50564j9824k77926K6156q8166L13537
$$ 1031127 850402 880724 925528 889442 1060469 1211033 1191209 913283 939439 851273 1164810
4697A164810J14138k3618O5102j57054j3878j30621j43401J37824K087K23319
$$ 1164810 1278948 1255330 1320432 1163378 1149500 1018879 875478 1013302 1015389 1238708
4687A238708K54764j97793j28564r5978O6989K7336M36353J15508R277j1101l41480
$$ 1238708 1493472 1295679 1167115 1071137 1138126 1165462 1601815 1717323 1726600 1715499 1374019
4676A374019O6580m29000J43829K12571J69177J24403j24859K79232k76177K18399
$$ 1374019 1440599 1011599 1155428 1367999 1537176 1661579 1536720 1815952 1539775 1758174
4666A758174K20509k96632M17233m56757O2176J74405r7685K17957j37098K96367
$$ 1758174 1978683 1682051 2099284 1642527 1704703 1879108 1781423 1999380 1862282 2158649
4656B158649R7341N2904k8013J95114L45805p060j1374l48184J07230K58424L11384
$$ 2158649 2255990 2308894 2280881 2475995 2821800 2814740 2803366 2455182 2562412 2820836 3132220
4645C132220M13242J60102j22782j13144L58845L06674O26230K00155M0049P52467
$$ 3132220 3545462 3705564 3582782 3469638 3828483 4135157 4761387 4961542 5001591 5754058
4635E754058M21656M70075O35130P40934J242809J852647K639788M216292N734676
$$ 5754058 6175714 6645789 7280919 8021853 9264662 11117309 13757097 17973389 23708065
4626B3708065P391329O137275J344942k299627m238779m610155l899153l243622
$$ 23708065 31099394 37236669 38581611 36281984 32043205 27433050 23533897 20290275
4618B0290275k303843j455653j030505k47993J58247Q68862J186503J773151K614199
$$ 20290275 17986432 16530779 15500274 15252281 15410528 16279390 17465893 19239044 21853243
4609B1853243L112548L891268L681044K891524J824898J492833J898449K896474
$$ 21853243 24965791 28857059 32538103 35429627 37254525 38747358 40645807 43542281
4601D3542281M529696N404740N544089M431837K260581M40902l04547L46066K405277
$$ 43542281 48071977 53476717 59020806 63452643 65713224 66154126 65849579 66195645 68600922
4592F8600922M290349N514665M514011J248852k350755m098566m551387l561912
$$ 68600922 72891271 78405936 82919947 84168799 81818044 77719478 73168091 69606179
4584F9606179j535462m80092L60932q21381l351857m472167n518030n137213l831879
$$ 69606179 68070717 67590625 67951557 67130176 63778319 59306152 53788122 48650909 44819030
4575D4819030k909842k152538k128233k647373k954628l513683l560946l621547
$$ 44819030 41909188 39756650 37628417 34981044 32026416 28512733 24951787 21330240
4567B1330240l106281k524872j742371j232156j412590j115194j144810q07474
$$ 21330240 18223959 15699087 13956716 12724560 11311970 10196776 9051966 8244492
4559H244492r8001m51386m39678l07919o61890r3406j11294j90784j39617m56838
$$ 8244492 8146491 7695105 7255427 6947508 6285618 6192212 6080918 5890134 5750517 5293679
4549E293679j35028k17391j31546j49805k84865k1305P1525j3606o01843m1901
$$ 5293679 5158651 4941260 4809714 4659909 4375044 4353739 4425264 4411658 3809815 3767914
4539C767914j13364J2662L08369j81038k23220k43018L6143k46477j56669j13372
$$ 3767914 3654550 3667212 3975581 3794543 3571323 3328305 3364448 3117971 2961302 2847930
4529B847930j41858J33280l49403m5982j10444M6753L88061j45790j4664j96435
$$ 2847930 2706072 2839352 2489949 2443967 2333523 2380276 2768337 2622547 2607883 2411448
4519B411448j18128k15790m2214J30857k81623j23470m0213L64966l2441k01816
$$ 2411448 2293320 2077530 2035316 2166173 1884550 1761080 1720867 2085833 2053392 1851576
4509A851576j75669P4365L17113K47797j47582m14374k79098r0236K08804J4608
$$ 1851576 1675907 1750272 2067385 2315182 2167600 1753226 1474128 1383892 1592696 1607304
4499A607304j83532j36770j49697L03509K31669l0312k43411q7209L2237K88147
$$ 1607304 1423772 1287002 1137305 1440814 1672483 1642171 1398760 1311551 1343788 1631935
4489A631935j46417p0799k86257j36393L49929N9919L78596l25026m21467J9671
$$ 1631935 1485518 1414719 1128462 992069 1341998 1401917 1780513 1455487 1034020 1053691
4479A053691J0777L77857j19111j839q5593j55342K59631l1678J09988m24449
$$ 1053691 1064468 1442325 1323214 1321375 1235782 1080440 1340071 1308393 1418381 993932
4469I93932j13849L53109j22770N4792k08760j72564L56221K06370J04881k71908
$$ 993932 880083 1233192 1110422 1165214 956454 783890 1140111 1346481 1451362 1179454
4459A179454m82067j30602N06661J76477L083k99576o20766M5496M31535M95815
$$ 1179454 697387 566785 1073446 1249923 1253006 953430 332664 378160 809695 1305510
4449A305510n8148j68636l47504K23475K25368j86924p076n63968J77309l0056
$$ 1305510 1247362 1078726 731222 954697 1180065 993141 986065 422097 599406 569350
4439E69350L16613K03106k24906k70905N3521K90049Q7080M4550o15756J0405
$$ 569350 885963 1089069 864163 593258 646779 936828 1023908 1068458 452702 463107
4429D63107K11770J60508m0225n06491k1714K70173K34636l07372j22385K16283
$$ 463107 674877 835385 795160 288669 266955 537128 771764 464392 342007 558290
4419E58290j8004K33288j23317J13226j01911l16651K5767K06525K65834o5832
$$ 558290 540286 773574 650257 763483 661572 344921 370688 577213 843047 777215
4409G77215k99261j95766J51661J07621J28088l70602J84032R7096j91510N5029
$$ 777215 477954 282188 433849 541470 669558 298956 482988 580084 388574 443603
4399D43603l06086L21307Q7808O0011J87412l60543L01946m30965n034L14118
$$ 443603 137517 458824 546632 606643 794055 433512 735458 304493 299459 613577
4389F13577m7961L08167l08376j1498j70954p7945J87891k38244R8890Q9849j03379
$$ 613577 565616 873783 565407 553909 382955 305010 492901 254657 353547 443396 340017
4378C40017o6524j35752K40157L16244j10270k13962j64939j442L23693j67458
$$ 340017 273493 137741 377898 694142 583872 369910 204971 203529 527222 359764
4368C59764j35859l012K75745Q2233k20610J41009k10051L80700j61665j32878
$$ 359764 223905 220893 496638 578871 358261 499270 289219 669919 508254 375376
4358C75376K49423k58226O980l56514J90493J88202P9510j09823l49396M93536
$$ 375376 624799 366573 373553 17039 207532 395734 475244 365421 16025 509561
4348E09561J1554Q8104p5504k19448L76140j45130l4800j67374j23859J62091
$$ 509561 521115 609219 533715 314267 690407 545277 510477 343103 219244 381335
4338C81335J976J2692R8055j45779J20944R335P5012K17759k25804j36010k82821
$$ 381335 383311 396003 494058 348279 469223 478558 553570 771329 545525 409515 126694
4327A26694M5587K02258O5265j57652o7276K58840l0518O101j0169J68309j25242
$$ 126694 172281 374539 439804 282152 214876 473716 443198 449299 439130 607439 482197
4316D82197P3225J18354L5914L3318k88745J36256k03564n97M22048Q959o9120
$$ 482197 555422 673776 709690 743008 454263 590519 386955 386358 808406 817365 748245
4305G48245j87959k23608Q0283L52970K13758j11821n1126j04853J13806k00735
$$ 748245 560286 336678 416961 769931 983689 871868 820742 715889 829695 628960
4295F28960j83681J33969l3036K92784R9163M2407M9265n0593L17152M60121J43835
$$ 628960 445279 579248 546212 838996 938159 980566 1029831 979238 1296390 1756511 1900346
4284A900346j05036m11543k69703j20182J08693q6165j6852N9284j78938O8493
$$ 1900346 1795310 1383767 1114064 993882 1102575 1016410 999558 1058842 879904 948397
4274I48397M9593q2047L7948p3634j40589K1648k31650j03745K35326J26843r3795
$$ 948397 997990 915943 953891 880257 739668 761316 529666 425921 661247 788090 694295
4263F94295J16268n04913L1072J58012p3862L32849j04081K2392k58385q3909
$$ 694295 810563 305650 336722 494734 420872 753721 649640 672032 413647 329738
4253C29738J02267M1171K79055k36571J21538l81270j01587J58885L044K40065
$$ 329738 432005 473176 752231 515660 637198 255928 154341 313226 316270 556335
4243E56335l63844J66673P4662K32712J14046j38574j92843k19742J65645Q7119
$$ 556335 192491 359164 433826 666538 780584 642010 449167 229425 395070 482189
4233D82189J37703J3663k48756o5643Q9808n2726K5356J0948l7315K65863o2698
$$ 482189 619892 633555 384799 319156 408964 356238 381594 392542 355227 621090 558392
4222E58392j54653j16847j08953M02946K09845k89806k21984K05194J51872J96018
$$ 558392 403739 286892 177939 580885 790730 500924 278940 484134 636006 832024
4212H32024n5663k22433p6737l2069K66400O15534M90883K48072M24066j9753
$$ 832024 776361 553928 477191 445122 711522 1327056 1817939 2066011 2490077 2470324
4202B470324M3302l3930o54939l70303k00476k3465k17599m38387j63068j38004
$$ 2470324 2513626 2479696 1824757 1454454 1253978 1230513 1012914 574527 411459 273455
4192B73455J93433j05329K61566K6970k85680J33959l08762K06801K66444k05514
$$ 273455 466888 361559 623125 650095 364415 498374 189612 396413 662857 457343
4182D57343q0040m3253j8548J42786j31799j86770K34212J51540Q2857l30325
$$ 457343 377303 334050 315502 458288 326489 139719 373931 525471 608328 278003
4172B78003r1131J78480L13730K70262m85468M49390l33073j08287L51414k79982
$$ 278003 186872 365352 679082 949344 463876 913266 580193 471906 823320 543338
4162E43338M40852l06581o6741j75991j76244L38238l04237L19612j12772J15910
$$ 543338 984190 677609 610868 434877 258633 596871 292634 612246 499474 615384
4152F15384j87104k70616K66029k49005K60837l3165k51127K75431K66836N3874
$$ 615384 428280 157664 423693 174688 435525 402360 151233 426664 693500 747374
4142G47374j95762j79454J7148K29168Q0109j07215k96118k76011J86343J14854
$$ 747374 551612 372158 389306 618474 698583 591368 295250 19239 205582 320436
4132C20436J2814J63068n9100k0821n5834J71264M19664l99657j94706j19063
$$ 320436 333250 496318 437218 416397 360563 531827 951491 551834 357128 238065
4122B38065J41829J71411l50945L9232R6362N5647K63003l82933J24208M5863
$$ 238065 379894 551305 200360 239592 335954 391601 654604 271671 395879 441742
4112D41742J74949K70581l26275l6991j60739p7320L06435j64385k5314k84006
$$ 441742 616691 887272 560997 524006 363267 285947 592382 427997 402683 118677
4102A18677J48790K79351L605l9693l80284R6129L82111M70116L3443l40722k29455
$$ 118677 267467 546818 550423 510730 130446 226575 608686 1078802 1112245 771523 542068
4091E42068k1972j45544L22843R2289l14101j07007Q2773K93026R7818j05641
$$ 542068 520096 374552 697395 789684 475583 368576 451349 744375 842193 736552
4081G36552R4853K57341J4280j55074l0514j12878J62457J75048j78427J62182
$$ 736552 831405 1088746 1103026 947952 917438 804560 967017 1142065 963638 1125820
4071A125820j13005l1953N97069K36503L12582J8319l13833J62419K88005L73186
$$ 1125820 1012815 980862 1577931 1814434 2127016 2145335 1831502 1993921 2281926 2655112
4061B655112N06150L90590M20153P16034J324566J890869L435376M522652M590923
$$ 2655112 3161262 3551852 3972005 4688039 6012605 7903474 11338850 15861502 20452425
4052B0452425J982848j410370k559600l228822l005038k381859j619632j464061
$$ 20452425 22435273 21024903 18465303 15236481 12231443 9849584 8229952 6765891
4044F765891j045101o85038o67143J22722m31558j53137j46379p79661L1419k08669
$$ 6765891 5720790 5035752 4368609 4491331 4059773 3906636 3760257 2980596 3012015 2803346
4034B803346j32488L04831j20046j44445J14551m1773j42803r0732n77833j41210
$$ 2803346 2670858 2975689 2855643 2711198 2825749 2783976 2641173 2550441 1972608 1831398
4024A831398n2110K9039j00849k19662j51250k29287L19791k51312J66135j44991
$$ 1831398 1779288 1808327 1707478 1487816 1336566 1107279 1427070 1175758 1341893 1196902
4014A196902n64043M86522k03028R1923J71445l13232L94795j75615l53078Q994
$$ 1196902 632859 1119381 916353 1008276 1179721 866489 1261284 1085669 732591 741585
4004G41585l4881n7622J98676J5057j55291M4404l34242K06929J87576q2453K90599
$$ 741585 706704 649082 847758 862815 707524 751928 417686 624615 812191 729738 1020337
3993A020337k10216p2327N5982n8819o4642J23826j18734l8984J90008l13849
$$ 1020337 810121 737794 793776 734957 670315 794141 675407 636423 826431 512582
3983E12582J34224K14470k83864J36641j24393N075r4588n7072J4540l9988K81754
$$ 512582 646806 861276 577412 714053 589660 594735 500147 443075 457615 417627 699381
3972F99381j3268P3061k07828j00551K80572k91589L77705J29376l82748r2433
$$ 699381 686113 759174 551346 450795 731367 439778 817483 946859 564111 471678
3962D71678o78333M78568J25734j86854L47333j70388K87798k50642k51858J06363
$$ 471678 -206655 271913 397647 210793 558126 387738 675536 424894 173036 279399
3952B79399K69661R9689p6887J75281m45851O0438j09567q8124M60974k24353
$$ 279399 549060 648749 571862 747143 301292 361730 252163 164039 625013 400660
3942D00660j79402k88686K88785K05698M9455J68485l77700L43482j43839o8167
$$ 400660 221258 -67428 221357 427055 476510 644995 267295 610777 466938 398771
3932C98771j0739k91881N12821l0470k75689P3855j49510J12588J58956j30254
$$ 398771 388032 96151 608972 578502 302813 376668 227158 339746 498702 368448
3922C68448L67569J28577n05528J05864k20794J71849J94365n46832J13425j35609
$$ 368448 736017 864594 359066 464930 244136 415985 610350 63518 176943 41334
3912D1334K19356K2041k00360R9917O6705M11121r464j29986j35156k41373O2170
$$ 41334 260690 282731 82371 182288 248993 660114 650650 520664 385508 144135 206305
3901B06305r9342O9145M31481l42083l6565j50658o6086M92833k26181R9686L45
$$ 206305 106963 176108 607589 265506 228941 78283 12197 505030 278849 378535 378880
3890C78880Q3104O7631j82682L8839k47450O0750P4908r765R9358k17053L2762
$$ 378880 461984 529615 346933 385772 138322 199072 273980 264215 363573 146520 179282
3879A79282J02203P9843K02625l19307j53013n3504J72511M10797l4023j32052
$$ 179282 281485 361328 563953 244646 91633 38129 210640 621437 587414 455362
3869D55362l15392j23150r415P0151K68058N4163M1439k67366J60033q6218o2873
$$ 455362 139970 16820 7405 77556 345614 399777 441216 173850 333883 247665 184792
3858A84792k6932j31056L60263k2585p8913m45685o5071L97909Q2283L13463l51435
$$ 184792 157860 26804 387067 364482 285569 -160116 -225187 172722 255005 568468 217033
3847B17033P3194J68615j03633L69050k69127q4017q5594j69693N69002j72479
$$ 217033 290227 458842 355209 724259 455132 371115 285521 115828 684830 512351
3837E12351j04522l1690k07646L65193k9287j05786j52625p9147J36464M1695
$$ 512351 407829 376139 168493 533686 504399 398613 245988 166841 303305 345000
3827C45000m782j33945J46268J92106j97994l4051J80252J2039j1082l0361L677
$$ 345000 340218 206273 352541 544647 346653 312602 492854 504893 493811 463450 467127
3816D67127L7192k80755J30221K23250J52322Q6975k49594k21704q5374J11973
$$ 467127 504319 223564 353785 577035 729357 816332 566738 345034 259660 371633
3806C71633j6632J08062j90814n0969J60240r8213J56343j16971K35114r5803
$$ 371633 355001 463063 272249 221280 381520 283307 439650 322679 557793 461990
3796D61990j09139j89508J09635L4348L3290J30164l05203L05727j4960k8315
$$ 461990 352851 163343 272978 307326 340616 470780 165577 471304 456344 428029
3786D28029P4092j69608K07165j22193K87553M0736l0201o2805j90616J49362
$$ 428029 502121 332513 539678 417485 705038 745774 715573 652768 462152 611514
3776F11514M5001P8378j81883l71551K49654L3372J01986j18678j84978J1653
$$ 611514 656515 734893 553010 181459 431113 464485 566471 447793 262815 274468
3766B74468j91435K19027K72137J76845J47955k90843j21195n7534q1810J64041
$$ 274468 83033 302060 574197 751042 898997 608154 486959 429425 347615 511656
3756E11656j80494K3463j00572K57526j05803K08634l469k81444J76150N2146
$$ 511656 331162 354625 254053 511579 405776 614410 610941 329497 505647 557793
3746E57793O1413j59198m6648m0401m1896M6312k60656L62057j58231J85010p7180
$$ 557793 619206 460008 413360 372959 331063 377375 116719 478776 320545 505555 428375
3735D28375o4064J97078k15923K3600M1009J02618j32337j44859K9899J96748
$$ 428375 364311 561389 345466 369066 410075 512693 380356 235497 265396 462144
3725D62144M12519l36846l68928J0578L4312L73980k44862j95798L01253J63276
$$ 462144 874663 537817 168889 179467 213779 587759 342897 147099 448352 611628
3715F11628j04887j05107k01477L21119j11469j71349J7371r7463K95634l36801
$$ 611628 506741 401634 200157 521276 409807 238458 255829 158366 454000 117199
3705A17199O1691K37919N9054K50319l33331J85409R245J01613k62500j76344
$$ 117199 178890 416809 475863 726182 392851 578260 587505 689118 426618 250274
3695B50274J84859l7493m3345k93446L47772R3809R9785M974l30062K15516j76833
$$ 250274 435133 397640 354295 60849 408621 502430 602215 607189 277127 492643 315810
3684C15810J97119p576k11608K16068n11860J5831m7949J48767L39070k05661
$$ 315810 512929 505353 293745 509813 -2047 13784 -34165 114602 453672 248011
3674B48011J01974J3817j56804L40033k65731L4758J46644k23981l357r6318K64555
$$ 248011 349985 363802 206998 547031 281300 316058 462702 238721 235364 139046 403601
3663D03601k32379J34155k14442K08306M27590k92461J1303l70916K57257K65625
$$ 403601 171222 305377 90935 299241 726831 434370 445673 74757 332014 597639
3653E97639p8804k729k57509J49962l73097J19252J07498q0587K47675n75902
$$ 597639 518835 516106 258597 408559 35462 154714 262212 181625 429300 -146602
3643a46602J92543M8014J95284Q1273j97344J15538j5956j11679j58603J15747
$$ -146602 45941 93955 289239 370512 173168 288706 272750 161071 2468 118215
3633A18215K80667K11661j45662m23653M14881R8389J061N644l38096J66861p5785
$$ 118215 398882 610543 464881 41228 456109 554498 555559 561203 223107 389968 314183
3622C14183m4415j77288J84737J6663o5665K94907j39503K74572m23185l26244
$$ 314183 269768 92480 277217 293880 228215 523122 383619 658191 235006 -91238
3612i1238M69929j87568L27903l91282L210J93113j93402J55212l25883L35908
$$ -91238 378691 191123 519026 127744 130954 324067 130665 285877 -40006 295902
3602B95902J80161q9103J95104m52484K45402p2377k86060N85208l24957m3845
$$ 295902 476063 386960 582064 129580 374982 302605 16545 601753 276796 232951
3592B32951k49877k30956Q15060j32159j28621l27501j68117L96376J81004R0936
$$ 232951 -16926 -247882 567178 435019 306398 -21103 -189220 207156 388160 479096
3582D79096p4517k99180L83960j85001q4519K99605l53459L85861p0228k05009
$$ 479096 404579 105399 489359 304358 219839 519444 165985 551846 481618 276609
3572B76609J14626m12272j24601K15181L17014K60434j97009k83341l5032J93786
$$ 276609 391235 -21037 -145638 69543 386557 646991 449982 166641 131609 325395
3562C25395N2377k07408N3591K9500J33844K85712m17826Q7981k25750j66607
$$ 325395 377772 170364 223955 253455 387299 673011 255185 343166 117416 -49191
3552d9191L54934Q3835O5595j78942l70870K22183L90116N894K3477k95262N5155
$$ -49191 305743 389578 455173 276231 -94639 127544 517660 523554 547031 251769 306924
3541C06924L70900m8653j69057p3880j7534j9823k08j60333M8872P4566m4433
$$ 306924 677824 629171 460114 386234 368700 348877 348669 188336 237208 311774 267341
3530B67341J72994j65431k15312M2220J91211K37569R2805k00490l79594J16828
$$ 267341 440335 274904 59592 101812 293023 530592 623397 422907 43313 160141
3520A60141p1211L04000J11102j65448K24388l5123j93023j24783j82370J99669
$$ 160141 88930 392930 504032 338584 562972 527849 334826 210043 27673 227342
3510B27342L53120k24629J52811l98k15298r7529L0586L13468n0081n66j23274
$$ 227342 580462 355833 508644 508246 292948 195419 226005 539473 489392 488826 365552
3499C65552J93243K01681m04028K240j76439O01893K65259m40289k62573k48475
$$ 365552 558795 760476 356448 358688 182249 784142 1049401 609112 346539 98064
3489I8064M13859P9097k57292j48591R8095K75128r3522p1759K9219M1114O9983
$$ 98064 511923 591020 333728 185137 283232 558360 464838 393079 422298 463412 533395
3478E33395j00839R1837R4150j50948j84762j12118K81951O9217n3592j87425
$$ 533395 432556 524393 618543 467595 282833 170715 452666 521883 468291 280866
3468B80866q4527L90438J37268q8190j7849j31146n5669q0544J2485K76542J01703
$$ 280866 196339 586777 724045 635855 618006 486860 431191 350647 363132 639674 741377
3457G41377r9751k53077J19753l7166J99558K15767j87811L08633k25335j91188
$$ 741377 641626 388549 508302 471136 670694 886461 698650 1007283 781948 590760
3447E90760p9375Q076M96099n1495Q6934l13689J32806j47416j32975K13417J40245
$$ 590760 511385 519461 1015560 964065 1050999 737310 870116 722700 589725 803142 943387
3436I43387K78569l86115j75981l9689L50323n0534n8511K482n8715N09159l44522
$$ 943387 1221956 835841 659860 620171 970494 919960 861449 863931 805216 1314375 969853
3425I69853Q6543M3861j54473L97359n5393L07426o5721k19674j09338m143M88630
$$ 969853 1056396 1100257 945784 1343143 1287750 1595176 1529455 1309781 1200443 1196300 1684930
3414A684930p7780J55771n5247q9511J72146m1409p7308J75200k43320l65437
$$ 1684930 1607150 1762921 1707674 1618163 1790309 1748900 1671592 1846792 1603472 1238035
3404A238035J20641k80578L35885j29976n10750J24124j07007J68375k06000j18603
$$ 1238035 1358676 1078098 1413983 1284007 773257 897381 790374 958749 752749 634146
3394F34146K09975J76081p1493m20156j36231L6991K03961N4695N7308j59997
$$ 634146 844121 1020202 948709 528553 392322 429313 633274 687969 745277 585280
3384E85280M2065k31391N5815L3606j41101M20015k67845P1143J57246l41246
$$ 585280 627345 395954 451769 485375 344274 764289 496444 567587 724833 383587
3374C83587Q6360j05387L33690J05844o0307l33922o1970J34068j49612J28422
$$ 383587 469947 364560 698250 804094 743787 409865 347895 481963 332351 460773
3364D60773o8421L18828K27774k49874K1032M7040J61392n5064N3723k36418K13583
$$ 460773 392352 711180 938954 689080 710112 757152 918544 863480 917203 680785 894368
3353H94368l3752p8624K14563k85079J48744l51286J14098K38134M1097J76392
$$ 894368 860616 781992 996555 711476 860220 508934 623032 861166 902263 1078655
3343A078655o10359K04944k94836J12952J23475o32305N11079k27142L40080Q1684
$$ 1078655 468296 673240 378404 491356 614831 -17474 493605 266463 606543 688227
3333F88227k65442J25206m72548J90790J96781K24512p2150n24428L8163j50587
$$ 688227 422785 547991 75443 266233 463014 687526 615376 90948 129111 -21476
3323b1476L33793J29195Q4692J62692M5118J1689m12291r0278P2203J68179J89523
$$ -21476 312317 441512 526204 688896 734014 745703 333412 243134 315337 483516 673039
3312F73039p1369L6499q7181j15131J97128K36988n3237m3982l46709Q6409R915
$$ 673039 601670 638169 550988 435857 632985 869973 816736 772754 426045 512454 522369
3301E22369p7760j2002M4687J52975j22222J18487k22313J89659r7493j86591
$$ 522369 444609 432607 477294 630269 508047 626534 404221 593880 496387 309796
3291C09796K50115m00273K95861r8449K6546K2982m341K49174k36396l8196l73094
$$ 309796 559911 159638 455499 357050 383596 406578 402237 651411 415015 376819 3725
3280C725M10114K33655J39447N34033j08263J24614l00490j6366J37287j02378
$$ 3725 413839 647494 786941 1320974 1212711 1337325 1036835 1020469 1157756 1055378
3270A055378J77186m16747l36430N7864k07147j64706n7589N9434M06263l8737
$$ 1055378 1232564 815817 479387 537251 330104 165398 107809 167243 573506 534769
3260E34769l9038l64077J00558L0520j6177L84742j10232K60013k55874j37755
$$ 534769 495731 131654 232212 262732 246555 631297 521065 781078 525204 387449
3250C87449K21143k1291J39328l04582J18340K27180J92870O7159l99986j03941
$$ 387449 608592 587301 726629 422047 540387 767567 960437 1027596 627610 523669
3240E23669K5866J35790k74887j42611m522N3907K70042m2037r342m1839k87994
$$ 523669 549535 685325 410438 267827 263305 317212 587254 545217 535875 494036 206042
3229B06042J31853J77960K37578q3229n29654o1506N7456K22483k23289J93758
$$ 206042 337895 515855 753433 670204 140550 79044 136500 358983 135694 329452
3219C29452J92109k98073L53713m51068o4137J43770k31999M56308j55598J24627
$$ 329452 521561 223488 577201 126133 61996 205766 -26233 430075 274477 399104
3209C99104m6239m47928j2986J07875J61396J01309R6574j13184n4644R2109j86583
$$ 399104 352865 -95063 -108049 -174 161222 262531 359105 245921 191277 283386 96803
3198I6803K31635J8667j62511K52589j75721j05974J56385j62344j59214K23792
$$ 96803 328438 347105 184594 437183 261462 155488 311873 149529 -9685 214107
3188B14107L9005Q1696l374n23908L60771K13971j35607L22537n62460l9278J30829
$$ 214107 253112 334808 331434 -192474 168297 382268 246661 569198 6738 -32540 98289
3177I8289o6133K31715N17k40342j57879J51251O6650M19023k91447K3479K39767
$$ 98289 32156 263871 264388 24046 -133833 17418 84068 503091 211644 235123 474890
3166D74890j73469k4395l77137J50321J34125M17611p8566m34365k0979j98149
$$ 474890 301421 277026 -100111 50210 184335 601946 523380 89015 68036 -130113
3156a30113M95006j32333j49511K65973j98653J25763j3261N2448P2717l88987
$$ -130113 364893 232560 83049 349022 150369 276132 262871 315319 388036 -951
3146i51J36491O58231j19959l55175k77861l60145O82019n1363M585R5533k64000
$$ -951 135540 793771 673812 318637 40776 -319369 362650 311287 315872 411405 147405
3135A47405L08504l31660r7105J15503J14707K22310l23798J16310j28297J03760
$$ 147405 455909 124249 27144 142647 257354 479664 155866 272176 143879 247639
3125B47639L11514r5504M61764m00016j59943L306j52575M96326k65927m33431
$$ 247639 559153 463649 925413 525397 365454 368760 216185 712511 446584 13153
3115A3153K16127K81920j5864j2489j27782l2989K12870k80849K58175j71830
$$ 13153 229280 511200 495336 482847 355065 322076 534946 254097 512272 340442
3105C40442q2833M82601j4903q1149j73550k02397l1418L66867J68905l6891o0849
$$ 340442 257609 740210 725307 644158 470608 268211 236793 603660 772565 735674 674825
3094F74825k86751K69077P6132k65988J5512J900K69122J64233k47280k44793
$$ 674825 388074 657151 733283 467295 482807 484707 753829 918062 670782 425989
3084D25989K97866j14473J5335J58898k68150K32378l84046J92730K65067j99677
$$ 425989 723855 609382 624717 783615 515465 747843 363797 556527 821594 621917
3074F21917j49661l00739K15532K57059K49795m89590j99661J44904J04076L78983
$$ 621917 472256 171517 387049 644108 893903 404313 204652 349556 453632 832615
3064H32615k05021P6856n7743j74903j5543j10989R6282k07538k3122M8893p4426
$$ 832615 627594 704450 646707 471804 456261 345272 441554 234016 210894 259787 185361
3053A85361N55403j17315J66032j38794l69789L21799l23656L80924J73270k12901
$$ 185361 740764 623449 789481 650687 280898 602697 279041 659965 833235 620334
3043F20334l34992l14199L18254K99188J61068k48786J70721l8909j26600j29302
$$ 620334 285342 -28857 289397 588585 749653 500867 671588 632679 506079 376777
3033C76777k74616K36258J08809K05521l71226J58895p0511k51224K18916j73406
$$ 376777 102161 338419 447228 652749 281523 440418 369907 118683 337599 164193
3023A64193L84668N5831l22870K24326k51253j22382l3372r2536L08190J11790
$$ 164193 548861 604692 281822 506148 254895 132513 99141 6605 314795 426585
3013D26585K78137r3462n82856J83166n3056Q3973J83658k51716K98239m32153
$$ 426585 704722 611260 28404 211570 158514 242487 426145 174429 472668 40515
3003D0515R5102J45572m5609K62477m33446l9769K5087L79430o8093l25953J2475
$$ 40515 135617 281189 235580 498057 64611 24842 49929 429359 361266 35313 47788
2992D7788j05584K48300l9639K44815j11548k35749q7500p7058K72517k16264
$$ 47788 -57796 190504 150865 395680 284132 48383 -39117 -116175 156342 -59922
2982e9922P1066l43717K34097M66853j73266J47021l13005N3597N8764R1782J24100
$$ -59922 11144 -332573 -98476 368377 195111 342132 29127 82724 141488 233270 357370
2971C57370k35176J49899j44200n1413M7486k22992L66342n1676o0769R1068k94826
$$ 357370 122194 272093 127893 76480 123966 -99026 267316 215640 154871 245939 -48887
2960d8887P2425J19908o6227K78539j95255k88772l4494J26086K53513J38q8553
$$ -48887 23538 143446 77219 355758 160503 -128269 -162763 -36677 216836 216974 128421
2949A28421l70206L04046P7655P1528J43031m68739K41280J67898j01992J82061
$$ 128421 -241785 62261 139916 211444 354475 -114264 127016 294914 192922 374983
2939C74983j70963p7504r0600J60171M8569Q8199j21316l72641L67358j38689
$$ 374983 204020 126516 35916 196087 244656 332855 211539 -161102 206256 67567
2929F7567R8855j30897j56675M07586J535l22953j97159K13859J09070L79639
$$ 67567 166422 35525 -121150 286436 287971 -34982 -232141 -18282 90788 470427
2919D70427l08500l05377K88799l09340M24933L8194k14121J31400k51369J79433
$$ 470427 161927 -143450 145349 -163991 260942 299136 85015 216415 -34954 144479
2909A44479O8476j0616J1697M83K876J05793J90516m09093k80470J44988K27880
$$ 144479 212955 202339 214036 214519 217395 323188 513704 104611 -175859 -30871 197009
2898A97009J33765l09408l92359M04507Q4663p0543J33982l40592J69020J71674
$$ 197009 330774 21366 -370993 33514 118177 47634 181616 -158976 10044 181718
2888A81718K220k9830q0956j88768J38684J21435j26120Q2424j30194J7366K99478
$$ 181718 183938 154108 73152 -115616 23068 144503 18383 100807 -29387 -12021 287457
2877B87457p8908j7666p0898k30300J15479K87099l33172o6554p0178J69164K70289
$$ 287457 208549 190883 119985 -110315 5164 292263 -40909 -107463 -177641 -8477 261812
2866B61812k76331J83896j58201J85695k037J3973J05041k64151J21479n5518
$$ 261812 -14519 169377 11176 196871 194834 208807 313848 49697 171176 115658
2856A15658P1358M8189l77423L23450J38137k44202Q4513j70655M10373j40351
$$ 115658 187016 235205 -142218 181232 319369 75167 159680 -10975 399398 259047
2846B59047j52624L58122l08298J92337l16025o4902M20337l49006L03702k73873
$$ 259047 106423 464545 156247 348584 32559 -32343 387994 38988 342690 68817
2836F8817N878k7468j84083L93713j93399J26230J06338j14298p7977o7568M84251
$$ 68817 74695 47227 -136856 256857 63458 189688 296026 181728 103751 36183 520434
2825E20434l2949m16203j81593p9104L82315J19295n3611j10211J00246j28438
$$ 520434 487485 71282 -110311 -189415 192900 312195 258584 148373 248619 120181
2815A20181M4243J4092q1581K72371k14448j67522K1135m5930J12356j85876O0640
$$ 120181 164424 178516 96935 369306 154858 -12664 8471 -37459 74897 -110979 -50339
2804e0339K44020n6092p824j12685J09006J12656K2262j98199J26999K09969k64078
$$ -50339 193681 137589 129765 17080 126086 238742 261004 62805 189804 399773 135695
2793A35695J4573p6428R0752P0599q6586q2520J06070J66810k11690j29124J61089
$$ 135695 150268 73840 164592 235191 148605 66085 172155 338965 127275 -1849 159240
2782A59240j31637J83104k92518r005K84428j79697K61066k17653r2643K36868
$$ 159240 27603 210707 -81811 -90816 193612 13915 274981 57328 -35315 201553
2772B01553l10023K53450j14680J66427J51995k28198R3771k29031J83521j08989
$$ 201553 -108470 144980 30300 196727 348722 120524 214295 -14736 168785 59796
2762E9796l2265J67936k95478R826K4426J80215L42380L2582L3357j35995l34637
$$ 59796 27531 195467 -100011 -90185 -65759 114456 456836 489418 522775 386780 52143
2751E2143n8211J00565j22872P372M7274J07958q2589P535P4571n403o2407J2655
$$ 52143 -6068 94497 -28375 -21003 26271 134229 51640 59175 133746 128343 65936 78591
2739G8591N9358M9141j47366R929J18826l747q4769m0191J7535J54372j47397
$$ 78591 137949 187090 39724 49653 168479 164732 79963 39772 57307 211679 64282
$$ [...]
##END NTUPLES=NMR SPECTRUM
##END=
