##TITLE=1H_DE-80H_X3
 200.13MHz, d2o
 8 sc
 
 19ns.26.2.2025
##JCAMPDX= 6.0         $$ Bruker NMR JCAMP-DX V2.0
##DATA TYPE= NMR SPECTRUM
##DATA CLASS= NTUPLES
##ORIGIN= UXNMR, Bruker Analytische Messtechnik GmbH
##OWNER= pz
$$ XWIN-NMR		Version 3.5
$$ Mon Dec 22 10:54:39 2025 Russian Standard Time (UT+4h)  Yarkov@DPX200
##.OBSERVE FREQUENCY= 200.1313
##.OBSERVE NUCLEUS= ^1H
##.ACQUISITION MODE= SIMULTANEOUS
##.ACQUISITION SCHEME= undefined
##.AVERAGES= 8
##.DIGITISER RES= 18
##SPECTROMETER/DATA SYSTEM= spect
##.PULSE SEQUENCE= zg30
##.SOLVENT NAME= DMSO
##.SHIFT REFERENCE= (INTERNAL, DMSO, 0, 15.5001)
##AUDIT TRAIL= $$ (NUMBER, WHEN, WHO, WHERE, WHAT)
$$ ##TITLE= Audit trail, XWIN-NMR		Version 3.5
$$ ##JCAMPDX= 5.01
$$ ##ORIGIN= Bruker BioSpin GmbH
$$ ##OWNER= Yarkov
$$ C:/Bruker/XWIN-NMR/data/yarkov2/nmr/H-C/1/pdata/1/auditp.txt
$$ ##AUDIT TRAIL=  $$ (NUMBER, WHEN, WHO, WHERE, WHAT)
(   1,<2025-12-22 10:52:47.14 +0400>,<Yarkov>,<DPX200>,
      <created by zg, POWCHK disabled, PULCHK disabled
       configuration hash MD5:
       00 E9 B6 7A A2 85 ED C7 34 08 36 98 17 FE 4E 26
       data hash MD5: 16K
       2A 64 2A B8 8B 23 F9 15 D9 0E ED 77 EA 97 4D AD>)
(   2,<2025-12-22 10:52:51.68 +0400>,<Yarkov>,<DPX200>,
      <Start of raw data processing
       efp BC_mod = 2 LB = 0.25 FT_mod = 6 PKNL = 1 PHC0 = -5298.355 PHC1 = 10.82193 SI = 16K 
       data hash MD5: 16K
       66 39 81 72 3F 44 4D 93 BD 01 FE C5 08 36 E5 F2>)
(   3,<2025-12-22 10:53:23.00 +0400>,<Yarkov>,<DPX200>,
      <pk PHC0 = -13 PHC1 = 0 
       data hash MD5: 16K
       D0 F5 C5 2D 30 27 CB 23 EC 27 79 53 87 A2 00 B6>)
$$ ##END=
$$ 
$$ hash MD5
$$ 67 ED D8 DF 75 BA 00 8B 14 90 83 28 29 61 5D 87
##$RELAX= 
##$RELAX= 
##$RELAX= 
##$RELAX= 
##$RELAX= 
##$RELAX= 
$$ Bruker specific parameters
$$ --------------------------
##$DU= <C:/Bruker/XWIN-NMR>
##$EXPNO= 1
##$NAME= <H-C>
##$PROCNO= 1
##$TYPE= <nmr>
##$USER= <yarkov2>
##$AMP= (0..31)
100 100 100 100 100 100 100 100 100 100 100 100 100 100 100 100 100 100 
100 100 100 100 100 100 100 100 100 100 100 100 100 100 
##$AQSEQ= 0
##$AQ_mod= 1
##$AUNM= <au_zg>
##$AUTOPOS= <>
##$BF1= 200.13
##$BF2= 200.13
##$BF3= 200.13
##$BF4= 200.13
##$BF5= 200.13
##$BF6= 200.13
##$BF7= 200.13
##$BF8= 200.13
##$BYTORDA= 1
##$CFDGTYP= 0
##$CFRGTYP= 5
##$CHEMSTR= <none>
##$CNST= (0..31)
1 1 145 1 1 1 1 1 1 1 1 1 1 1 1 1 1 1 1 1 1 1 1 1 1 1 1 1 1 1 1 1 
##$CPDPRG= <>
##$CPDPRG1= <>
##$CPDPRG2= <>
##$CPDPRG3= <>
##$CPDPRG4= <mlev>
##$CPDPRG5= <mlev>
##$CPDPRG6= <mlev>
##$CPDPRG7= <mlev>
##$CPDPRG8= <mlev>
##$CPDPRGB= <>
##$CPDPRGT= <>
##$D= (0..31)
0 0.7 0 0 0 0 0 0 0 0 0 0.03 0 0 0 0 0 0 0 0 0 0 0 0 0 0 0 0 0 0 0 0 
##$DATE= 1766386366
##$DBL= (0..7)
120 120 120 120 120 120 120 120 
##$DBP= (0..7)
150 150 150 150 150 150 150 150 
##$DBP07= 0
##$DBPNAM0= <>
##$DBPNAM1= <>
##$DBPNAM2= <>
##$DBPNAM3= <>
##$DBPNAM4= <>
##$DBPNAM5= <>
##$DBPNAM6= <>
##$DBPNAM7= <>
##$DBPOAL= (0..7)
0.5 0.5 0.5 0.5 0.5 0.5 0.5 0.5 
##$DBPOFFS= (0..7)
0 0 0 0 0 0 0 0 
$$ [...]
##$SUBNAM2= <"">
##$SUBNAM3= <"">
##$SUBNAM4= <"">
##$SUBNAM5= <"">
##$SUBNAM6= <"">
##$SUBNAM7= <"">
##$SUBNAM8= <"">
##$SUBNAM9= <"">
##$SW= 18.0517328524113
##$SWIBOX= (0..15)
0 0 2 0 0 0 0 0 0 0 0 0 0 0 0 0 
##$SW_h= 3612.71676300578
##$TD= 16384
##$TD0= 1
##$TE= 0
##$TE2= 300
##$TE3= 300
##$TEG= 300
##$TL= (0..7)
0 120 120 120 120 120 120 120 
##$TP= (0..7)
150 150 150 150 150 150 150 150 
##$TP07= 0
##$TPNAME0= <>
##$TPNAME1= <>
##$TPNAME2= <>
##$TPNAME3= <>
##$TPNAME4= <>
##$TPNAME5= <>
##$TPNAME6= <>
##$TPNAME7= <>
##$TPOAL= (0..7)
0.5 0.5 0.5 0.5 0.5 0.5 0.5 0.5 
##$TPOFFS= (0..7)
0 0 0 0 0 0 0 0 
##$TUNHIN= 0
##$TUNHOUT= 0
##$TUNXOUT= 0
##$USERA1= <user>
##$USERA2= <user>
##$USERA3= <user>
##$USERA4= <user>
##$USERA5= <user>
##$V9= 5
##$VALIST= <valist>
##$VCLIST= <CCCCCCCCCCCCCCC>
##$VD= 0
##$VDLIST= <DDDDDDDDDDDDDDD>
##$VPLIST= <PPPPPPPPPPPPPPP>
##$VTLIST= <TTTTTTTTTTTTTTT>
##$WBST= 1024
##$WBSW= 4
##$XGAIN= (0..3)
0 0 0 0 
##$XL= 0
##$YL= 0
##$YMAX_a= 87590
##$YMIN_a= -91343
##$ZGOPTNS= <>
##$ZL1= 120
##$ZL2= 120
##$ZL3= 120
##$ZL4= 120
##$ABSF1= 0
##$ABSF2= 0
##$ABSG= 0
##$ABSL= 0
##$ALPHA= 0
##$AQORDER= 0
##$ASSFAC= 0
##$ASSFACI= 0
##$ASSFACX= 0
##$ASSWID= 0
##$AUNMP= <proc_1d>
##$AZFE= 0.1
##$AZFW= 0.1
##$BCFW= 0
##$BC_mod= 2
##$BYTORDP= 0
##$COROFFS= 0
##$CY= -3
##$DATMOD= 1
##$DC= 0
##$DFILT= <>
##$DTYPP= 0
##$F1P= 0
##$F2P= 0
##$FCOR= 1
##$FTSIZE= 16384
##$FT_mod= 6
##$GAMMA= 0
##$GB= 0
##$INTBC= 1
##$INTSCL= 3.241238e-09
##$ISEN= 128
##$LB= 0.25
##$LEV0= 0
##$LPBIN= 0
##$MAXI= 10000
##$MC2= 0
##$MEAN= 0
##$ME_mod= 0
##$MI= 1.114404
##$NCOEF= 0
##$NC_proc= -7
##$NLEV= 6
##$NOISF1= 3.799351
##$NOISF2= 2.8
##$NSP= 0
##$NTH_PI= 0
##$NZP= 0
##$OFFSET= 15.50009
##$PC= 1
##$PHC0= -5311.355
##$PHC1= 10.82193
##$PH_mod= 1
##$PKNL= yes
##$PPARMOD= 0
##$PSCAL= 0
##$PSIGN= 0
##$REVERSE= no
##$SF= 200.130004325677
##$SI= 16384
##$SIGF1= 3
##$SIGF2= 2
##$SINO= 0.751879
##$SIOLD= 32768
##$SREGLST= <19F.Aceton>
##$SSB= 0
##$STSI= 16384
##$STSR= 0
##$SW_p= 3612.71676300578
##$SYMM= 0
##$S_DEV= 0
##$TDeff= 16384
##$TDoff= 0
##$TI= <>
##$TILT= no
##$TM1= 0
##$TM2= 0
##$TOPLEV= 0
##$USERP1= <user>
##$USERP2= <user>
##$USERP3= <user>
##$USERP4= <user>
##$USERP5= <user>
##$WDW= 1
##$XDIM= 16384
##$YMAX_p= 393204486
##$YMIN_p= -1695150
$$ End of Bruker specific parameters
$$ ---------------------------------
##NTUPLES= NMR SPECTRUM
##VAR_NAME=  FREQUENCY,     SPECTRUM/REAL,   SPECTRUM/IMAG
##SYMBOL=    X,             R,               I
##VAR_TYPE=  INDEPENDENT,   DEPENDENT,       DEPENDENT
##VAR_FORM=  AFFN,          ASDF,            ASDF
##VAR_DIM=   16384,         16384,           16384
##UNITS=     HZ,            ARBITRARY UNITS, ARBITRARY UNITS
##FACTOR=    0.220516191357247, 1,           1
##FIRST=     3102.03300777943, 0,            0
##LAST=      -510.683755226351, 0,           0
##MIN=       -510.683755226351, -1695150,    0
##MAX=       3102.03300777943, 393204486,    0
$$ Real data points
##PAGE= N=1
##DATA TABLE= (X++(R..R)), XYDATA
$$ [...]
8373B03930K36981M6550j67562R4830m98786j95650k6323M45948q9782k71594
8363b21458M62993m1738J92256P8442p76644k65459N88214L60775o33064n20748
8353g76431O82453K49112r8480j49265j14802M51964r5520j74584j87726L85825
8343A72546r5012k72283l42097N84761L84456m44997k2545K94032J53794p54405
8333c41750J01066K23226l27358k28895O16829N57079n05638k10519L93120J34266
8323D11426n98569j68437o0766O5633K83862j4964M57954K02371j60229k98369
8313A19912N47883k36248m43726l95796P09526K2615m04605j77549K25013J22223
8303H9248j45174p732j08658R446R02170p1023R1812M09125o73125j51699J64655
$$ plain form
8373 203930 440911 487461 319899 414729 -84057 -279707 -306030 139918 50136 -221458
8363 -221458 241535 199797 392053 470495 -306149 -571608 16606 377381 -255683 -776431
8353 -776431 -93978 155134 56654 -92611 -207413 244551 149031 -25553 -213279 172546
8343 172546 77534 -194749 -536846 47915 432371 -12626 -35171 258861 412655 -341750
8333 -341750 -240684 -17458 -344816 -573711 43118 600197 94559 -115960 277160 411426
8323 411426 -187143 -355580 -416346 -350713 -66851 -81815 376139 578510 418281 119912
8313 119912 667795 431547 -12179 -407975 301551 324166 -80439 -257988 -32975 89248
8303 89248 -55926 -63658 -172316 -162870 739300 668277 760089 1169214 496089 344390 509045
8292E09045j34205k60065m42632N99806K773j27753L37740j43060J09932l71997
8282G9584k36674p1053Q6642J63641k20446j91055P69624O1911r44893p540L33280
8271a76979l00842q7840j56147L16331L06905O85731j76354j72936L41277K92978
8261H72124n09418j28053k01973P37018l53277m59803J41375M1170O48618l95940
8251C91841p2306r1779K50405J77286m91174n02387Q51688L01142j015104l90659
8241e91047N10871M00338n42790l04212J88958N08319N46665r11957n9487P86835
8231E32493K84877q93956K1015P1269L39913n73725K63436N07435o86981j29729
8221b63953k0410O29780L6993m48489M9066K72367Q65058r18221M2760j2028J47101
$$ plain form
8292 509045 374840 114775 -327857 271949 274722 146969 484709 341649 451581 79584
8282 79584 -157090 -228143 -141501 22140 -198306 -389361 380263 442174 -502719 -510259 -176979
8271 -176979 -477821 -565661 -721808 -405477 -98572 587159 410805 237869 579146 872124
8261 872124 362706 234653 32680 769698 416421 -43382 97993 139163 787781 391841
8251 391841 319535 227756 478161 655447 164273 -338114 513574 814716 -200388 -591047
8241 -591047 -80176 320162 -222628 -526840 -337882 170437 717102 -194855 -254342 532493
8231 532493 817370 -76586 -55571 15698 355611 -218114 45322 552757 -134224 -263953
8221 -263953 -284363 345417 382410 -66079 -17013 255354 1120412 202191 244951 232923 380024
8210C80024p8902j27178p10107L45544P18665J49664j063940O79810K27779K9297
8200E50656k06691M54683l16308N05044j47518M95478o60132O519067O648429
8191A3842708j2953710k584148J393128k05856p00810N76867K62960q0051m3902
8182d92814J12534K56294r4196J91248k37405N37865k67552j63081j80572O52799
8172C15120j27901r09198j69359R10668J69437p22426J55166P03467L0507o19345
8162b63864m65652N48918J65455k46422k48769M92950j40396p6045J34234K84318
8152A84727P1568r2664l15152L45704M94284o85448m69669N68122m2680p29390
8142f70598j69321Q15632J12881j11106O82633J16499o56481m6648K96082m02723
$$ plain form
8210 380024 301122 173944 -536163 -190619 528046 677710 -386230 293580 521359 550656
8200 550656 343965 798648 482340 987384 839866 1335344 675212 7194279 13842708
8191 13842708 888998 -1695150 -302022 -507878 -1208688 -631821 -368861 -448912 -492814
8182 -492814 -380280 -123986 -218182 -26934 -264339 273526 5974 -157107 -337679 315120
8172 315120 187219 -721979 -891338 19330 188767 -533659 -378493 324974 355481 -263864
8162 -263864 -729516 -180598 -15143 -261565 -510334 -17384 -157780 -233825 -99591 184727
8152 184727 256295 163631 -151521 194183 688467 3019 -466650 101472 58792 -670598
8142 -670598 -839919 -24287 88594 -22512 660121 776620 120139 73491 369573 -33150
8132c3150j47139L4431R1365j80967R36563k9888l79034k86116J0399K51573o87486
8121d19449L9469K1469P84556l41456l82317P59777m6977J8976o38727J35887
8111f8792J02248p93895K82671q5749L91901N20531m12053P3641j77063L27866
8101A61306j83170k92665N16584k35831k04392K12448P38080k12324n13227K65855
8091B52664l93397K51340m09363L8675K59493k1238M02131j53099j11133J01659
8081B17732j00069K71600n49518L78106K01511J18564L46166j05198P2313r1750
8071G59457k73142p08932M73384K45561n34146j41666P88702k17104p92930N0616
8061c50200M65208j27268o91640J2286L39747K78284K10459k69140J54395L81578
$$ plain form
8132 -33150 -180289 -145858 -54493 -235460 701103 671215 292181 6065 16464 268037 -419449
8121 -419449 -379980 -358511 426045 84589 -297728 462049 415072 434048 -204679 -68792
8111 -68792 33456 -760439 -477768 -563517 -171616 348915 -63138 10503 -166560 161306
8101 161306 -21864 -314529 202055 -33776 -238168 -25720 712360 500036 -13191 252664
8091 252664 -140733 110607 -298756 -260081 -588 -21826 380305 227206 116073 217732
8081 217732 117663 389263 -160255 217851 419362 537926 884092 778894 851207 759457
8071 759457 486315 -222617 250767 496328 -37818 -179484 609218 392114 -400816 -350200
8061 -350200 115008 -12260 -703900 -691614 -351867 -73583 136876 -132264 22131 403709
8051D03709L96574l24402k57610K48686J12526l67487r6989K80328m04496k27978
8041b37139Q4954J91598k1104j37814j96749K48067J06614k0133r0863o08712
8031f81281Q45721j37827l3833n1321j98760N33223l54253J43603j34983p9450
8021a49161M51440j84671L63302J74894k33756k08946J74064k71387l26177k64415
8011d74813K84763m52215L40280O61038K94530r79551N60447M43773n62280l65607
8001b49635k59986O02656n59716J13508L9458k5372M14237l98006J89730N8087
7991g5039j77206k20523M10898M57372l56941q3938J29906O4721n33997J49148
7981b35599M70518k90391o70601L0143O94722j51296j09789J82323j56356J27107
$$ plain form
8051 403709 800283 475881 218271 466957 579483 211996 115007 395335 -9161 -237139
8041 -237139 -152185 39413 18309 -119505 -316254 -68187 38427 18294 -72569 -681281
8031 -681281 164440 26613 -7220 -58541 -257301 275922 -78331 65272 -69711 -149161
8021 -149161 302279 117608 480910 655804 422048 213102 387166 115779 -210398 -474813
8011 -474813 -190050 -642265 -301985 359053 653583 -325968 234479 678252 115972 -249635
8001 -249635 -509621 93035 -466681 -353173 -313715 -339087 75150 -322856 -133126 -75039
7991 -75039 -252245 -472768 -61870 395502 38561 -45377 84529 149250 -384747 -235599
7981 -235599 234919 -55472 -726073 -695930 -1208 -152504 -262293 -79970 -236326 -109219
7971a09219j59176J3924J52039k1270K81502k78821J00415K30102j25185m08618
7961c24307J19721N90142n20231p1071L78719M23779j01960M2538k33525l97906
7951i4101l24129K46483j26059K60724j21653L81463J85681M47073Q1822n27754
7941D09550m96999M61315m48517m48076L54630O05883n0684l9998n7979K8096
7931C17221r9715k65928m24873P7608M86687l33635j15858K69028O28678k45036
7921B94177n18931O12532j03718m20824L93496K58816l92496K74528M11264n37173
7911B71671k4042L73558j13058j7876J27665j49282K77428M55805k09800m68374
7901E23695J44348J21256l11757l37242k01827K38940J04806j36320K44328n28373
$$ plain form
7971 -109219 -268395 -254471 -102432 -123702 157800 -121021 -20606 209496 84311 -324307
7961 -324307 -204586 385556 -134675 -205746 172973 596752 494792 537330 303805 -94101
7951 -94101 -418230 -171747 -297806 -37082 -158735 222728 408409 855482 937304 409550
7941 409550 -87449 373866 -74651 -522727 -168097 437786 387102 347104 289125 317221
7931 317221 217506 -48422 -473295 -395687 91000 -242635 -358493 -89465 539213 294177
7921 294177 -224754 387778 284060 -136764 256732 515548 123052 397580 808844 271671
7911 271671 247629 621187 508129 490253 617918 468636 746064 1201869 992069 523695
7901 523695 668043 789299 477542 140300 -61527 177413 282219 145899 390227 -138146
7891a38146L6247M4416k9273o24403J93293K780j26062L23605J50121k10101m61498
7880h39021L67014L89180l46471l73331K22496P30162l71491N7443j240J66490
7870A231N92420m54320n92669p1361M40831n68625l3218J381M42453J60108j5440
7859i7209j30822L95476M17902k50474l22313j10379J19457r9274J1476R64L92691
7848C27495q61625K27704P81247m07023l5145k39263P17023J98980q73062J74327
7838A0658L17109L54857n46616j18159p584o1192n10753q0050K30809K62141l04031
7827d52811o11587Q09388N22253l77827r6017N05818J55523n13375l7052K93512
7817A97825j02171L2123m22383n6921L04990J63430L675J85935L34219J62953
$$ plain form
7891 -138146 -101899 -57483 -86756 -711159 -517866 -515086 -641148 -317543 -167422 -377523 -839021
7880 -839021 -472007 -82827 -429298 -802629 -580133 150029 -221462 -164019 -165259 1231
7870 1231 593651 139331 -453338 -524699 -83868 -652493 -685711 -684330 -241877 -81769 -97209
7859 -97209 -228031 167445 585347 334873 12560 -97819 21638 -77636 -66160 -65196 327495
7848 327495 -534130 -306426 474821 67798 32653 -206610 510413 709393 -163669 10658
7838 10658 327767 682624 136008 17849 10265 -50927 -561680 -641730 -410921 -148780 -452811
7827 -452811 -1064398 -255010 267243 -110584 -206601 299217 454740 -58635 -95687 197825
7817 197825 95654 127777 -294606 -351527 -46537 116893 120568 306503 640722 803675
7807H03675m34122j61522j19921k89734L23651K1925k20332j20087N94716L5233
7797D33482J28058N01j62149r0003L50432j90331j1280P1820J18396p6107J81576
7786G54395j09878q6801j08684Q7977p6829m6046P7166m3448P6992L43903n3936
7775H14811k17071q5857j71908p567R3271J2388k29461l76251L89711k47135N8335
7764C3266j1744k78842K69187q8659L13261n9212L24724J6210L40099l98890m20624
7753C8776K52371J41366l80660k36252J48721L32452K43079n58995l23053Q7998
7743b54197M63254k68292p47235M88677L76255K11211m52027L89429j24668j49023
7733f6616k57202M59072j66941m39458K88764K82573q7232O6206J82934J34263
$$ plain form
7807 803675 369553 208031 88110 -201624 122027 143952 -76380 -196467 398249 433482
7797 433482 561540 562041 399892 309889 660321 469990 458710 530530 648926 572819 754395
7786 754395 644517 557716 449032 537009 460180 414134 491300 447852 524844 868747 814811
7775 814811 597740 511883 339975 332408 425679 438067 208606 -167645 222066 -25069 33266
7764 33266 21522 -257320 11867 -76792 236469 177257 501981 518191 858290 459400 38776
7753 38776 291147 432513 51853 -184399 -35678 296774 539853 -19142 -342195 -254197
7743 -254197 209057 -59235 -806470 -317793 58462 269673 -182354 207075 82407 -66616
7733 -66616 -323818 135254 -31687 -471145 -182381 100192 12960 79166 262100 396363
7723C96363o94121M4595k03358Q5835L24387K4670j25891K41835P2488m29759
7713b62956j76799M08763l03352n3863J32038j77912J45697P67210N59m35043
7703D4342k49099L18524n81055Q3437J03610P06707k59765l2615O63288k64111
7693E33263J0450k52083l92554O5012O4040j59958L67597N4692J29281j77316
7683B42424J07614n66858j41426K20129n94977J79137O00088l39987K13490K86219
7673B05853Q20093o12338l07679J81196j36740l3175p8053j44994N39245j74817
7663B58591Q0977n51029M60725r9525q12088L57415L98602m87748j6790M83608
7653G2738K52092p1176L25086r42375K53204L50782k30702n40301K74585Q56537
$$ plain form
7723 396363 -297758 -253163 -456521 -370686 -46299 -21629 -147520 94315 166803 -262956
7713 -262956 -439755 -30992 -334344 -388207 -256169 -434081 -288384 478826 479385 44342
7703 44342 -204757 113767 -467288 -383851 -280241 426466 166701 134086 797374 533263
7693 533263 543713 291630 -100924 -35912 28128 -131830 235767 290459 419740 242424
7683 242424 350038 -216820 -358246 -138117 -733094 -553957 46131 -293856 -80366 205853
7673 205853 1025946 413608 105929 287125 150385 117210 39157 -105837 433408 258591
7663 258591 339568 -211461 249264 149739 -662349 -304934 93668 -394080 -410870 72738
7653 72738 324830 253654 578740 -363635 -110431 240351 9649 -530652 -256067 600470
7643F00470j75995l62928L05440L11467L10657o46550j23876K30262L40570N1058
7633H40575o66684K99335K95131p32376R0983K87708J01009j27330J14132j16510
7623C85973P4859k1931m07054M0865K54619o1903n32650K10435J42962k16386
7613a30211j08249j67279L44486l60232j47359J20139L82130J83837l7256M75435
7603E55441k3539R1414n67173m12637J33485J4146K38804L17377o74476P28432
7593D01274N45615j78673J51512l65304k55197J58982L2141k14614o13636Q08122
7583D70222l60267L51383j55181o6547J1515K7230j28421K44877m86443N56580
7573D64948O2795k0849j26156J6550Q6309k62552M09252k30473k76884Q0077k54181
$$ plain form
7643 600470 424475 61547 366987 678454 989111 342561 218685 448947 789517 840575
7633 840575 173891 473226 768357 35981 126964 414672 515681 388351 502483 385973
7623 385973 460832 438901 31847 72712 327331 265428 -267222 -56787 86175 -130211
7613 -130211 -238460 -405739 -61253 -421485 -568844 -448705 -66575 117262 80006 555441
7603 555441 531902 623316 56143 -356494 -223009 -208863 29941 347318 -327158 401274
7593 401274 946889 768216 919728 554424 299227 458209 490350 275736 -337900 470222
7583 470222 109955 461338 306157 239610 251125 278355 149934 394811 -91632 464948
7573 464948 527743 506894 380738 397288 483597 221045 630297 399824 122940 203017 -51164
7562e1164M32184l55844o434J49249L17725n12300j57274N02119r8825j75825
7552D3611J8629K17051J39073k12779l41512L64081L60122j94680m00481K47740
7542B40855N9565J28435Q1262k23398j22599k20891M92032J87186q12296J43745
7532d6104K66470J42789J96781J92214k74808K11983K23235P3670k00966k89059
7522D96205J52911M21752l09418j89535L31111J39786m45836K11222K93599n09552
7512E92245p1055J34174k13320j79787j24248O02653n11051M5495j04418M50001
7502F20689n79261l51649Q02247m63817j43191j52839L90686O48107m21400K14805
7492E64377J21455K50022k943l04633L00991l45242j01692N90842m07517P968
$$ plain form
7562 -51164 381020 25176 18742 167991 485716 -26584 -183858 318261 219436 43611
7552 43611 62240 279291 418364 205585 -135927 228154 588276 393596 -6885 240855
7542 240855 300420 428855 510117 286719 164120 -56771 435261 622447 -189849 -46104
7532 -46104 220366 363155 559936 752150 477342 689325 912560 986230 785264 496205
7522 496205 649116 1070868 761450 571915 903026 1042812 596976 808198 1101797 592245
7512 592245 521190 655364 442044 262257 138009 740662 229611 275106 170688 620689
7502 620689 41428 -310221 492026 28209 -114982 -267821 122865 770972 349572 564377
7492 564377 685832 935854 932911 628278 929269 584027 482335 1073177 665660 673628
7482F73628k53358r4789J38783j94994l01898k04106J50887O05679j54267l14153
7472E1412K84050M73985j64980o84962J06622L23014p9757j66114M2624L63284
7462E49178K89051k08213K74022l26759q0576n46938j00877K80957J01449J70346
7452D01640O2009j21992n22816M44081M12501p41592m55966O52946O2959l21073
7442a27303M43173L0055k92454M67236P956k47676k6442N105j44316k36910L39231
7431B17655j15437l14542L05647M79050N08471n94111n33763L44035J78268l39488
7421A35785o96441P8875N31037l25221j82873L56987N4448K01650K38535l27519
7411F5263j3818R4695O7540k45529K34157J08224o12625M20234p0796l77657J87298
$$ plain form
7482 673628 420270 325481 464264 269270 -32628 -236734 -85847 519832 365565 51412
7472 51412 335462 809447 644467 -40495 66127 389141 309384 143270 185894 549178
7462 549178 838229 630016 904038 577279 496703 -50235 -151112 129845 231294 401640
7452 401640 463649 341657 -181159 262922 675423 -66169 -522135 130811 193770 -127303
7442 -127303 315870 345925 53471 520707 528663 280987 254545 259650 115334 -121576 217655
7431 217655 102218 -212324 93323 572373 1080844 486733 -47030 297005 475273 135785
7421 135785 -560656 -481781 49256 -275965 -458838 -101851 -47403 154247 392782 65263
7411 65263 51445 146140 213680 -31849 202308 310532 -302093 118141 47345 -330312 -143014
7400a43014R6406k83862o4592M90563m0654k71059N85521R5597n15856J23328
7390G2378p820J61647k8052l46176L9554L66625K12779p48398L96889O54874j90117
7379E84183n85833o0763j49150J56398J05606k14008m41221P86832J8239l63133
7369a62850J25285J10195j88549J32184j5495m95160N63605L54750l41036j49627
7359f6698M85278k44096o73815O63654O58865j016780l47693R21794k37691m18093
7349b75275M06861K57373n6627K10890r1059o1610P5786N0531k46337J09704r5093
7338B85144l17012J77486N61057m95021J03589K66025m11622M2694L10266k71599
7328B51007j03749Q6405M57406l30465m9941L17730k28527p1243L2975l48191
$$ plain form
7400 -143014 -46608 -330470 -395062 95501 54847 -216212 369309 464906 -50950 72378
7390 72378 64558 226205 198153 -148023 -108469 258156 470935 -277463 119426 774300 584183
7379 584183 -1650 -62413 -211563 -55165 50441 -163567 -604788 182044 200283 -162850
7369 -162850 -37565 72630 -115919 16265 770 -494390 69215 423965 82929 -66698
7359 -66698 418580 174484 -499331 164323 823188 -193592 -541285 380509 142818 -275275
7349 -275275 131586 388959 332332 543222 452163 390553 466339 516870 270533 380237 285144
7338 285144 -31868 145618 706675 211654 315243 581268 169646 212340 522606 251007
7328 251007 147258 233663 691069 360604 310663 628393 399866 328623 361598 13407
7318A3407K17829j18039k68290J2439L32300j71080n42603N10760M00192k84230
7308A02685P499M79261n26343K08299J05313J18943o51117K121K10991m86436
7298d28784j88576O34862R755j76771K25411J749j24155r7037l2638J10895M06273
7287C40984j41218k00840K61497K05920N8969l37677J23321m18932J71703L86565
7277D50292J99892k81787J45614L88354M9051p86388m9679J53394L7379o26530
7267c20408l993L07251M02027j45088J1315K82708J26026j64928K79604o12174
7257A62340j65523K81303k49720k13077K17556l20460N5593K56174N8766q60249
7247g77297j4533R20297M99395n62629R6237M75444K64788l68770p36091l25824
$$ plain form
7318 13407 231236 113197 -155093 -142654 189646 18566 -524037 -13277 386915 102685
7308 102685 110184 589445 63102 271401 376714 495657 -155460 -153339 57652 -428784
7298 -428784 -617360 17502 27257 -149514 75897 77646 -46509 -143546 -176184 -65289 340984
7287 340984 199766 -1074 260423 466343 525312 187635 310956 -107976 63727 450292
7277 450292 650184 368397 514011 902365 951416 165028 115349 268743 306122 -320408
7267 -320408 -324401 -17150 384877 239789 251104 533812 659838 494910 774514 162340
7257 162340 -3183 278120 28400 -184677 32879 -287581 -231988 24186 82952 -777297
7247 -777297 -791830 128467 627862 65233 161470 636914 901702 532932 -203159 -528983
7237e28983O09956k63604q81378M13149R08800m29828o10388J176832Lr32940
7227e38381j64683J93879N95528N0612n16609N50466K71229j92624p03263J28730
7217c25116P56530o21555n57611Q10431K55834M86161q12225N71177M14950k62652
7207G15924o11895o53175N71643L42841r23021O07838M82651l94770k36259K99367
7197B01144N0939p9787n75326L27567j13873L03087n13388j30556L39279j50648
7187c41562m23767N76204k00863N1884K98096L01387J03604n50104J80511P83090
7177G78480l00801j34872o67082O65111N42361o44974p05062K55827K68443j38011
7167h0580l85325L59258R5273L93621N52308m62172l20801N21848k19464K10994
$$ plain form
7237 -528983 80973 -182631 -1064009 -650860 257940 -171888 -782276 394556 394559 -538381
7227 -538381 -703064 -509185 86343 136955 -379654 170812 442041 249417 -453846 -325116
7217 -325116 431414 -190141 -747752 62679 318513 804674 -7551 563626 978576 715924
7207 715924 104029 -549146 22497 365338 -557683 50155 532806 138036 -98223 201144
7197 201144 252083 172296 -403030 -75463 -189336 113751 -399637 -530193 -190914 -341562
7187 -341562 -765329 -189125 -389988 -338104 -40008 261379 364983 -185121 -4610 778480
7177 778480 477679 342807 -324275 340836 883197 238223 -466839 -211012 57431 -80580
7167 -80580 -465905 -106647 -11374 382247 934555 472383 151582 673430 453966 664960
7157F64960k24266q2979M8407j2313P38370l72588J73685O8526l48784k93960
7147C59058K54286j25236m33189J41973O55507o23676l45552Q04466j03659j67609
7137D16369k2180k47175M06032n93741O1781L16837K09740J78392m40553l33272
7127d7770Q13393q71384N2068k66908L25484K45492k37358M9070M50157j13786
7117C98458J94312m66174Q5491K28523m49871l38601O81072k8634L53806o53993
7107D389L82715K18015k90067K54216p9896O5536J12946K92182K90181l82599
7097H67618l43341K87419p88k59217k428k91184L43614K16J35652j40074n01747
7086I5740L25382k2887l26069r5091j70225Q9076J00534j47448j24973j42432
$$ plain form
7157 664960 440694 357715 406122 393809 1132179 759591 933276 1001802 653018 359058
7147 359058 613344 488108 54919 196892 852399 228723 -116829 687637 583978 416369
7137 416369 394189 147014 553046 -40695 21086 337923 547663 726055 285502 -47770
7127 -47770 765623 -105761 -53693 -320601 4883 250375 13017 62087 512244 398458
7117 398458 592770 126596 212087 440610 -9261 -347862 333210 304576 658382 4389
7107 4389 387104 605119 315052 569268 489372 554908 667854 960036 1250217 867618
7097 867618 524277 811696 810908 551691 549263 258079 601693 601909 737561 597487 95740
7086 95740 421122 398235 72166 -22925 -193150 -104074 -3540 -150988 -275961 -418393
7076d18393J91084j3162k22369K43549K07092J71201J43587K8184k79935l87193
7066c36355N91257r239k61181J40516l90791l8586k7385J40609O8837k29033K81866
7055f9485N67626J16507m52329J45961l9781K96296o40655l46781Q0922N3023
7045b88696N56435J85385m38947j76255K55701P33341p53843l70324P96999j05238
7035C94558m70117N39259J14287R8289J7526l07213n03063L75427J74368n80953
7025a47632j3031Q08292j58448n77881R4346J62685j07675j05067J16560j07544
7015c5395j16557P32239l32901j36963N73256k75653l40151M24179l1491m25373
7005C5190p669N50778n48662J48740M59839j58231k30906k25385K87986n4454
$$ plain form
7076 -418393 -227309 -240471 -462840 -219291 -12199 159002 302589 330773 50838 -336355
7066 -336355 254902 245663 -15518 124998 -265793 -304379 -331764 -191155 -122318 -351351 -69485
7055 -69485 498141 614648 162319 308280 268499 564795 -75860 -422641 -341719 -288696
7045 -288696 267739 453124 14177 -162078 93623 826964 73121 -297203 499796 394558
7035 394558 -75559 463700 577987 676276 693802 386589 -116474 258953 433321 -147632
7025 -147632 -160663 647629 489181 -88700 5646 168331 60656 -44411 72149 -35395
7015 -35395 -151952 580287 247386 110423 683679 408026 67875 492054 460563 35190
7005 35190 27521 578299 29637 178377 638216 479985 249079 23694 311680 257226
6995B57226m44622j22081k90561K37337l9466j56709N7242J02468K37418J28324
6985c3424k656n7758Q5559L26986K87823j14589r6468Q9095K2708k14675r2209
6974B00392J48122N53290m24996K26245N90385n29233l8087k66487j86185j39049
6964A34397k08600j2584o12383O72885O76251r18113m56055N13308K07627n0143
6954e3410l68975L02080M02120R25912k80177j197370M54140M91021k18375j106409
6944f49443j20621L34591K92566k28711p2455K44669M76150o2202o67395R9162
6934c53689K12621J1115J03779K22365n22936j71178M33362L30521n17763q4374
6924c36177J53090K05839J82165j97901l6086M21863J78819q3771q42956O1500
$$ plain form
6995 257226 -187396 -309477 -600038 -362701 -402167 -558876 -501634 -399166 -161748 -33424
6985 -33424 -36080 -93838 -8279 318707 606530 491941 395473 484568 507276 292601 200392
6974 200392 348514 901804 476808 703053 1293438 764205 726118 459631 273446 134397
6964 134397 -74203 -86787 -699170 -26285 649966 -268147 -724202 -210894 -3267 -53410
6954 -53410 -422385 -120305 281815 1207727 927550 -269820 184320 675341 456966 -649443
6944 -649443 -770064 -435473 -142907 -371618 -444073 -199404 276746 214544 -452851 -353689
6934 -353689 -141068 -129953 -26174 196191 -326745 -497923 -64561 265960 -251803 -336177
6924 -336177 -183087 22752 204917 7016 -29070 392793 571612 487841 -355115 -293615
6914b93615M54811N5637j53666m18344M82764K55877N8515J30150j28066J74670
6904F18733o6041r9554K11522m35817m92848L73238J44587j78727l55382J62330
6894a17959N62098J00816n08038J26731J52583J52285k9263j69255j36762K64495
6884C97731k48156k86254J39550N9273J78987K89596j68903q7042L96520j12785
6874E58517n95835L60145K82802m95211l21739O74385N41318j68203p44259O10219
6864G02139k1052o26945q9785J48242L37580n36121J04217J30146K75438j1880
6854D11979l02573m1113P1892j05135k1732M25708J23354J276L67902R2717j83412
6843H40863o78318n8100O38237q78905k31838K95735k53847R408M81216K69501
$$ plain form
6914 -293615 161196 216833 63167 -355177 127587 383464 441979 572129 444063 618733
6904 618733 552692 453138 664660 228843 -264005 109233 253820 75093 -280289 -117959
6894 -117959 444139 544955 36917 163648 316231 468516 439253 269998 133236 397731
6884 397731 149575 -136679 2871 62144 241131 530727 361824 274782 671302 558517
6874 558517 -37318 322827 605629 110418 -211321 463064 1004382 836179 91920 702139
6864 702139 681087 54142 -35643 112599 450179 -85942 18275 148421 423859 411979
6854 411979 109406 68293 140185 35050 13318 439026 562380 563656 931558 1024275 840863
6843 840863 162545 104445 742682 -136223 -368061 -72326 -326173 -316765 164451 433952
6833D33952n34748J78398M09481k00493K01042r7582k152k32272o0459L12448
6823D07615N040j79182R9751L89384M9168j12849o84664P79783K44011l52601
6813F45456q1455K61510M77j08820j22026n07294m93636N15894m97544k20966
6803f08404J001908l4825K97539J72645J86949Q2266p94158J20961k93001J92984
6793C24864K24006n06076j01296L83090L72456q04034k93767P22501o7881n60857
6783c06994o2964M95666j21578j22456m76731Q3228L56830k63601k5681J92252
6773b52029o7443J91404j09679L31983L28054q7822j76702O1309L45151l03522
6763B60704k50119K86587q4817j60993l05440K00262j81870L86978j82424m23833
$$ plain form
6833 433952 -100796 77602 487083 286590 487632 390050 387898 155626 95167 407615
6823 407615 412655 233473 333224 722608 771776 658927 -25737 754046 998057 645456
6813 645456 564001 825511 825988 717168 595142 87848 -405788 110106 -387438 -608404
6803 -608404 393504 358679 656218 828863 1015812 1098078 303920 424881 131880 324864
6793 324864 548870 42794 -58502 324588 697044 -106990 -400757 321744 253863 -306994
6783 -306994 -369958 125708 4130 -118326 -595057 -511829 -154999 -418600 -444281 -252029
6773 -252029 -319472 -128068 -237747 94236 422290 334468 157766 219075 564226 260704
6763 260704 10585 297172 212355 51362 -254078 -53816 -235686 151292 -31132 -454965
6753d54965j3207L49799J48677k85473J02080L97442L20029l53469K0121l058
6743B27976p0062r8086K14155l54383K92012J00456N27976l72685J0833K11242
6733F89434o57714J03768l20293K61021L38418l94897k05920M03186N34521m35394
6723C16130n33909K03490R182J66871j88800N9716k41442L38605N23685m52452
6713B01076m5658K40846N60258k88028j38678J62600o7192m02288M2005K47581
6703E12522J89139l79300m30581O68544j0819j74457j89641l72817L53213l42497
6693a76694j62178K57340K34923L9475K49674J82075j02678p33189K40736L65477
6683C94961L0752l07030M6600N38945k9498n19036k7772l8083k83914j04508j81521
$$ plain form
6753 -454965 -468172 -118373 30304 -255169 -153089 244353 564382 210913 231034 227976
6743 227976 157914 59828 273983 -80400 211612 312068 840044 467359 478192 689434
6733 689434 31720 135488 -184805 76216 414634 19737 -186183 217003 751524 316130
6723 316130 -217779 -14289 -5107 161764 -27036 32680 -208762 129843 653528 201076
6713 201076 155418 396264 956522 668494 529816 692416 625224 222936 264941 512522
6703 512522 701661 322361 -108220 560324 549505 375048 185407 -187410 165803 -176694
6693 -176694 -338872 -81532 153391 192866 442540 624615 521937 -211252 29484 394961
6683 394961 425713 118683 165283 704228 674730 155694 127922 89839 -194075 -298583 -480104
6672d80104L92764L57395m71361j26618O91956J53866o24945k60364N31575M10350
6662E74514k85569j62557L5494R1612o584j8706n06809m52422Q17812K56685o75853
6651c32383J22511N31424K81920p09343J25016N20863m12892l4133J17237L14072
6641E24292l0148l20190K42082j51634k71668M8732r0652J25178o6511k73766
6631b64285O23800O9161m14463L07763J9259O4673J23279m9732m31313J31749
6621A79891L46189l19862P9181J10500N6259L03314j18027l40594m01991J16322
6611A1182K71153k32121k84655K24468M84231m36947J2413j07811j47093M86195
6601B81015j83085m90875O90766P54845n41744o88413O43858L13351o70159j67026
$$ plain form
6672 -480104 -87340 270055 -201306 -327924 364032 517898 -107047 -367411 164164 574514
6662 574514 288945 126388 161882 253494 246910 228204 -278605 -731027 86785 343470 -332383
6651 -332383 -209872 321552 603472 -105871 19145 540008 127116 92983 210220 524292
6641 524292 494144 173954 416036 264402 -7266 41466 -49186 75992 9481 -264285
6631 -264285 359515 428676 14213 321976 341235 405908 529187 479455 48142 179891
6621 179891 526080 206218 285399 395899 452158 755472 637445 296851 -105140 11182
6611 11182 282335 50214 -234441 -9973 474258 37311 49724 -58087 -205180 281015
6601 281015 97930 -392945 297821 1052666 510922 -177491 466367 779718 109559 -57467
6591e7467L99146O92649l59625k23543K77960J64970k47030o31158K6952J0444
6581E3298j50568J39639k87308J058350k60284n82904R8290j70607n83549j79942
6571h65585L9495P80634k00938L25452M16466j07858N0838l15138O3945m45182
6561b57871N8538Q3611k3152K62737J90741K52020J81629n41975l26098p8140
6551a97960M015j31237j86244q3761K09477O67096m605o40393K62875M51355l49904
6540G14k91504K79325J22524R6351J77225J94500m0259j60658K51920L3241n74850
6529H8529k44668k21317L02117O24743l60474N16831K15851K11670k82549n91495
6519B59238K26713j38634k45979m72385j90348Q16513m52556m7296K87240L63610
$$ plain form
6591 -57467 341679 1034328 674703 451160 729120 894090 647060 15902 42854 53298
6581 53298 -97270 42369 -244939 813411 553127 -29777 68513 -102094 -685643 -865585
6571 -865585 -826090 -45456 -246394 79058 495524 387666 438504 123366 187311 -257871
6561 -257871 -199333 -115722 -138874 123863 314604 566624 748253 206278 -119820 -197960
6551 -197960 -193945 -325182 -511426 -595187 -385710 281386 276781 -363612 -100737 350618 714
6540 714 -290790 -11465 111059 207410 384635 579135 538876 378218 630138 663379 88529
6529 88529 -156139 -377456 -75339 549404 188930 705761 921612 1133282 850733 259238
6519 259238 485951 347317 101338 -371047 -561395 255118 -197438 -244734 42506 406116
6509D06116M5684o99910K51283M59506m3161M0725N9199J35505M56079l66719
6499G44307n178O2392l66122k85218J70877J77638l24175M70232P9518o5736k30636
6488D27899J60704m08280n0845L5620J07355l16004j95942K59834k44070L06783
6478H3054j69311l5144L17920j74665k24846K17734J6786J96989l06431M94426
6468D16512J39899n78700J09312l26259l6587K38361j73518l032K40875P25921
6458G52784K27660j06182m57771J57926M3225j19482l06540k7433N0858K02674
6448D17719J01397j29129m24538M01774m25822R597L91244L00282m40601L01810
6438E03733R66606J28349j133965j40872M29009m96481n25976J33951O95903m76854
$$ plain form
6509 406116 451800 -248110 3173 462679 419518 460243 519442 654947 1111026 744307
6499 744307 739129 801521 435399 150181 321058 498696 174521 644753 724271 658535 427899
6488 427899 588603 180323 129478 165098 272453 -43551 -239493 20341 -223729 83054
6478 83054 -86257 -121401 196519 21854 -202992 14742 31528 228517 -77914 416512
6468 416512 556411 -22289 87023 -239236 -275823 -37462 -210980 -214012 26863 752784
6458 752784 980444 874262 416491 574417 617642 498160 191620 164187 215045 417719
6448 417719 519116 389987 -34551 367223 -58599 -49002 342242 642524 201923 503733
6438 503733 1470339 1598688 464723 323851 752860 256379 -269597 -135646 560257 83403
6428H3403m09744O25902j57298J45390j77119j47566r673K36042J41422K07369
6418E38128p721L8496j94451j24967n410K4251o94091L72612N07433l75170P5922
6407A55032O39465J76296m16700k23944J56877J54654p38160l00393K33189P47260
6397E83576j28606p5517M71010L87585m04083O779L05736l23666l06912R2532
6387F08434P9015l8573k28862r0483Q0491O2501p56026N55611l8509k65765m34156
6376d66322N46090L86770q88376j2829P35065j7447k50653k51195M96284l53470
6366g6083n6719m29021J28138M87409k69977l28777P48853M39786l63713j10229
6356A69667M79982J06632p21827j61435j45922M63360P5312n38341Q3860Q15540
$$ plain form
6428 83403 -326341 299561 142263 287653 110534 -37032 -46705 189337 330759 538128
6418 538128 530407 568903 374452 249485 244075 268326 -425765 -53153 454280 79110 155032
6407 155032 794497 970793 554093 330149 487026 641680 -96480 -396873 -163684 583576
6397 583576 454970 379453 850463 1238048 833965 840744 1146480 822814 515902 608434
6387 608434 687449 648876 420014 329531 410022 472523 -283503 272108 233599 -32166 -466322
6376 -466322 79768 466538 -421838 -434667 300398 282951 32298 -218897 277387 -76083
6366 -76083 -132802 -561823 -433685 53724 -216253 -545030 203823 643609 279896 169667
6356 169667 649649 756281 34454 -126981 -272903 190457 265769 -272572 -188712 626828
6346F26828J80547n65016q2871k76865L79990m4095m17570l03989L15355N88045
6336D00359o0158m29770K58947k3279j01344L78936j82666l40159K08298L92316
6326E01480l26900n28025N7517q8076M02005j72250l62347O71587N92736m86499
6316B61228l94662K40422K01726k96144j11055k1793P4442O33768j44259k41662
6306B02011O41869m62764j87532j42887R9107Q9990q67796Q46220L06594R8531
6296F23343m44897m5778K80641K49201m15253o64984L38318K87738j57369K87010
6286C37970K90284l85619J50547N23127n71877k47721R9831M1672j08369k34381
6276a04536n5001L10178p1093J82407R3102J20062J37619m10512l36414M56055
$$ plain form
6346 626828 807375 242359 159488 -117377 262613 218518 -199052 -503041 -187686 400359
6336 400359 340201 -89569 169378 146099 44755 423691 241025 -99134 109164 501480
6326 501480 174580 -353445 -295928 -384004 18001 -154249 -516596 154991 747727 261228
6316 261228 -133434 106988 308714 12570 -98485 -120278 -45836 587932 443673 202011
6306 202011 843880 381116 193584 50697 149804 239794 -628002 218218 524812 623343
6296 623343 178446 132668 413309 662510 247257 -417727 -79409 208329 50960 337970
6286 337970 628254 242635 393182 916309 344432 96711 196542 238214 129845 -104536
6276 -104536 -159537 150641 79548 261955 355057 475119 612738 202226 -134188 321867
6266C21867j23966j81381N8474K74677k59546j18047j3618R267j07124l50k52369
6255c92116Q2953P8111J24669J41315J3752r4654j31062K28478J1748m49353j05417
6244d91576L79229n619m60536Q0603N87693K13786m75442L12853k1674M11055
6234E30372j47551n65094J15481M82148K21809l01540J45892L63467O3294k16636
6224F91642K17684o59086r9490J66360K5938l87425p417R00083k16026n61634
6214G0629K23996N34701j42210l66399m5049N20827K71827k24304l5703k32605
6204E75710K61489j24074k18818j84838L82638j57181j07910m0315j2467J45438
6194E19672k39476k18401k82500N530K72609n45822M74416K63941m5251j47451
$$ plain form
6266 321867 197901 16520 74994 349671 90125 -27922 -41540 -32273 -139397 -139747 -392116
6255 -392116 -309163 -231052 -106383 34932 48684 -45970 -177032 51446 63194 -386159 -491576
6244 -491576 -112347 -117966 -578502 -497899 89794 303580 -171862 140991 119317 530372
6234 530372 382821 -182273 -66792 415356 637165 335625 481517 844984 908278 691642
6224 691642 909326 250240 150750 317110 343048 -44377 -51794 848289 632263 70629
6214 70629 294625 829326 687116 320717 275668 796495 1068322 844018 808315 575710
6204 575710 837199 713125 494307 309469 692107 534926 427016 386701 374234 519672
6194 519672 280196 61795 -220705 -215175 57434 -488388 -13972 249969 204718 57267
6184E7267o9680Q06404l47935n8883O41085m24492k94108L77597L6485j62643
6174E61097j69931Q36042o20207j58968O08212l26686k65307m27914M62921j57341
6164C41918k72694Q2301K22281L42574p1742k48700l65056M56586l31165m12270
6154b55967R8509J58569p975L24272J62741P3573o0126J09556M6523m05775j38427
6143A05473l15995M02898k6170J33114k23214J82746M55820o2308k14091j8778
6133D19495j84292Q7818l28300L37902m3287R2149j55092K32097O64403n89877
6123E33016l02094K72217O09845m38532k33859P1072j37982L03626q1946J14390
6113G09753n27964j24243L69198M8881l30714j47961K14413J2153J04279Q9923
$$ plain form
6184 57267 -12413 793991 446056 387173 1028258 603766 309658 687255 723740 561097
6174 561097 391166 1227208 607001 448033 1056245 729559 464252 36338 499259 341918
6164 341918 69224 151525 373806 716380 644638 395938 30882 487468 156303 -255967
6154 -255967 -157458 1111 -6864 317408 480149 553722 493596 603152 649675 243900 105473
6143 105473 -210522 192376 166206 299320 76106 258852 714672 652364 438273 419495
6133 419495 235203 323021 -5279 332623 289336 381485 226393 458490 1122893 533016
6123 533016 230922 503139 1112984 674452 440593 511665 373683 677309 595363 709753
6113 709753 181789 57546 426744 475625 144911 -3050 211363 223516 327795 417718
6103D17718l03676M42109K75880m58255j5923J36835J50452L8589k67917J76629
6093E92441q6691k05078J930L67367m3129m68265L92317k5445o02142P5019J78526
6082A76850M02068p20223M7265M39380M63113o30392n01276N61749P15122j79423
6072G74233j080829L95803Q11265L33618p28376l53642Q8057N02297j65410k14124
6062C62892o5069P68690n0142n56276M74780J9902n43352J09520K82269J59644
6052I62858p74036M66648J24289m2162j77009j9038m29161R7021k00386j09059
6042a00035M03149L64350o70015O1414O12172k20003q38817l99006M03129j52785
6032e36447O244J59885J35345O78743j80974K34248j27935k58947M4688r922K73549
$$ plain form
6103 417718 114042 556151 832031 373776 357853 494688 645140 683729 415812 592441
6093 592441 505750 300672 302602 669969 626840 158575 550892 525447 -76695 -1676 176850
6082 176850 578918 -141305 -94040 345340 808453 178061 -323215 238534 953656 774233
6072 774233 -306596 89207 900472 1234090 505714 152072 240129 742426 577016 362892
6062 362892 297823 1066513 1016371 460095 934875 954777 411425 520945 803214 962858
6052 962858 188822 655470 779759 737597 560588 541550 112389 209410 9024 -100035
6042 -100035 303114 667464 -2551 58863 671035 451032 -387785 -786791 -383662 -536447
6032 -536447 -530203 -370318 -234973 443770 262796 497044 369109 110162 154850 144928 418477
6021D18477l93625M4965J13349M50877K40443n27932L3783K29933k0690n88347
6011A233L29109N55374j48738l53226M89044K47389j138010M35371P7508n86076
6001i1022j09235M36684J12674K8485O3457K27380o92949L94892L28045o86367
5991A2044L40725k76467K40991p493l71303K88395J35721J73465m77101l15037
5981b56060M35703K32139m52205M44406j71014J99755K22857k97403n04279J20489
5971b5612K14548j32987j62019K37660K12215R6983L09540l30356K89459j98465
5961E10966j792M40276m35002Q7247j29485L45769j10294n17046j94754L56036
5951C51921J94591L57989k21866J43104J29503O4401j4047n89216K9614J26891
$$ plain form
6021 418477 24852 69817 183166 634043 874486 346554 380337 610270 589580 1233
6011 1233 330342 885716 736978 383752 872796 1120185 -17825 417546 495054 -91022
6001 -91022 -200257 236427 349101 377586 441043 668423 -24526 370366 698411 12044
5991 12044 352769 76302 317293 309800 -61503 226892 362613 536078 58977 -256060
5981 -256060 179643 411782 -40423 403983 232969 432724 655581 358178 -146101 -25612
5971 -25612 188936 55949 -106070 131590 343805 440788 750328 419972 709431 510966
5961 510966 509174 949450 514448 601695 472210 817979 707685 190639 -4115 351921
5951 351921 546512 904501 682635 825739 955242 1019643 1005596 416380 445994 572885
5941E72885j00451Q7708j99241M30305M94097p40867L06059R676M4689m98007
5931D06853J53326J17492k40539M2093Q48255K5581k50007k67424j94782N82052
5921A222900m71479k87514L24759p540L82760j65458j08266j03922J18332L6125
5911I40697k57887l26790J36157j44103Q01J93336J67725l93971j20678M68546
5901F63833m93106n9432J21428K37938p8415r4046O8300K21570J65701m6663n2931
5890F54177J41882O5027J67642j01111n7217L84595j85656k11991k24312j39637
5880D93399J91428l89102K10450k69828N07930J04807j09762J12864J57923n8314
5870I51795n16844L56700J67392o50228J10620P45932J43563j049243J79843N71061
$$ plain form
5941 572885 472434 560142 360901 791206 1285303 544436 850495 860171 904860 406853
5931 406853 560179 677671 437132 479225 1327480 1353061 1103054 835630 640848 1222900
5921 1222900 751421 463907 788666 781126 1163886 998428 890162 786240 904572 940697
5911 940697 682810 356020 492177 348074 348875 542211 709936 315965 195287 663833
5901 663833 170727 111295 232723 470661 392246 298200 366500 588070 753771 707108 654177
5890 654177 796059 861086 1028728 927617 870400 1254995 1069339 857348 633036 493399
5880 493399 684827 295725 506175 236347 744277 849084 739322 852186 1010109 951795
5870 951795 434951 791651 959043 308815 419435 1165367 1308930 259687 439530 1010591
5860A010591k17440l79091j98081m140M71279q1953l16993L07801K60231j53343
5850F98861k57150k8812m60638j46118N03531J28802J16312m41967L22470M82754
5840I18045K32797j72052n25087J76888N34077p12490m12976L02022O29663p8098
5830H92789q54727O07982L67196k82627n11718R9232N44464p61387j0045P48160
5820H39319l22218n74K41976J2112n13984N4554J23878K27488k45966m8053j57161
5809B11371Q34442k84914j78575J60998L74791l32667j86323K08368L0738m68102
5799C70127K36066L32405n06550j36864O82547j1604j6313K48730k27853l5245
5789I35446N85555o6598k88513k03891M02620L9037n52912m74425K84015L82687
$$ plain form
5860 1010591 793151 414060 215979 211839 683118 601165 284172 591973 852204 698861
5850 698861 441711 412899 -47739 -193857 309674 438476 554788 112821 435291 918045
5840 918045 1150842 978790 453703 630591 1164668 452178 39202 341224 970887 892789
5830 892789 38062 646044 1013240 730613 218895 318127 862591 101204 91159 839319
5820 839319 517101 516527 758503 770615 256631 311185 435063 662551 416585 368532 211371
5809 211371 1045813 760899 582324 743322 1118113 785446 599123 807491 838229 370127
5799 370127 606193 938598 432048 295184 977731 966127 949814 1198544 970691 935446
5789 935446 1521001 1454403 1165890 961999 1364619 1403656 850744 376319 660334 1043021
5779A043021l92150o5088L02520k5185j62823K40500j7652j79087j8682n6119
5769F69255m61322J07262L66211k54571m2838J11974R7125k8776N8226K05216
5759H27762l1918k9554K12065l99223L08714J71388l26086K39473L15753k28852
5749A059522n8416K54818R718k29246M7517J4279j94382j62255N03370J24608
5739A369533k89622J56404j40555K13921m84957J61578J94353J25667q1160m70241
5729G54921M88671R99690n88114k44867P1876j24065j20085k81390P3994M39602
5719A470233o18558N70379l82234L56283j99303m78595M77073M0450j76017p7586
5709I82125R8260R56685l98533q18915P28451q2527l78075k05841j70475L82302
$$ plain form
5779 1043021 650871 585783 888303 863118 700295 940795 923143 744056 725374 669255
5769 669255 207933 315195 681406 426835 383997 495971 593096 564320 622546 827762
5759 827762 795844 766290 978355 579132 887846 1059234 733148 972621 1288374 1059522
5749 1059522 1001106 1255924 1265642 1036396 1083913 1098192 903810 741555 1244925 1369533
5739 1369533 1079911 1236315 1095760 1309681 824724 986302 1180655 1306322 1225162 754921
5729 754921 1243592 2243282 1655168 1410301 1482177 1358112 1238027 956637 1030631 1470233
5719 1470233 851675 1422054 1039820 1396103 1196800 718205 1195278 1235728 1059711 982125
5709 982125 1080385 2037070 1638537 819622 1548073 1465546 1087471 881630 711155 1093457
5699A093457l11349N4479j46216L72479j65163o09390M63252O07039l94068l94046
5689E70474K21667N52725J25135j22839N6548j5042L31198O3972o92407J39308
5679A230739N66135k26407j64608R6267L79125p4194l13800L5513k5851j3347
5669A489572m9471k08710P48108l9296p42232N28634J57319n3296k80814k62444
5659A287370L98591j17498q5043k81825N36779L32553k73083k53004l3471K69556
5649A780925M61923l32536n09529L15863R27704M038q89575K33652J106367j02104
5639B996728j132245n9690J36282j23383n2065m63294J1618j65718M99279k03920
5629A443592L06286p688j7652k32736J29341p2747J96781N423J93605O02856J66930
$$ plain form
5699 1093457 782108 836587 690371 1062850 897687 288297 751549 1358588 964520 570474
5689 570474 792141 1344866 1470001 1347162 1403710 1388668 1719866 1783838 1091431 1230739
5679 1230739 1796874 1570467 1405859 1502126 1881251 1807057 1493257 1528770 1502919 1489572
5669 1489572 1440101 1231391 1979499 1940203 1197971 1726605 1883924 1830628 1549814 1287370
5659 1287370 1685961 1568463 1483420 1201595 1738374 2070927 1797844 1544840 1511369 1780925
5649 1780925 2242848 1910312 1400783 1716646 2644350 2648388 1758813 1992465 3098832 2996728
5639 2996728 1864483 1804793 1941075 1817692 1765627 1302333 1313951 1148233 1647512 1443592
5629 1443592 1749878 1742190 1724538 1491802 1621143 1548396 1745177 1750600 1944205 2547061 2713991
5618B713991n40419L84372L54974q2411n87410n43034M83601P2258k82328j39290
5608A834304N67218N47497l39988l06796O87235M7334l39164M9129p9785P7995
5598B744979j42497n5925J39937j93730N83599l82732r7624k41068n69161M98151
5588B283929K94810m78982L3269M37580P23267k16799l99376N39103k54990K18473
5578C180284K1804j66520O87493k115N9735m9350l24422J76782k72074N90738
5568C902355l86609j82434K32076J52537N2591K1609P252M71653k94266l34931
5558C641833J88264K31093J29566k74846L65243M92225p41189j92300M27664l00762
5548C966791k90167l82336M27206K50879m84050P00647K78464j82019K77426l94465
$$ plain form
5618 2713991 2173572 2557944 2912918 2830507 2243097 1700063 2183664 2255922 1973594 1834304
5608 1834304 2401522 2949019 2609031 2302235 2989470 3036804 2697640 2746769 2666984 2744979
5598 2744979 2602482 2546557 2686494 2492764 3076363 2693631 2596007 2354939 1785778 2283929
5588 2283929 2578739 2099757 2133026 2570606 3293873 3077074 2677698 3216801 2961811 3180284
5578 3180284 3202088 3035568 3723061 3720946 3780681 3731331 3406909 3583691 3311617 3902355
5568 3902355 3515746 3333312 3565388 3717925 3770516 3792125 3799377 4271030 3976764 3641833
5558 3641833 3830097 4061190 4190756 3915910 4281153 4773378 4032189 3839889 4267553 3966791
5548 3966791 3676624 3294288 3721494 3972373 3488323 4188970 4467434 4285415 4562841 4168376
5538D168376L98290q5546J30592J03318l40307L53600Q54285m53654l55518L48862
5528E122298N19543l74568m88854K63634J85826l62555L17495J73112J79145K48639
5518E783715n5729M95401N61423o07339n59797K97720R09398q46350p7523N72430
5508F473349J36849K11225p4513J34639l46124J78636K42834p06730J18616P11980
5498G080761L55758n1756l5959N41048K59188p71982l55055N1599N43363o44578
5488F972387L85444K28742J89028L62240L71758P5957n49706J31680N27256k71144
5478H423642o3970K34739M30200M13551L708M94744J5825K14930M4882R7908K91505
5467A0601664r0893J46033O1010N37122L67684j89692o5810K90447M33029l13122
$$ plain form
5538 4168376 4566666 4481120 4611712 4715030 4374723 4728323 5582608 5128954 4773436 5122298
5528 5122298 5641841 5267273 4778419 5042053 5227879 4865324 5182819 5355931 5535076 5783715
5518 5783715 5727986 6223387 6784810 6177471 5617674 5915394 6824792 5978442 5900919 6473349
5508 6473349 6610198 6821423 6746910 6881549 6535425 6714061 6956895 6250165 6368781 7080761
5498 7080761 7436519 7384763 7348804 7889852 8149040 7377058 7022003 7073602 7616965 6972387
5488 6972387 7357831 7586573 7775601 8137841 8509599 8585556 8035850 8167530 8694786 8423642
5478 8423642 8359672 8594411 9024611 9438162 9441870 9936614 9952439 10167369 10212251 10310159 10601664
5467 10601664 10510771 10656804 10717814 11254936 11622620 11432928 11367118 11657565 12090594 11777472
5457A1777472K76860M21096Q78825J38008K56363K63795M48933O25226Q1653l28466
5447A4839765Q72536N09908J69574P4956M11180L58774L17307K09705L82918K8491
5437A8175114Q00286Q35191j7573N02020O84376O73429L30492Q3818M24712L33870
5427B2825735O33707R3281L72266P91542R26302M65527O45756R26347R62390K75108
5417B8917961R23746J002252P78974P45208M63690J249279J208395R74310O95972
5408C6959787J152439J471762J697338Q61164J196128J994911J069742J486280
5400D7889551J816284J509805J514148K266215K133291J955957K018870K493930
5392F3598051K554071K843775K871572K582638L167955L962678L772310L005389
$$ plain form
5457 11777472 12054332 12475428 13354253 13492261 13748624 14012419 14461352 15086578 15168231 14839765
5447 14839765 15712301 16222209 16391783 16466739 16877919 17236693 17554000 17763705 18146623 18175114
5437 18175114 18975400 19810591 19793018 20295038 20979414 21652843 21983335 22067153 22491865 22825735
5427 22825735 23459442 23552723 23924989 24716531 25642833 26108360 26754116 27680463 28642853 28917961
5417 28917961 29841707 30843959 31622933 32368141 32831831 34081110 35289505 36263815 36959787
5408 36959787 38112226 39583988 41281326 42142490 43338618 45333529 46403271 47889551
5400 47889551 49705835 51215640 52729788 54996003 57129294 59085251 61104121 63598051
5392 63598051 66152122 68995897 71867469 74450107 77618062 81580740 85353050 88358439
5384H8358439L669320M477253L905850M286824N035190N073374N325067N879244
5376A26010561O854640O557138P242357P962085Q075577Q723326R248590R455522
5368A90129796J0596836J1466841J1464590J2185492J2643774J3647281J3097414
5361B75232024J3811221J4271486J3743137J3352665J3221942J2378008J0117547
5354C66128030R516734P956130N975304K538253J090035l12218l065702n689003
5346C84137563p514472q157456r560510j1812753j2698936j3016154j3219598
5339C08157684j3593833j3823697j3528200j3168740j3244802j1855193j2185931
5332B16757288j1484286j0915922j0345128r206591r450824q626243p694876p446140
$$ plain form
5384 88358439 92027759 96505012 100410862 104697686 109732876 114806250 120131317 126010561
5376 126010561 132865201 139422339 146664696 154626781 162702358 171425684 180674274 190129796
5368 190129796 200726632 212193473 223658063 235843555 248487329 262134610 275232024
5361 275232024 289043245 303314731 317057868 330410533 343632475 356010483 366128030
5354 366128030 375644764 383600894 389576198 392114451 393204486 392892268 389826566 384137563
5346 384137563 376623091 368465635 358905125 347092372 334393436 321377282 308157684
5339 308157684 294563851 280740154 267211954 254043214 240798412 228943219 216757288
5332 216757288 205273002 194357080 184011952 174805361 165354537 156728294 149033418 141587278
5324A41587278o659289o614047o300891n619684n324835n442588n034051m728467
5316I5863426l940930m283087l956648l070375l023038l007813l144855k591623
5308F8845057k629635k303987j954288k718102k037861j798723j668150k029693
5300E1704618k206435j490219r96038j971734j787132j886207n98318j037528
5292C9731007j950431j007201o77455j169701q39387o10128r65233p04657o00234
5283C1206580p87042p46786j372520n95083o60828q01537o73423j114382k07897
5274B4247082n73835q74210l81106j28574o24011r59843m39191p3383p03487N44881
5264B0034323q60546n95571N4266l24781p13545o79775J33270m57069o60982M54573
$$ plain form
5324 141587278 134927989 128313942 122013051 116393367 111068532 105625944 100591893 95863426
5316 95863426 91922496 87639409 83682761 80612386 77589348 74581535 71436680 68845057
5308 68845057 66215422 63911435 61957147 59239045 57201184 55402461 53734311 51704618
5300 51704618 49498183 48007964 47011926 45040192 43253060 41366853 40768535 39731007
5292 39731007 37780576 36773375 36095920 34926219 34086832 33476704 32511471 31806814 31206580
5283 31206580 30419538 29672752 28300232 27705149 27044321 26242784 25569361 24454979 24247082
5274 24247082 23673247 22799037 22417931 22289357 21665346 20705503 20266312 20192929 19489442 20034323
5264 20034323 19173777 18578206 18632472 18307691 17594146 16914371 17047641 16590572 15929590 16384163
5254A6384163q74301k58115j58016l38630n26793j89197K804p53303q36403P43842
5244A3196051q5926p95944m89253N69100j05225m36793k61613p5947P1808q9183
5234A1497075o85589j53016j15305m98275n75967j1649k47841k41722q7099L23312
5224I203924K78742o05310j92596M80383r2642l40667n82363J219k6669l20785
5214G803236n85021m04849L44411j58128m39640l77828K18601N39103l32658p14571
5204E892656p3476P83779p9410o09402K08647M4213L55096o35529m2494j75640
5194E668440j52791k81952J19281k28949r1724L10892j88385J78715L73624p80031
5184D927120k60648J02410q2138n24901r7503j09567N84355n9020J12866p9987
$$ plain form
5254 16384163 15509862 15251747 15093731 14755101 14228308 14039111 14041915 13288612 12452209 13196051
5244 13196051 13110125 12314181 11824928 12394028 12288803 11852010 11590397 11514450 11586258 11497075
5234 11497075 10811486 10658470 10543165 10044890 9468923 9457274 9209433 8967711 8880612 9203924
5224 9203924 9482666 8877356 8684760 9165143 9072501 8731834 8149471 8150690 8124021 7803236
5214 7803236 7218215 6813366 7157777 6999649 6560009 6182181 6400782 6939885 6607227 5892656
5204 5892656 5819180 6602959 6523549 5914147 6122794 6167007 6522103 5886574 5844080 5668440
5194 5668440 5515649 5233697 5352978 5124029 5032305 5343197 5154812 5333527 5707151 4927120
5184 4927120 4666472 4768882 4686744 4161843 4064340 3954773 4539128 4480108 4592974 4512987
5174D512987K78683R4740l38406l62434l23805L86658r433o24617o5082J24866
5164C674157K75440m16097Q9292P2825j11699m2244o5040j46723J99207J2938
5154C542056J49514k81135k74983K38766m24914K49367m39186p7529P05460l49836
5144C037580k36224J0664L52227l679j38699l65871l44813P38035J49337m72056
5134B726501k92315Q05884m3597p56358l77673O92591p7137k59353k17829m28
5124B200286L23978K32781o52649m39022N54015J21936n05948j61109K27411M47157
5114B348836P1822j16304l32276L10615L93417p99553l93056K10573L05389k38120
5104A761343j97640N93805N17988l23265n96753L41720L83365j26406p37165J99575
$$ plain form
5174 4512987 4791670 4886410 4548004 4185570 3861765 4248423 4238990 3614373 3549291 3674157
5164 3674157 3949597 3533500 3622792 3695617 3583918 3541674 3476634 3329911 3529118 3542056
5154 3542056 3691570 3410435 3135452 3374218 2949304 3198671 2759485 2681956 3387416 3037580
5144 3037580 2801356 2812020 3164247 3160568 3021869 2655998 2311185 3049220 3198557 2726501
5134 2726501 2434186 3240070 3196473 2440115 2062442 2755033 2677896 2418543 2200714 2200286
5124 2200286 2524264 2757045 2104396 1665374 2219389 2341325 1835377 1674268 1901679 2348836
5114 2348836 2420658 2304354 1972078 2282693 2676110 1876557 1483501 1694074 1999463 1761343
5104 1761343 1563703 2157508 2675496 2352231 1755478 2097198 2480563 2354157 1616992 1816567
5094A816567Q0932J93521K3003m72670m2836L93226N06500o94879n35001N03407
5084A771770R2798j42076K3025k04876j69960Q2686L8162K372n90677R5555M43514
5073A442293J11610m05479O0358O09963j41492M195l81036N59451k91197m27267
5063A141399L2408K04058J30758m24679J46470J72558J41419P9850n58348M99072
5053A564965m18994q5594L5742p5186N7196j12223L39873o6199l11650O6287K32682
5042A226899p9149J12995q9950R7308j02387J52784k0902P0923j32055o053k90621
5031I39792k13042L46562Q2949j54966m17395J79712Q62991m0262n82441J44731
5021A148631M07184j447m42989k56331M39799o155J51237j69392p3496n4565L9430
$$ plain form
5094 1816567 1897499 2091020 2114023 1641353 1598517 1991743 2498243 1803364 1268363 1771770
5084 1771770 1864568 1722492 1745517 1540641 1370681 1453367 1491529 1493901 903224 998779 1442293
5073 1442293 1553903 1148424 1208782 1818745 1677253 1681448 1300412 1859863 1568666 1141399
5063 1141399 1173807 1377865 1508623 1083944 1230414 1402972 1544391 1624241 1065893 1564965
5053 1564965 1145971 1060377 1096119 1020933 1078129 965906 1305779 1239580 927930 994217 1226899
5042 1226899 1147750 1260745 1170795 1268103 1165716 1318500 1297598 1368521 1236466 1230413 939792
5031 939792 726750 1073312 1156261 1001295 583900 763612 1626603 1586341 1003900 1148631
5021 1148631 1555815 1554368 1111379 855048 1294847 1288692 1439929 1270537 1197041 1142476 1181906
5010A181906L619l93411L77203J46934k61142P7609K65795R643j17339j68422
5000A122395k40481m13312L88370K26581l00945M44471K57245J67948l4607Q2261
4990A699926p3586l72957j9716N6680l32035J32998L36144j97499j55971K86625
4980A360609J40862k13650J61240R653k54674r0459L8986J24023j55707l3232
4970A087651P9785K41253m75532k00148M58592P5117P0507K01175J76604j01857
4960A613147L45149m735k97121J0159Q66860j78095p96601L74971N34390j3304
4950B454820K85238M96195P92545K95538J060490N77126j13052o5413J87978m69750
4940E501715n97042L8220p65488o83426N6118Q2334p30558p72269M96280J88792
$$ plain form
5010 1181906 1185525 792114 1169317 1316251 1055109 1132718 1398513 1408156 1290817 1122395
5000 1122395 881914 468602 856972 1083553 782608 1227079 1484324 1652272 1617665 1699926
4990 1699926 1626340 1253383 1233667 1290347 958312 1091310 1427454 1229955 1073984 1360609
4980 1360609 1501471 1287821 1449061 1458714 1204040 1113581 1152567 1276590 1120883 1087651
4970 1087651 1167436 1408689 933157 733009 1191601 1266718 1337225 1538400 1715004 1613147
4960 1613147 1958296 1953561 1656440 1666599 2533459 2355364 1558763 1933734 2468124 2454820
4950 2454820 2740058 3236253 4028798 4324336 5384826 5961952 5848900 5783487 5971465 5501715
4940 5501715 4904673 4942893 4177405 3493979 3550097 3632431 2901873 2129604 2625884 2814676
4930B814676o38147k22278J58340J0046j3284l50103P067n57356M19724L6343
4920A665028n18028J48203n5652N66690m17089N5454N0779m1147K64804p06643
4910A012399l56110J83682l90038N5520j44105L11923K93800L60698K63514J53258
4900A744541l39414J10130J04101o3510l79381j99158N43110J61588n78253L03377
4890A407131K41370j70567m04850K61074r1059l44525N26852N66211m39782m07651
4880A144204K51422J00781m22107l14821J25896q6634k68607K7837K67524j34946
4870F90549M80563k85378J42666q7056j63304J40313n87169L19870J69175k28599
4860E91630O9425m9673J41458r5034l4253L5442m60298K97876M55450l38545n6714
$$ plain form
4930 2814676 2176529 1954251 2112591 2122637 2109353 1759250 1766317 1208961 1628685 1665028
4920 1665028 1147000 1295203 1239551 1806241 1389152 1444606 1495385 1454238 1719042 1012399
4910 1012399 656289 839971 449933 505453 361348 673271 967071 1327769 1591283 1744541
4900 1744541 1405127 1515257 1619358 1555848 1176467 977309 1520419 1682007 1103754 1407131
4890 1407131 1648501 1477934 1073084 1334158 1243099 898574 1425426 1991637 1551855 1144204
4880 1144204 1395626 1496407 1074300 759479 885375 798741 530134 557971 825495 690549
4870 690549 1171112 885734 1028400 941344 778040 918353 331184 651054 820229 591630
4860 591630 661055 611382 752840 657806 623553 658995 198697 496573 952023 613478 556764
4849E56764j54044O35936m68410j77865m37356K04947P1102l4698p1342J06507
4839B31541Q90637q5822l12640M35116L5180k12733n27160K06487J43630m28569
4829C75667K26538K01061J66244r6701j93829N25876r6217l11297M42115j50911
4819A088546j4533J34101K46497L86724m23774k71576O29474K01899n74531k97120
4809A105707P36477M81909m2604k78021O97377Q33207L37687J20616P29909N12705
4799E234969J98627l9677l07865K4707l06368p10632p2166l18307m94030m58676
4789B750582k98976j77317k25397K18694k18273p25188M52251L08456m91002p24393
4779H69437L41583L88260O2874q56606K40844L08643K09814m77933k20757K44685
$$ plain form
4849 556764 402720 1038656 570246 392381 -44975 159972 231074 196376 125034 231541
4839 231541 1122178 1036356 723716 1158832 1194012 981279 454119 660606 804236 375667
4829 375667 602205 803266 969510 872809 678980 1204856 1108639 797342 1239457 1088546
4819 1088546 1074013 1208114 1454611 1841335 1417561 1145985 1775459 1977358 1402827 1105707
4809 1105707 1842184 2324093 2281489 2003468 2700845 3534052 3871739 3992355 4722264 5234969
4799 5234969 5433596 5393919 5086054 5110761 4804393 4093761 4021595 3703288 3209258 2750582
4789 2750582 2451606 2274289 2048892 2267586 2049313 1324125 1776376 2084832 1593830 869437
4779 869437 1211020 1599280 1662154 805548 1046392 1355035 1564849 1086916 866159 1110844
4769A110844j28197J33536j99764j505R3515l27J80346j65862k95097L11093K50340
4758A288922j7714n15446N4496Q13439K27504l67701j10326L98358Q6810l47861
4748A510481k7938J79506K0087k94482Q283j67834o591m93306o1844N643Q3202
4737G55207j24210l96713O06956M08272k67308J94972l04008K53922k26375Q1385
4727I82100J94944q8417l02180R4330K43743K40720o21071K76073Q17890k79575
4717A558557n53630l5148P15047k92233l21641K21240o2371P5404n74054j29671
4707F01500K61397k59584j16303J02640K26280o0761M88935M7986m18072L97471
4697A271489K20396n06811j24332L42935K74376l3011j56625P009P26085j28129
$$ plain form
4769 1110844 982647 1116183 916419 914914 1008429 1008102 1188448 1022586 727489 1038582 1288922
4758 1288922 1271208 755762 810258 1623697 1851201 1483500 1373174 1771532 1858342 1510481
4748 1510481 1482543 1662049 1682136 1387654 1395937 1228103 1221512 728206 666362 672005 755207
4737 755207 630997 234284 841240 1249512 982204 1177176 873168 1127090 900715 982100
4727 982100 1177044 1088627 786447 880777 1124520 1365240 744169 1020242 1838132 1558557
4717 1558557 1004927 969779 1684826 1392593 1070952 1292192 1229821 1305225 731171 601500
4707 601500 862897 603313 487010 589650 815930 755169 1244104 1292090 874018 1271489
4697 1271489 1491885 985074 860742 1203677 1478053 1445042 1288417 1295426 2021511 1893382
4687A893382o4320p3071N50087J46693l18368M9775L74930j73300m95912J98699
4677B088595p2899n93657N8242N50199J06277K6961n36j02030M24962N13888p61498
4666B238504j43267O72788K14136k50076m96913Q36216N16015n62343j33167J77118
4656C069011M85729l66584l794M59941N88774M21706l25897N58964l5829Q4514
4646D936535J4985p87742M14935P24031L95700k01220P09728J095766N43564O4511
4636G910793L24854J089064O94078J42197R72196K427875K088990J967468L237686
4627B0855201L259039J252911J81683J66927p0285p46513j412637p11180n99673
4618B2175473o99544l21060k34052m49366P38440O50473P11953J387795J942489
$$ plain form
4687 1893382 1829062 1755991 2306078 2452771 2134403 2184178 2559108 2385808 1889896 2088595
4677 2088595 2015696 1422039 1480281 2030480 2136757 2163718 2163182 2061152 2486114 3000002 2238504
4666 2238504 2095237 2768025 2982161 2732085 2235172 3071388 3587403 3025060 2891893 3069011
4656 3069011 3554740 3188156 3184362 3644303 4233077 4654783 4328886 4887850 4852021 4936535
4646 4936535 4951520 4163778 4578713 5302744 5698444 5497224 6206952 7302718 7846282 7910793
4636 7910793 8235647 9324711 10018789 10160986 11133182 13561057 15650047 17617515 20855201
4627 20855201 24114240 25367151 25548834 25715761 25645476 24898963 23486326 22775146 22175473
4618 22175473 21475929 21154869 20920817 20471451 21209891 21860364 22572317 23960112 25902601
4609B5902601J963593K318455J545598J567013K269746K438443J895258K826064
4601D2726771L316380K685882K135061J699419J588671J315307J889546K009458
4593E9366495K199566J508659J734184P90990l34226r28912j284449o78969n47455
4584F1825883r25268k137823j681878j510453k583106l470182k882698j905305
4576D4729170k377054k444223k595570k358244k584819k227521l013305k506387
4568B4622047k064611k087216j817130k100286j534350j172618j160738r66767
4560A1718331j557585q95912k85880o81120j072571j21939j37883j45583p67588
4551F052270j52514O2978j32140m00165k50493k22810k17550n15672j71997J68083
$$ plain form
4609 25902601 27866194 30184649 31730247 33297260 35567006 38005449 39900707 42726771
4601 42726771 46043151 48729033 50864094 52563513 54152184 55467491 57357037 59366495
4593 59366495 61566061 63074720 64808904 65599894 65265668 64336756 63052307 62373338 61825883
4584 61825883 60900615 58762792 57080914 55570461 52987355 49517173 46634475 44729170
4576 44729170 42352116 39907893 37312323 34954079 32369260 30141739 27128434 24622047
4568 24622047 22557436 20470220 18653090 16552804 15018454 13845836 12685098 11718331
4560 11718331 10160746 9264834 8978954 8297834 7225263 7103324 6965441 6819858 6052270
4551 6052270 5899756 5962734 5830594 5430429 5179936 4957126 4739576 4223904 4051907 4219990
4541D219990k06091j20500l56301J50684L56851r74398R361K79846l24392m17079
4531B617971J5922K02668l44570k85138k15924R0015j92911r6661l08549N43842
4521B026665K63M80741j36942k54962O32198j20998m19326l07693M54319k32810
4511B121455m97673J26549K3932L71426m0566l12126K14627J57154k10444m99124
4501A455210l67762O11834M2408o22842N0699P23142k37059o42456J2227P0617
4491A096018J74935m33202l65109R02984P94173o65472n60143P25743J86414n41474
4481A314867p61642K00656J46049Q3703m21378K23687P90375n69813k28994K39860
4471A017370j19313l44807j45977M14614k51557j95356N59914K78848m05962O7130
$$ plain form
4541 4219990 4013899 3893399 3537098 3687782 4044633 3070235 3079596 3359442 3035050 2617971
4531 2617971 2633893 2836561 2491991 2206853 1990929 2080944 1888033 1791372 1482823 2026665
4521 2026665 2026928 2507669 2370727 2115765 2747963 2626965 2207639 1899946 2354265 2121455
4511 2121455 1623782 1750331 1774263 2145689 2105123 1792997 2007624 2164778 1954334 1455210
4501 1455210 1087448 1699282 1741690 1118848 1169547 1892689 1655630 1013174 1025401 1096018
4491 1096018 1270953 837751 472642 1375626 2169799 1504327 944184 1669927 1856341 1314867
4481 1314867 553225 753881 899930 983633 562255 785942 1576317 1006504 777510 1017370
4471 1017370 898057 553250 407273 821887 570330 374974 934888 1213736 807774 874904
4461H74904L05315m28193Q5621j01034m27410M02879O94692k71005l34336J80494
4451I81927L76112m70343k85818k32153l22996K0954K54866N06853l52251L29060
4441H06211K81622J3935j16947l86557j25952L15878l28007K3660K20115L02582
4431A006540j53003l22359L27181l27122k34908j54841n04310P35391l00055m64466
4421c91952N38514J48983k70355L325J62563L71155n36973K65737n4253J58368
4411C95112K00049r2892M23111l23045P5106J27776p02493K39252M1711K12812
4401E96499o00222p1947O18659m238k48811l35087P05356K4584n46016m481R7830
4390B32126o1656l19509j7322L17795j9652k55541j3002O95069p17550l58741
$$ plain form
4461 874904 1180219 752026 837647 736613 309203 712082 1406774 1135769 801433 981927
4451 981927 1358039 887696 601878 369725 46729 67683 322549 829402 477151 806211
4441 806211 1087833 1101768 984821 598264 472312 788190 460183 483843 703958 1006540
4431 1006540 853537 531178 858359 531237 296329 141488 -362822 372569 72514 -391952
4421 -391952 146562 295545 25190 28515 191078 562233 25260 290997 236744 395112
4411 395112 595161 502269 925380 602335 677441 805217 102724 341976 383687 596499
4401 596499 -3723 -75670 542989 538751 289940 -45147 660209 684793 138777 134296 232126
4390 232126 170470 -149039 -166361 151434 131782 -123759 -136761 558308 -159242 -517983
4380e17983J20459M96578Q520K6756J67520J41754j28173M98411n04571N9057
4370C68328k08394N60110k29577l65892L59901K68496j33378J75559l59992l5936
4360C99225M3508j81082J12184J70467m8385j31937N8693M6778O741k74104k97062
4349i4974J67313K68910j13030l68425O32433K49435J41028n37788k62276Q12137
4339H94763m91817m25596J82297M75606R1111o40710N77399M45256k59949m5954
4329H02406l89351J28808J56359p03198Q1824k57874J66001J69512l01462P1808
4319g5167j35429K49384L15680k99226k65983M82341L57993L0088m91367N40716
4309G09030M35404k58602j27341j46730M56764M20176n93874j40157q3993L84608
$$ plain form
4380 -517983 -397524 99054 107574 134330 301850 443604 315431 813842 309271 368328
4370 368328 159934 720044 490467 124575 484476 752972 619594 795153 435161 399225
4360 399225 442733 261651 373835 544302 495917 363980 422673 469451 476192 202088 -94974
4349 -94974 72339 341249 228219 -140206 492227 741662 882690 344902 82626 894763
4339 894763 402946 -22650 159647 635253 726364 85654 663053 1108309 848360 802406
4329 802406 413055 541863 698222 -4976 76848 -181026 -15025 154487 -146975 -75167
4319 -75167 -210596 38788 354468 55242 -210741 271600 629593 659681 168314 709030
4309 709030 1144434 885832 758491 611761 1068525 1488701 894827 754670 670677 1055285
4299A055285k74111n21633P8540L75676O467m9874J5782J41064K46135m03755
4289F69576l48476Q2671n513l23227k63909J149235K41816l22222j36138M75529
4279A219342J35344l91667o29547M01876j07172j74640K10546p379L46896k00332
4269H03267l68883j78975l139j48654k39808Q8516L17118j38013J17418K14135
4259D62982n18333N06357l00772j45946j27480L31030M23333n26387L56240J39960
4249F00984j40371j41591m37082K24708j03892K62908k65360k56577N4534P92228
4239E90489j12154p33439L27291L83789j06142l66087L59508J84126K03351K00706
4229I31438q4766j73087L58409J99769m26611m6135j9159l49039k33475L80017
$$ plain form
4299 1055285 781174 259541 338081 713757 720224 670350 686132 827196 1073331 669576
4289 669576 321100 403771 398258 75031 -188878 960357 1202173 879951 743813 1219342
4279 1219342 1354686 963019 333472 735348 628176 453536 664082 656703 1003599 803267
4269 803267 434384 255409 252270 103616 -136192 -47676 269442 131429 248847 462982
4259 462982 -55351 451006 150234 4288 -123192 207838 631171 104784 461024 600984
4249 600984 460613 319022 -118060 106648 2756 265664 304 -256273 -201739 590489
4239 590489 478335 -255104 72187 455976 349834 -16253 343255 527381 730732 931438
4229 931438 846672 673585 1031994 1231763 805152 759017 739858 390819 157344 537361
4219E37361J60487r7207j10977p3002J41499m32257m24695k15403J18587R4040
4209c01567K40360l53259O22924M93498j84883l07458j42533Q4932K41344j79317
4199B14041k91358K52513M94070j11020n81354N33693R0416l57525m71951L4326
4189a94149N29018j04957m93927M81256M2267j4680l12957L18480J29540m25319
4179d5428J18991Q7905L53049m02174k41023Q63392L26499l45055o1193N9405
4169G14368M54650k88302k74628j6429j47652M26785m5724o37330N72555J38553
4159H96846j30214l96218k33704J16731M3784O5782k65721p4551L66422Q3415
4149D72572M2679o27976L20834j83951J32300J0354q9721j70061K76231L50141
$$ plain form
4219 537361 697848 600641 489664 416662 558161 125904 -298791 -514194 -395607 -301567
4209 -301567 -61207 -414466 208458 701956 517073 209615 67082 152014 393358 214041
4199 214041 -77317 175196 669266 558246 -23108 510585 601001 243476 -228475 -194149
4189 -194149 334869 229912 -264015 217241 259508 244828 -68129 250351 379891 -45428
4179 -45428 73563 161468 514517 112343 -128680 734712 1061211 716156 654963 714368
4169 714368 1169018 880716 606088 589659 442007 868792 823068 185738 758293 896846
4159 896846 766632 370414 136710 253441 297225 363007 97286 22735 389157 472572
4149 472572 515251 -112725 208109 24158 156458 166812 77091 -92970 183261 533402
4139E33402N4488l99750O7381J28466M30798n94237k75909Q1696K80945P625m12792
4128i7887m5715P24871J37994j73135n39641O26431L96849m48075r5959K70382
4118G56115l14652J74893J48936m60673J14359J80830Q7292n47251J28885N42928
4108H11662l06250m09318O25563Q43014p61541o64202M74919Q8599j78909p17794
4098a94257L32209R35806j25054n73013L31655O49120r8575q43335J40649N29515
4088A084720r4797m00849L78576M92511k62377l18848L08828o7531J116j73841
4078I47508K04083j42452L84978L8612j07706M00391K03701n17565K84144K24109
4068A919803L02079p66978P38577R53560o22805j58491P93981R86029J67683K30592
$$ plain form
4139 533402 587890 188140 255521 383987 814785 220548 -55361 26335 307280 314905 -97887
4128 -97887 -143602 581269 719263 546128 6487 632918 1029767 581692 485733 756115
4118 756115 441463 616356 765292 304619 418978 599808 687100 139849 268734 811662
4108 811662 505412 96094 721657 1564671 803130 138928 613847 702446 523537 -194257
4098 -194257 137952 1073758 948704 375691 707346 1356466 1257891 414556 555205 1084720
4088 1084720 989923 589074 967650 1460161 1197784 878936 1187764 1120233 1121349 947508
4078 947508 1151591 1009139 1394117 1432729 1325023 1725414 1929115 1411550 1695694 1919803
4068 1919803 2221882 1454904 2193481 3147041 2524236 2365745 3159726 4145755 4313438 4544030
4058D544030J367294N07960J068443M95958R74875N73375L46725O8093K64244
4049A0210997l01007l53649p20206l90028l97788r56324m66064l42275q38302
4040E445354o75301L4947m17024m11431r7741j7356j1120p65059j00141K95392
4030C280520l68886o99676l5260N62210o3672n62835R5185L77667l95066n66892
4020A623295N6900L74697n38275k55336m3959M15851j3430m91723K14030o4204
4010A277846j42068j62786p0984N395k93102K08450K69154m46906p0288M18839
4000I93550j62729k32267j15923J22726O7659j05267L06606J22604j01739K77890
3990A173110K37606m80388j31152N48191k0777m29617J7113L92557l95863n22817
$$ plain form
4058 4544030 5911324 6419284 7487727 7983685 8958560 9531935 9878660 9946753 10210997
4049 10210997 9909990 9556341 8836135 8446107 8048319 7091995 6625931 6283656 5445354
4040 5445354 4770053 4805000 4387976 3976545 3878804 3861448 3850328 3085269 2985128 3280520
4030 3280520 2911634 2211958 2176698 2738908 2675236 2112401 2207586 2585253 2190187 1623295
4020 1623295 1680195 2054892 1516617 1261281 1217322 1633173 1619743 1128020 1342050 1277846
4010 1277846 1135778 972992 902008 907403 614301 822751 1091905 644999 574711 993550
4000 993550 830821 598554 482631 605357 673016 567749 874355 996959 895220 1173110
3990 1173110 1410716 930328 799176 1347367 1326590 896973 914086 1306643 910780 387963
3980C87963j50363M27933k61190o93383L17149J144287n69232j26973J27855L64091
3970I68137o58977m25767R7307J90675k76620K23620J55422J20173O4633M60102
3960I18705l92193m35705j45918O45179k49201m56901J85239L24531K15524P534
3950F16794m42252O091J96979K18339l93425m80225J31155N86207k12469l8391
3940A88803k03090L79882j8723k2467K2486n7194m75323J00016N77177q6989k60945
3929A43633L09849N82104j49381j68830O1225K66333l43671l30575m1405j24158
3919B05124k50385j15085J19840l7850L025K15505j18267L4600r1795J44452K07894
3908C17058R9331J4845K86983O1560j42193l50537K23960j51523l90347J47226
$$ plain form
3980 387963 237600 665533 404343 -289040 28109 1172396 603164 476191 604046 968137
3970 968137 309160 -116607 -19300 171375 -105245 118375 273797 393970 458603 918705
3960 918705 526512 90807 -55111 590068 340867 -116034 69205 393736 609260 616794
3950 616794 174542 180633 377612 595951 202526 -277699 -146544 439663 227194 188803
3940 188803 -14287 365595 346872 324405 346891 289697 -185626 -85610 491567 404578 143633
3929 143633 453482 1035586 886205 717375 778600 1044933 701262 370687 329282 205124
3919 205124 -45261 -160346 -40506 -78356 -75331 140174 21907 56507 -35288 109164 317058
3908 317058 416389 431234 718217 779777 637584 287047 511007 359484 -30863 116363
3898A16363K38900K08212m265o897J06211m66202R6361J38930k69524k46297k0834
3887a09042j38784K22800O32459m0132m06372N17089M89076n01606q40465M77852
3877C02875K05804p4893n07154Q25332o4146J27275m09480k9921k68956j31728
3867b4992j21847J09868n9706L80199K88592j6402L9886J53312p24710J8917r9489
3856e6372k26465l10651J38244K86847q7245J29377L41247k84009J21051L1440
3846H3464l05534j56618N52379p4998l21629K57863Q34173m05287p83184N70303
3836B50932O01668k96780j070917N99421M87972K82141l70954m39847M09541L83531
3826H36708n05408j05066l43209K24770r5755N4217K28098k83178L02843J33379
$$ plain form
3898 116363 355263 563475 559210 552313 658524 192322 288683 427613 158089 -88208 -109042
3887 -109042 -247826 -25026 607433 567301 160929 678018 1167094 665488 -174977 302875
3877 302875 508679 433786 -73368 751964 687818 815093 405613 375692 106736 -24992
3867 -24992 -146839 -36971 -96677 283522 572114 555712 595598 748910 24200 43117 -56372
3856 -56372 -282837 -593488 -455244 -168397 -255642 -126265 214982 -69027 52024 83464
3846 83464 -222070 -378688 173691 98693 -222936 34927 869100 463813 -319371 250932
3836 250932 852600 555820 -515097 84324 572296 854437 483483 43636 453177 836708
3826 836708 331300 226234 -116975 107795 12040 66257 294355 11177 314020 447399
3816D47399J46460O3521q98166K32946L93543K09356o28707l2428J52486n7928
3806B8482j89858M70275l76469j59444K22545j65500l1711K33754k6200K94816
3796C00690o6824K12624j15171j92916Q7562l94774M1205K39424k12448k6969
3786a27597K76423M83768j6556k87437K2593N1971k45692M20693l98471J11286
3776B90981J20275J54269M58337j35045k19193N9851K09542j01857l31599m3874
3766D61687K42450j79517J30171r5318k69839M1637L94132n62093m51082J75703
3756a12069L53531m25883l70907Q43517K76724j68013q0938n9409J02233j19025
3746B39761N5643j07825J37489J49669m1461m43977L06676R1404k14408n8052
$$ plain form
3816 447399 593859 657380 -240786 -7840 385703 595059 -33648 -66076 86410 28482
3806 28482 -161376 308899 -67570 -227014 -4469 -169969 -201680 32074 5874 300690
3796 300690 233866 446490 331319 138403 225965 -168809 -127604 111820 -100628 -127597
3786 -127597 148826 632594 616038 328601 351194 403165 157473 578166 179695 290981
3776 290981 411256 565525 1023862 888817 669624 729475 939017 837160 505561 461687
3766 461687 704137 524620 654791 559473 289634 331271 725403 163310 -287772 -112069
3756 -112069 241462 -184421 -555328 288189 564913 396900 315962 256553 358786 239761
3746 239761 295404 187579 325068 474737 433276 -10701 295975 387379 172971 114919
3736A14919j23488o47765K05056O23716k0420n38280J99730M20670j0847l51722
3726a28431O0946J34028L84463L8090l64311K90351J85917j18139j34089K7881
3716C76706l35973j27604L96508K72376j78646J72438j63312M06536m25452P0524
3706D64101l52681k30475M89264k56585l61333L96324L99456j24049k85082J30551
3696B69491Q9960R2534l70365O3649j21729M13507l83361M86967J02659l25938
3686C17374M7674j03238j67436l92840j01495K90191L88985n626L4333M30240
3676G38162R7248j49337n94335K36383J38475l66479K37597J38635O313K67223
3666G49885N19405k33900j99601j34386J38918p74548O06510l38878l13909M14310
$$ plain form
3736 114919 -8569 -656334 -451278 172438 152018 -386262 -186532 234138 223291 -128431
3726 -128431 -67485 66543 451006 489096 124785 415136 601053 482914 348825 376706
3716 376706 40733 -86871 309637 582013 403367 575805 412493 819029 393577 464101
3706 464101 111420 -119055 370209 113624 -247709 148615 548071 424022 138940 269491
3696 269491 359451 451985 81620 145269 23540 437047 53686 540653 643312 317374
3686 317374 365048 261810 94374 -298466 -399961 -109770 279215 273589 307922 738162
3676 738162 835410 686073 91738 328121 466596 100117 337714 476349 482662 749885
3666 749885 1269290 1035390 835789 701403 840321 65773 672283 333405 19496 433806
3656D33806L65042n63032j63011J67544j4464k91352r656r6401l48709M92609
3646b7624P05573l87338J81587M132L31047q38596R2351N9678q0986K12146J45953
3635C97923K0349N25743r0225l18652r7218n3536o8620m79126l3418J75076R51
3624b0753M28476p94951J18696K48339k81645l0977m42251N11684L81771l88647
3614b70258M60014N08855j35058o89173J75440K60282n66986l84577M59967M72695
3604B91201l54292K49478K06700M4437o10305J01566M19237n09564n55958O97749
3594a9751K84141K25266n11011K66270N86496l71736m08722J02916L87486J13361
3584F54716o34727J83830K28216K37566k49878o85124L95391L59504p09298j71452
$$ plain form
3656 433806 798848 235816 72805 240349 225885 -65467 -75123 -171524 -520233 -27624
3646 -27624 677949 290611 472198 476330 807377 -31219 61132 120810 39824 251970 397923
3635 397923 418272 944015 853790 535138 437920 384384 315764 -163362 -196780 -21704 -20753
3624 -20753 407723 -387228 -268532 -20193 -301838 -332815 -775066 -263382 118389 -270258
3614 -270258 189756 698611 563553 -125620 49820 310102 -256884 -641461 -181494 291201
3604 291201 -63091 186387 393087 437524 -172781 -71215 348022 -161542 -717500 -19751
3594 -19751 264390 489656 -21355 244915 831411 459675 50953 153869 541355 654716
3584 654716 19989 203819 432035 669601 419723 -265401 129990 489494 -219804 -391256
3574c91256k1588L37570j8821j82886r9411K76562N6184L2307R3083L13434l13459
3563H1719L84262m16890J45929J14689k02136o7811j38757J48001j02571J93103
3553A39538k9025O19113K5572o74771j59633M77257p9415n29895M76251R3425
3543C58417K02579l54527L48663M00667n51907k53330j63031J9947L1054j4417
3533B4115J07361j75129M93420l29230j07362N6005j49282L41515N1975J6785
3523C30173L21766O1152O083o1074K19812k21592p52565K51773K06682L3635m73019
3512g7174l525L48854k73663N9949j19264o2030K2236L54212K58717m19179L42785
3501D31918O5059K1702j2384j82687l1894N2016j48670K71050l76423J44119j23458
$$ plain form
3574 -391256 -412844 -75274 -94095 -276981 -376392 -99830 -43646 -11339 81744 395178 81719
3563 81719 465981 49091 195020 309709 107573 39762 -98995 49006 -53565 139538
3553 139538 110513 729626 755198 80427 -79206 398051 318636 -211259 264992 358417
3543 358417 560996 206469 555132 955799 403892 150562 -12469 7478 38532 24115
3533 24115 131476 -43653 449767 120537 13175 69180 -80102 261413 313388 330173
3523 330173 651939 713091 719174 658100 877912 656320 -96245 155528 362210 395845 -77174
3512 -77174 -80699 268155 -5508 54441 -64823 -126853 -104617 249595 508312 89133 431918
3501 431918 496977 518679 506295 323608 291714 343730 195060 466110 89687 233806 110348
3490A10348L64378m1964l27047k43683J73679Q2041j74558k40970N26154K14838
3480D43216k9186k70584K27589L09267J85724l17626j19632J10036J11927k96214
3470C54517j92172J00124J57364P2727k5631L6775J39578m48655P13160l45099
3460E62688n90719L1232J10261L17164L6860Q4771o8447R6456M12602o1311l38541
3449E93016m18976K9575Q56685p13128k01281M23859O88323j49542o33208J88184
3439F63507N62063m17836l61900K18701J224Q6095M2378j59647n9141K13864N6589
3428H45897j84135j16280L635P3941k58980j26609K49541L53732k68200M19614
3418I92156j79305J25142j58540k04049J93476n9186k71272l41070K49913J86912
$$ plain form
3490 110348 474726 432762 105715 -137968 35711 117752 -56806 -297776 228378 443216
3480 443216 414030 143446 371035 680302 866026 548400 428768 538804 650731 354517
3470 354517 162345 262469 419833 492560 466929 503704 643282 194627 907787 562688
3460 562688 -28031 3201 113462 430626 467486 552257 483810 580266 992868 931557 593016
3449 593016 174040 203615 1060300 347172 145891 569750 1258073 1108531 475323 663507
3439 663507 1225570 807734 445834 664535 665759 751854 794232 634585 575444 789308 845897
3428 845897 661762 545482 549117 623058 364078 237469 487010 840742 572542 992156
3418 992156 812851 937993 779453 575404 768880 709694 438422 97352 347265 534177
3408E34177o4145k1228l58297R2615K28906J30877o65110J1929R61279L5161o31663
3397B54501n55004P11420M61616p86767j16481j6964L00406M20307k17345j12407
3387C43282M29728M63648l33538n30964K33333k16974M2513k2056l32651M23213
3377D99534k43700J17093J00539l53078O6961m0748m4204P1047K32445Q0017K88739
3366G74645j66780J91239j61679O537p0171o0488J2219p56826N36348L66614k78746
3355C92912J8930P2704N51298l7097l81998m49695J76406M10587k91573n00181
3345c7707m62036R93970P16116j112669j85780M98444P47219k27371q85254J08300
3335A53232N62088K56377j042139k9789N99429m43473j79955M14652j85364j82269
$$ plain form
3408 534177 470032 448804 90507 183122 412028 542905 -122205 -110276 851003 886164 254501
3397 254501 -300503 410917 872533 85766 -30715 -47679 252727 673034 455689 343282
3387 343282 773010 1236658 903120 372156 605489 388515 431028 408972 76321 499534
3377 499534 255834 372927 473466 120388 187349 146601 102397 173444 405889 485906 774645
3366 774645 607865 799104 637425 643962 573791 513303 525522 -231304 305044 671658 392912
3355 392912 411842 484546 1035844 998747 616749 167054 343460 754047 462474 -37707
3345 -37707 -499743 494227 1210343 97674 -88106 410338 1157557 930186 44932 153232
3335 153232 715320 971697 -70442 -100231 499198 55725 -124230 290422 105058 -77211
3325g7211k24377O24325M911p9992J82818M1687l86171M84179j94264k30506J85602
3314C31001Q381p34956J58629M90250m36138m86709P09598L38298k54924l07220
3304a83790K77500K81181j20422n20050j68016R6022M03982k46714j9996P47810
3294E47507j28343l99002J71912J17562j99357m19946L22364K07790k37282K46695
3284B29900O2353r6739j91823K91839l24057K04783m42382J059100k74689l89915
3274A28370M62196k65668K25771p4745J90146p0191j55792N19235n47204j49295
3264B62823K61788J10739n02833K3733K07416J03184j41787M96619N2982m39158
3254D35506J69430o73878r9249j46261j76481m9477J47896J26400L22216K45446
$$ plain form
3325 -77211 -301588 322737 327648 247656 430474 472161 85990 570169 375905 145399 331001
3314 331001 339382 -395574 -236945 253305 -182833 -669542 40056 378354 123430 -183790
3304 -183790 93710 374891 254469 -265581 -433597 -337575 66407 -180307 -200303 547507
3294 547507 419164 20162 192074 309636 110279 -309667 12697 220487 -16795 229900
3284 229900 292253 195514 3691 295530 -28527 176256 -266126 792974 518285 128370
3274 128370 590566 324898 550669 475924 666070 595879 440087 959322 412118 262823
3264 262823 524611 635350 132517 156250 363666 466850 325063 821682 874664 435506
3254 435506 604936 -68942 -168191 -314452 -490933 -540410 -392514 -266114 56102 301548
3244C01548k54905j7673N1597k28324j08436K55864l60785N21601K46477K60273
3234F67237Q4767k78615J90542k16833k67715p6442Q4702j43212Q8058L68350
3224E00839l21557N771O5987k67004r1735K81276n68831J62493N31235N18190
3214H16664l52732l65935O71579J00105p17240o50504O30892N15585o97207j66328
3204b15121P13652L93868l61420r29802N61057j60327l67736l74865L86652P53956
3194C99914M6150j3338p1603K94964k317q10411M2437J14954m6551l74247N28350
3183A08302N68611l153k90459O2429j44024q5787m09461k53065J87390L2490l5466
3172b62193Q5064L61032q852o32303K86285M20485l09230o57667K87212R71786
$$ plain form
3244 301548 46643 28970 80567 -147757 -256193 -329 -361114 160487 406964 667237
3234 667237 752004 473389 663931 447098 179383 102941 187643 44431 132489 500839
3224 500839 179282 185053 251040 -15964 -107699 173577 -395254 -232761 298474 816664
3214 816664 463932 97997 769576 869681 152441 -498063 132829 648414 -48793 -215121
3204 -215121 498531 892399 530979 -398823 162234 1907 -365829 -740694 -354042 399914
3194 399914 446064 432726 361123 656087 653770 -156641 -114204 750 -45801 -420048 108302
3183 108302 676913 673760 383301 445730 301706 215919 -193542 -446607 -259217 -226727 -262193
3172 -262193 -177129 183903 175051 -457252 -170967 249518 -59712 -717379 -430167 541619
3162E41619o27833k33677K72283N78658k64651n06983N72799L50034n45448K91757
3152D28558K80718M02041m82083j96911L3632j19938O3140k31938J57701l494
3142C31426o7813k6724m6195K8365K5113R1561l4825P5637M4853M35977m29065
3131D28310J03931P8508J47715L8194m46016K8809q3731j840n02053j9626j08973
3120c36772N7354K44413L05225l95025J42673M82604k14378l72003L8809o4989
3110a12089K38748k07348L5141N62691j42757l89564N7917K82478j16026o05390
3100c96199L72874K83086k34649q8745M46076p3112n49627K30968K61786m86904
3090b34446k03181O89312J0818O6547L40968J26357r6530j56378J56287N0133
$$ plain form
3162 541619 -86214 -319891 -47608 531050 266399 -240584 332215 682249 136801 428558
3152 428558 709276 1111317 629234 432323 465955 346017 409157 177219 334920 331426
3142 331426 263613 236889 190694 219059 244172 335733 300908 376545 421398 857375 428310
3131 428310 532241 610749 758464 796658 350642 379451 295720 293880 -208173 -227799 -336772
3120 -336772 -279418 -35005 270220 -124805 17868 500472 286094 -85909 -47100 -112089
3110 -112089 126659 -80689 -45548 517143 374386 -15178 42739 325217 209191 -396199
3100 -396199 -23325 259761 25112 -63633 382443 309331 -240296 -9328 252458 -234446
3090 -234446 -437627 251685 262503 329050 670018 796375 699845 543467 699754 749887
3080G49887n72075l72484L65398O42929j53640j110173N61190R06178l89330r11530
3070b83650K21340P12087j24388n94412J94169K1570O23893m83263k72153j06700
3060i1507K37637L08741m12255r7704l10796O36799N75181p35951K60029M73986
3050H44160n21387L20797n3861J37933J4819j80030k1811o1347k68442j37229
3040G3602j49297j25230O7024J09814L08994L96211n07326L54172O77150o529
3030A198585j392808r0943O91923r6912l32904J38804K12602O31230k98296k37188
3020D24093K94728J14534p97687k49472M01790L39806p53199k09114P47128L78587
3010F91194m37569j12787k93996L94724k0079k43208J16683J06072q0112j18047
$$ plain form
3080 749887 177812 -194672 170726 813655 660015 -450158 111032 1017210 627880 -283650
3070 -283650 -62310 649777 525389 -69023 125146 146716 770609 287346 15193 -91507
3060 -91507 146130 454871 42616 -55088 -365884 270915 846096 110145 370174 844160
3050 844160 322773 643570 589709 727642 742461 562431 540620 479273 210831 73602
3040 73602 -75695 -200925 -133901 -24087 284907 681118 173792 527964 1205114 1198585
3030 1198585 -194223 -285166 406757 309845 -23059 115745 328347 959577 661281 424093
3020 424093 718821 833355 35668 -213804 187986 527792 -225407 -434521 312607 691194
3010 691194 253625 140838 -153158 241566 221487 -21721 94962 201034 120922 2875
3000B875N44045K28846j017524l7470K22490R4060o0550m51710M4383O60912O4625
2989B94982o16696M9520M54900L00148k71046k36102O8774M98484k0929j62061
2979C59974m61851M21089n8643q92543M5716M15536O3834j85647J22974M90671
2969C21110J79652L44837o53883l40400O27967k32004q57872k1469P18139l215
2959H2862l92637M16675J33027J82220Q6389o17102M0782K71623j76406J46594
2949A74027j22944N22923j41899j51733k16126J52774p35747K28018j06753L18918
2939g8542K3490K35996L17014j01188L4124j00223j86989p9613o71953K21642
2929c86242L68942k30284K0238N2814O40956L23896p31746J92400N6850K18427
$$ plain form
3000 2875 546920 775766 -241758 -279228 -56738 37322 -23228 -474938 -430555 230357 294982
2989 294982 -321714 -272194 182706 482854 211808 -24294 44480 542964 522035 359974
2979 359974 -101877 319212 260569 -631974 -586258 -170722 -106888 -292535 -169561 321110
2969 321110 500762 845599 191716 -148684 479283 247279 -610593 -632062 86077 82862
2959 82862 -309775 106900 239927 422147 508536 -108566 -67784 203839 27433 174027
2949 174027 51083 574006 432107 280374 64248 217022 -518725 -290707 -397460 -78542
2939 -78542 -55052 180944 497958 396770 430894 330671 143682 64069 -607884 -386242
2929 -386242 -17300 -247584 -227346 -174532 466424 790320 58574 250974 307824 526251
2919E26251l79183l7235M47652l10705l43399L49016J54495p22171M13722l00850
2909b02407j23542L10352K03403J20720l45483L57689N57985n44373j42261J20743
2899C12826P3168l95009k96014N89377l62416m78131L67503K48162m0776n40922
2889e22232L31080O52246o1467l95481J22447M04555l42797m72876J74827r5058
2879b04756q5070J95797K26844J13399J8957L65112L7138n79439J59210N2163
2869B99355o15641l96100L84188P0087O5416l40223K54267P57538j09088n37153
2859a67354n67813Q55716Q1184n08631L28206P9388L39902K47392n3097l78642
2849B56251N1857m7185P20n89456L69620L24900k19297l8127M26178j94609j19261
$$ plain form
2919 526251 147068 109833 557485 246780 -96619 252397 406892 -315279 98443 -202407
2909 -202407 -325949 -15597 187806 308526 -36957 320732 878717 334344 192083 312826
2899 312826 385994 -9015 -305029 284348 -78068 -556199 -188696 59466 18690 -522232
2889 -522232 -191152 461094 399627 4146 126593 531148 188351 -284525 -109698 -204756
2879 -204756 -289826 -94029 132815 246214 265171 630283 667421 87982 247192 299355
2869 299355 -316286 -712386 -328198 -258111 -192695 -532918 -278651 478887 369799 -167354
2859 -167354 -735167 120549 201733 -306898 21308 100696 440598 687990 634893 256251
2849 256251 308108 260923 261643 -327813 41807 366707 147410 109283 535461 340852 221591
2838B21591o5894r9728L002o1740l83627L06353J01867r1379o54824P73838k29032
2827a79573Q1943J24488r1765K16970K87380m85632j40810M65197j38423k18396
2817g8621k54175K63586k62368K51383K07234l99869j20562O38863K20830o69778
2807b03477k03649M24066K81041j81766k94001Q0310j6620M6117J26600J6342
2797G4963j86703j54383R2290K36779k47296j54990K48296L32786P5649R200n1369
2786B75222K46968j84055k27957l06653K35633K27197q8265k7593J94869o330
2776C39036J2551J08695j80973m80451L65419k77818J38508j1999K11127L5372
2766B59467m3193j4924j88721l14836N03243l47283Q7875k59589K45095M46119
$$ plain form
2838 221591 155697 55969 58971 -2769 -386396 -80043 21824 -69555 -724379 49459 -179573
2827 -179573 -97630 26858 -64907 152063 439443 -46189 -186999 278198 139775 -78621
2817 -78621 -332796 -69210 -331578 -80195 127039 -272830 -393392 245471 466301 -203477
2807 -203477 -407126 16940 297981 116215 -177786 -97476 -114096 -67979 58621 74963
2797 74963 -111740 -266123 -173833 62946 -184350 -339340 -91044 241742 317391 326591 275222
2786 275222 522190 338135 110178 -196475 39158 266355 178090 150497 345366 339036
2776 339036 351587 460282 279309 -201142 164277 -113541 24967 12968 224095 259467
2766 259467 216274 201350 12629 -302207 201036 -146247 -58372 -317961 -72866 373253
2756C73253r0699l47857K20356M32354j80540o37388N4240L14422q5002p0147
2746a7008k74649M80501K54867l516J91508j55995J83610j11893k49386M8845
2736C46884o9701j29051l11133J80146J89115n23218m0965L12079j2098M3979
2726a3963l21540M92714M01656O2331p73922K11800L10028J97736p80133J11083
2716a02210N51279k02539j8343k70906K27769J23510l78888j12882j84881r6916
2706d65007K46169j75243K21909N809k7381K88547k05250k24959K60391k72770
2696c47785j57918J19104N08562k18462l97134Q01008L20717l34927m39408R3379
2686e2864n8421j09662J7637k01020j2755N04672K09364m25349K53982J20334
$$ plain form
2756 373253 282554 -65303 155053 587407 406867 -230521 -176281 138141 53139 -17008
2746 -17008 -291657 188844 443711 440195 631703 475708 659318 547425 298039 346884
2736 346884 277183 148132 -163001 17145 206260 -316958 -357923 -45844 -57942 -13963
2726 -13963 -335503 157211 558867 621198 -152724 59076 369104 566840 -213293 -102210
2716 -102210 449069 246530 228187 -42719 185050 308560 -70328 -183210 -368091 -465007
2706 -465007 -218838 -394081 -172172 -166363 -193744 94803 -110447 -335406 -75015 -347785
2696 -347785 -505703 -386599 121963 -96499 -493633 307375 628092 293165 -146243 -52864
2686 -52864 -111285 -220947 -203310 -404330 -417085 87587 296951 -128398 125584 245918
2676B45918K95474J0705o96340M98533K42357m90091l86138J57998M65103n05426
2666a61907l4749L87278p084q5528l28451P4508M05616k42877l60043N08808K62962
2655D18533p09210l3375Q42899l50723l02159K81116J26539k78378L31075J31486
2645D57803o97720L8509P32215k54354n96759N03767Q7056j64552J14421L7122
2635B57508k91493p5415k65762R4839Q6505J51238j83916p7578M43963l99957
2625b60068j72111J91116r4195l34196P47348J38709p90274K68506O46868j07775
2615B33928m89683l05683M56816M00598l23369k90344L20843M68070j64263l14369
2605g456M88481p82255K83190J79285P2072k41817L10557r1522K68294N402j58303
$$ plain form
2676 245918 541392 552097 -144243 354290 596647 106556 -279582 -121584 343519 -161907
2666 -161907 -196656 190622 183538 98010 -230441 -155933 249683 6806 -353237 155571 418533
2655 418533 -290677 -324052 518847 168124 -134035 147081 273620 -4758 326317 457803
2645 457803 -239917 -201408 530807 276453 -320306 183461 270517 105965 220386 257508
2635 257508 -33985 -109400 -375162 -280323 -193818 -42580 -226496 -304074 139889 -260068
2625 -260068 -432179 -241063 -335258 -669454 77894 216603 -573671 -305165 341703 233928
2615 233928 -255755 -561438 -104622 295976 -27393 -317737 3106 471176 306913 -7456
2605 -7456 481025 -301230 -18040 161245 233317 -8500 302057 210535 478829 484231 325928
2594C25928o19113K47424M20706p66403k05965N32211k70137j17033M22269J72938
2584A42825k95959k38812N27738m2523n3974M7726j94796J52435P92001p77352
2574E9309J01967K38793m8394k03718o2641O55462k09028n30012L41585M50776
2564G94099n69581p0839q5973R7942k04934j39569N45762m34459L59650k35185
2554E6913M97371j51316l560R6086n20500K17014O7095k61381r2561P7235M17146
2543C99542o5459k43235J10232m56775K81939J17628m88812N50041j31990O1920
2533A35031J03163M25214q63972j19763J65115L36547p53966l99988M76733O41169
2523A45283j24656J51391k26291O23517j79255o3370L12786m13764K61713l97294
$$ plain form
2594 325928 -293185 -45761 374945 -391458 -597423 -65212 -335349 -452382 -30113 142825
2584 142825 -153134 -391946 135792 93269 39295 87021 -107775 44660 836661 59309
2574 59309 161276 400069 351675 147957 85316 740778 531750 1738 343323 794099
2564 794099 224518 153679 67706 165648 -39286 -178855 366907 -67552 292098 56913
2554 56913 554284 402968 399408 495494 -25006 192008 259103 -2278 -94839 -17604 399542
2543 399542 334083 90848 201080 -255695 26244 143872 -344940 205101 73111 135031
2533 135031 238194 663408 -200564 -320327 -155212 181335 -572631 -972619 -495886 145283
2523 145283 20627 172018 -54273 569244 389989 326619 639405 225641 487354 90060
2513I0060L06798M46446m21658r3978l6488J81482P0926l16356q9358O3682K47695
2502D49251Q7415m33426L14460J04965l42671l20993N8357k7142m40172m4962
2492e94918O87041L04372l03741O03432L2478k80773l52007N03541m78024m79529
2482c58128j35983N89125L00291m62493k53925J055904k20882q12120l96415O13737
2472h0889L68616q45249K43050P71210J29676k06553l33698J31346k84224K6120
2462h0595n30407J27615L66430P9287l89208O03368M93868m54504n28978L17089
2452C965q7718K14054k67938r7704O00946R1610j29572j78615K79031j53911m71741
2441a97593K50810L15325l4110l59411J07678N88877o662o88013n0166q0803N48609
$$ plain form
2513 90060 396858 843304 421646 327668 291180 472662 543588 227232 137874 201556 449251
2502 449251 536666 103240 417700 522665 179994 -140999 -82642 -109784 -549956 -594918
2492 -594918 92123 396495 92754 696186 728664 447891 95884 599425 121401 -358128
2482 -358128 -494111 95014 395305 -67188 -321113 734791 513909 -298211 -694626 -80889
2472 -80889 287727 -557522 -314472 456738 586414 379861 46163 177509 -106715 -80595
2462 -80595 -611002 -483387 -116957 -37670 -426878 176490 670358 215854 -313124 3965
2452 3965 -83753 130301 -137637 -235341 365605 457215 327643 149028 428059 274148 -197593
2441 -197593 53217 368542 334432 -24979 82699 671576 664914 -23099 -73265 -154068 394541
2430C94541k17645k10236j14395M290Q7895L07032m1734J5077J43280J28367m3225
2419D53247K73363L1201r48440L24139L97024l26446q49523O19333N07855n79274
2409i7521j23240J92557J17661J31051j75762L17841k12036P08557l03786o42342
2399h7020N83333K41665j030432L1173N06563j270n00353L40746p4959L161n6738
2388d4131k40795J04817N71773j80121m29024J9310P26210m70660l78791J75019
2378a46393M98145m55700J00826N80226m82920N7684N13082J5877m90197j17814
2368G2816J30249J75172n3294l17616J06563K51138k05667q8825M1363K21112
2358C33011k20859P3411J59600K65417l27589n4829L61557k06930m50291m09851
$$ plain form
2430 394541 176896 -33340 -147735 -143445 -55550 251482 209748 224825 368105 496472 453247
2419 453247 726610 757811 -190629 133510 530534 204088 -645435 -26102 481753 -97521
2409 -97521 -220761 -28204 89457 220508 44746 362587 150551 859108 555322 -87020
2399 -87020 496313 737978 -292454 -261281 245282 244012 -256341 84405 9446 12607 -44131
2388 -44131 -284926 -180109 391664 211543 -217481 -198171 528039 57379 -321412 -146393
2378 -146393 351752 -103948 -3122 577104 94184 151868 664950 680827 190630 72816
2368 72816 203065 378237 324943 7327 113890 365028 159361 70536 111899 333011
2358 333011 112152 185563 345163 610580 282991 228162 589719 382789 -67502 -477353
2348d77353M52303K28221m54651L15903L25705K43987j02415k75671J71769K20811
2338F48609k11475J77381m42767P25631o2689p94563K27747O05499j57492j057337
2328c41456L74921K22043K00870r4818j55896J5424Q34634L45325p62508K34493
2318H73032R13032J46916n31972k86139J22134J78011p4015J06602o87465Q1655
$$ plain form
2348 -477353 -25050 203171 -251480 64423 390128 634115 531700 256029 427798 648609
2338 648609 437134 614515 171748 897379 834690 40127 267874 873373 715881 -341456
2328 -341456 33465 255508 456378 361560 205664 221088 1055722 1401047 638539 873032
2318 873032 1786064 1932980 1401008 1114869 1237003 1415014 1340999 1447601 760136 841791
$$ [...]
##END NTUPLES=NMR SPECTRUM
##END=
