##TITLE=1H_DE-80H_X3
 200.13MHz, d2o
 8 sc
 
 19ns.26.2.2025
##JCAMPDX= 6.0         $$ Bruker NMR JCAMP-DX V2.0
##DATA TYPE= NMR SPECTRUM
##DATA CLASS= NTUPLES
##ORIGIN= UXNMR, Bruker Analytische Messtechnik GmbH
##OWNER= pz
$$ XWIN-NMR		Version 3.5
$$ Fri Dec 19 10:24:33 2025 Russian Standard Time (UT+4h)  Yarkov@DPX200
##.OBSERVE FREQUENCY= 200.1313
##.OBSERVE NUCLEUS= ^1H
##.ACQUISITION MODE= SIMULTANEOUS
##.ACQUISITION SCHEME= undefined
##.AVERAGES= 8
##.DIGITISER RES= 18
##SPECTROMETER/DATA SYSTEM= spect
##.PULSE SEQUENCE= zg30
##.SOLVENT NAME= DMSO
##.SHIFT REFERENCE= (INTERNAL, DMSO, 0, 15.5078)
##AUDIT TRAIL= $$ (NUMBER, WHEN, WHO, WHERE, WHAT)
$$ ##TITLE= Audit trail, XWIN-NMR		Version 3.5
$$ ##JCAMPDX= 5.01
$$ ##ORIGIN= Bruker BioSpin GmbH
$$ ##OWNER= Yarkov
$$ C:/Bruker/XWIN-NMR/data/yarkov2/nmr/H-C/1/pdata/1/auditp.txt
$$ ##AUDIT TRAIL=  $$ (NUMBER, WHEN, WHO, WHERE, WHAT)
(   1,<2025-12-19 10:23:39.03 +0400>,<Yarkov>,<DPX200>,
      <created by zg, POWCHK disabled, PULCHK disabled
       configuration hash MD5:
       00 E9 B6 7A A2 85 ED C7 34 08 36 98 17 FE 4E 26
       data hash MD5: 16K
       FF 06 CF 0C 4D 26 72 07 B6 33 39 DA 94 4D BE 44>)
(   2,<2025-12-19 10:23:40.48 +0400>,<Yarkov>,<DPX200>,
      <Start of raw data processing
       efp BC_mod = 2 LB = 0.25 FT_mod = 6 PKNL = 1 PHC0 = -5305.955 PHC1 = 10.82193 SI = 16K 
       data hash MD5: 16K
       B3 48 61 5C E1 92 5B 2B 03 87 DF BE D9 22 EB C5>)
(   3,<2025-12-19 10:23:54.56 +0400>,<Yarkov>,<DPX200>,
      <pk PHC0 = -5 PHC1 = 0 
       data hash MD5: 16K
       79 5C B5 4E C4 9F 14 3E 0D F0 E9 B0 7E CC BA DC>)
$$ ##END=
$$ 
$$ hash MD5
$$ AA 5F 41 73 44 42 51 B2 32 17 CD EF F1 A5 68 07
##$RELAX= 
##$RELAX= 
##$RELAX= 
##$RELAX= 
##$RELAX= 
##$RELAX= 
$$ Bruker specific parameters
$$ --------------------------
##$DU= <C:/Bruker/XWIN-NMR>
##$EXPNO= 1
##$NAME= <H-C>
##$PROCNO= 1
##$TYPE= <nmr>
##$USER= <yarkov2>
##$AMP= (0..31)
100 100 100 100 100 100 100 100 100 100 100 100 100 100 100 100 100 100 
100 100 100 100 100 100 100 100 100 100 100 100 100 100 
##$AQSEQ= 0
##$AQ_mod= 1
##$AUNM= <au_zg>
##$AUTOPOS= <>
##$BF1= 200.13
##$BF2= 200.13
##$BF3= 200.13
##$BF4= 200.13
##$BF5= 200.13
##$BF6= 200.13
##$BF7= 200.13
##$BF8= 200.13
##$BYTORDA= 1
##$CFDGTYP= 0
##$CFRGTYP= 5
##$CHEMSTR= <none>
##$CNST= (0..31)
1 1 145 1 1 1 1 1 1 1 1 1 1 1 1 1 1 1 1 1 1 1 1 1 1 1 1 1 1 1 1 1 
##$CPDPRG= <>
##$CPDPRG1= <>
##$CPDPRG2= <>
##$CPDPRG3= <>
##$CPDPRG4= <mlev>
##$CPDPRG5= <mlev>
##$CPDPRG6= <mlev>
##$CPDPRG7= <mlev>
##$CPDPRG8= <mlev>
##$CPDPRGB= <>
##$CPDPRGT= <>
##$D= (0..31)
0 0.7 0 0 0 0 0 0 0 0 0 0.03 0 0 0 0 0 0 0 0 0 0 0 0 0 0 0 0 0 0 0 0 
##$DATE= 1766125418
##$DBL= (0..7)
120 120 120 120 120 120 120 120 
##$DBP= (0..7)
150 150 150 150 150 150 150 150 
##$DBP07= 0
##$DBPNAM0= <>
##$DBPNAM1= <>
##$DBPNAM2= <>
##$DBPNAM3= <>
##$DBPNAM4= <>
##$DBPNAM5= <>
##$DBPNAM6= <>
##$DBPNAM7= <>
##$DBPOAL= (0..7)
0.5 0.5 0.5 0.5 0.5 0.5 0.5 0.5 
##$DBPOFFS= (0..7)
0 0 0 0 0 0 0 0 
$$ [...]
##$SUBNAM2= <"">
##$SUBNAM3= <"">
##$SUBNAM4= <"">
##$SUBNAM5= <"">
##$SUBNAM6= <"">
##$SUBNAM7= <"">
##$SUBNAM8= <"">
##$SUBNAM9= <"">
##$SW= 18.0517328524113
##$SWIBOX= (0..15)
0 0 2 0 0 0 0 0 0 0 0 0 0 0 0 0 
##$SW_h= 3612.71676300578
##$TD= 16384
##$TD0= 1
##$TE= 0
##$TE2= 300
##$TE3= 300
##$TEG= 300
##$TL= (0..7)
0 120 120 120 120 120 120 120 
##$TP= (0..7)
150 150 150 150 150 150 150 150 
##$TP07= 0
##$TPNAME0= <>
##$TPNAME1= <>
##$TPNAME2= <>
##$TPNAME3= <>
##$TPNAME4= <>
##$TPNAME5= <>
##$TPNAME6= <>
##$TPNAME7= <>
##$TPOAL= (0..7)
0.5 0.5 0.5 0.5 0.5 0.5 0.5 0.5 
##$TPOFFS= (0..7)
0 0 0 0 0 0 0 0 
##$TUNHIN= 0
##$TUNHOUT= 0
##$TUNXOUT= 0
##$USERA1= <user>
##$USERA2= <user>
##$USERA3= <user>
##$USERA4= <user>
##$USERA5= <user>
##$V9= 5
##$VALIST= <valist>
##$VCLIST= <CCCCCCCCCCCCCCC>
##$VD= 0
##$VDLIST= <DDDDDDDDDDDDDDD>
##$VPLIST= <PPPPPPPPPPPPPPP>
##$VTLIST= <TTTTTTTTTTTTTTT>
##$WBST= 1024
##$WBSW= 4
##$XGAIN= (0..3)
0 0 0 0 
##$XL= 0
##$YL= 0
##$YMAX_a= 66989
##$YMIN_a= -70281
##$ZGOPTNS= <>
##$ZL1= 120
##$ZL2= 120
##$ZL3= 120
##$ZL4= 120
##$ABSF1= 0
##$ABSF2= 0
##$ABSG= 0
##$ABSL= 0
##$ALPHA= 0
##$AQORDER= 0
##$ASSFAC= 0
##$ASSFACI= 0
##$ASSFACX= 0
##$ASSWID= 0
##$AUNMP= <proc_1d>
##$AZFE= 0.1
##$AZFW= 0.1
##$BCFW= 0
##$BC_mod= 2
##$BYTORDP= 0
##$COROFFS= 0
##$CY= -3
##$DATMOD= 1
##$DC= 0
##$DFILT= <>
##$DTYPP= 0
##$F1P= 0
##$F2P= 0
##$FCOR= 1
##$FTSIZE= 16384
##$FT_mod= 6
##$GAMMA= 0
##$GB= 0
##$INTBC= 1
##$INTSCL= 3.241238e-09
##$ISEN= 128
##$LB= 0.25
##$LEV0= 0
##$LPBIN= 0
##$MAXI= 10000
##$MC2= 0
##$MEAN= 0
##$ME_mod= 0
##$MI= 1.114404
##$NCOEF= 0
##$NC_proc= -7
##$NLEV= 6
##$NOISF1= 3.799351
##$NOISF2= 2.8
##$NSP= 0
##$NTH_PI= 0
##$NZP= 0
##$OFFSET= 15.5078
##$PC= 1
##$PHC0= -5310.955
##$PHC1= 10.82193
##$PH_mod= 1
##$PKNL= yes
##$PPARMOD= 0
##$PSCAL= 0
##$PSIGN= 0
##$REVERSE= no
##$SF= 200.130002782413
##$SI= 16384
##$SIGF1= 3
##$SIGF2= 2
##$SINO= 0.751879
##$SIOLD= 32768
##$SREGLST= <19F.Aceton>
##$SSB= 0
##$STSI= 16384
##$STSR= 0
##$SW_p= 3612.71676300578
##$SYMM= 0
##$S_DEV= 0
##$TDeff= 16384
##$TDoff= 0
##$TI= <>
##$TILT= no
##$TM1= 0
##$TM2= 0
##$TOPLEV= 0
##$USERP1= <user>
##$USERP2= <user>
##$USERP3= <user>
##$USERP4= <user>
##$USERP5= <user>
##$WDW= 1
##$XDIM= 16384
##$YMAX_p= 429653603
##$YMIN_p= -843159
$$ End of Bruker specific parameters
$$ ---------------------------------
##NTUPLES= NMR SPECTRUM
##VAR_NAME=  FREQUENCY,     SPECTRUM/REAL,   SPECTRUM/IMAG
##SYMBOL=    X,             R,               I
##VAR_TYPE=  INDEPENDENT,   DEPENDENT,       DEPENDENT
##VAR_FORM=  AFFN,          ASDF,            ASDF
##VAR_DIM=   16384,         16384,           16384
##UNITS=     HZ,            ARBITRARY UNITS, ARBITRARY UNITS
##FACTOR=    0.220516191357247, 1,           1
##FIRST=     3103.57607760917, 0,            0
##LAST=      -509.140685396608, 0,           0
##MIN=       -509.140685396608, -843159,     0
##MAX=       3103.57607760917, 429653603,    0
$$ Real data points
##PAGE= N=1
##DATA TABLE= (X++(R..R)), XYDATA
$$ [...]
$$ plain form
8510 657232 480083 513119 580857 640340 654310 656104 835463 973941 1175060 1085186 886076
8499 886076 807280 887264 989035 1284148 1469826 1736517 1903961 1966504 1882199 1693098
8489 1693098 1480143 1860107 2103008 2185296 2266788 2134039 1981462 1779429 1480396 1302952
8479 1302952 1479928 1644876 1693395 1736579 1767735 1688407 1749398 1622266 1630685 1747278 1733326
8468 1733326 1735257 1836681 1638795 1508865 1763926 1860791 2025787 2333230 2494246 2470752
8458 2470752 2561500 2448107 2333668 2578917 2663793 2689894 2792616 2673589 2389541 2255625
8448 2255625 1952744 1905411 1930526 1836079 1705849 1673533 1716793 1755648 1963115 2217855 2260446
8437 2260446 2097071 1955139 2086155 2265818 2213941 2407682 2568574 2481296 2278570 2024823
$$ packed form
8510F57232j77149L3036O7738N9483J3970J794J79359J38478K01119q9874j99110
8499H86076p8796P9984J01771K95113J85678K66691J67444O2543q4305j89101
8489A693098k12955L79964K42901Q2288Q1492j32749j52577k02033k99033j77444
8479A302952J76976J64948M8519M3184L1156p9328O0991j27132Q419J16593j3952
8468A733326J931J01424j97886j29930K55061R6865J64996L07443J61016k3494
8458B470752R0748j13393j14439K45249Q4876K6101J02722j19027k84048j33916
8448B255625l02881m7333K5115r4447j30230l2316M3260L8855K07467K54740M2591
8437B260446j63375j41932J31016J79663n1877J93741J60892q7278k02726k53747
$$ plain form
8427 2024823 1863986 1892512 1981231 2282553 2416570 2281503 2291852 2090587 1766653 1578655
8417 1578655 1850363 1966287 2215377 2633645 2522281 2362361 2434118 2621406 2990381 3396506
8407 3396506 3693144 3958762 3919209 3750325 3848828 4018648 4027790 4559465 4799447 4778230
8397 4778230 4850992 4673362 4491840 4636415 4983291 5183529 5240705 5410809 5356955 5492972
8387 5492972 5728227 6048172 6612655 7149547 7525739 7930320 8499087 9495169 10771288
8378 10771288 12098458 13433823 14464978 14805822 14258696 13093824 11637015 10467915
8370 10467915 9849238 9492322 9305960 9255241 8768309 8283839 7911408 7456267 7124357 6904433
8360 6904433 6423560 5852429 5591764 5154507 4918869 4959262 4658189 4903051 5109890 4967866
$$ packed form
8427B024823j60837K8526Q8719L01322J34017j35067J0349k01265l23934j87998
8417A578655K71708J15924K49090M18268j11364j59920P1757J87288L68975M06125
8407C396506K96638K65618l9553j68884R8503J69820R142N31675K39982k1217
8397D778230P2762j77630j81522J44575L46876K00238N7176J70104n3854J36017
8387E492972K35255L19945N64483N36892L76192M04581N68767R96082J276119
8378A0771288J327170J335365J031155L40844n47126j164872j456809j169100
8370A0467915o18677l56916j86362n0719m86932m84470l72431m55141l31910k19924
8360F904433m80873n71131k60665m37257k35638M0393l01073K44862K06839j42024
$$ plain form
8350 4967866 4925033 4874485 4833907 5490742 6202346 6780718 7255564 7382637 7136898 7167967
8340 7167967 7237714 7137174 7773568 8507195 9518776 10514096 10726523 10483812 9959384 9093987
8330 9093987 8012165 6864916 5800355 4792710 4103297 3534335 3040178 2576276 2286196
8321 2286196 2021120 1891481 1668638 1430165 1617516 1528426 1478967 1549319 1373336 1218870
8311 1218870 1233395 1167902 1167321 1255278 1203326 1108509 890928 719918 644830 760830 655699
8300 655699 671262 639191 617658 721312 712772 506494 432753 638302 632775 752068 758108
8289 758108 675413 620914 533369 429322 461716 544651 601391 566987 553820 610466 621867
8278 621867 445381 529920 441923 179440 165425 283068 332976 325316 331737 329948 255113 79685
$$ packed form
8350D967866m2833n0548m0578O56835P11604N78372M74846J27073k45739L1069
8340G167967O9747j00540O36394P33627J011581R95320K12427k42711n24428q65397
8330I093987j081822j147249j064561j007645o89413n68962m94157m63902k90080
8321B286196k65076j29639k22843k38473J87351q9090m9459P0352j75983j54466
8311A218870J4525o5493n81Q7957n1952r4817k17581j71010p5088J16000j05131
8300F55699J5563l2071k1533J03654q540k06278p3741K05549n527J19293O040
8289G58108q2695n4499q7545j04047L2394Q2935N6740l4404j3167N6646J1401
8278F21867j76486Q4539q7997k62483j4015J17643M9908p660O421j789p4835j75428
$$ plain form
8266 79685 85875 116504 142396 202900 411151 396127 260184 349967 357310 214903 315081
8255 315081 317335 304082 318188 256757 319284 345426 185513 93953 394315 150105 65069
8244 65069 238331 207652 231539 412433 229286 120516 241577 261666 278204 236935 308837
8233 308837 374148 382338 185047 84633 105018 -30264 -34549 18254 88833 164632 82830
8222 82830 39038 -63252 -109192 -144942 92494 204520 264707 321562 330355 190280 273291
8211 273291 219932 153361 376513 340530 188608 167237 21530 -33162 -133241 -187778 -173815
8200 -173815 -157769 -361248 -364501 -276642 -271499 -410034 -361766 -843159 -102949 921235 477392
8189 477392 568685 443400 361325 333322 445336 304895 308314 217396 146152 108663 206046
$$ packed form
8266G9685O190L0629K5892O0504K08251j5024j35943Q9783P343j42407J00178
8255C15081K254j3253J4106o1431O2527K6142j59913r1560L00362k44210q5036
8244F5069J73262l0679K3887J80894j83147j08770J21061K0089J6538m1269P1902
8233C08837O5311Q190j97291j00414K0385j35282m285N2803P0579P5799q1802
8222H2830m3792j02290m5940l5750K37436J12026O0187N6855Q793j40075Q3011
8211B73291n3359o6571K23152l5983j51922k1371j45707n4692j00079n4537J3963
8200a73815J6046k03479l253Q7859N143j38535M8268m81393P40210J024184m43843
8189D77392R1293j25285q2075k8003J12014j40441L419r0918p1244l7489R7383
$$ plain form
8178 206046 -36595 -153564 -44744 7172 232908 275119 80823 113921 59162 36636 278559
8167 278559 480939 507011 519279 431120 366667 412685 337031 16072 -206037 -119535 -159311
8156 -159311 92817 134483 136651 226610 45163 -147783 -15502 142770 164042 266076 412805
8145 412805 463876 448541 250196 223066 340879 291859 256787 418853 394131 237270 82602
8134 82602 -183505 -258140 39740 40046 186657 297038 96394 71323 -4738 -69828 52128
8123 52128 168797 245124 270732 298588 169991 165221 169393 245875 350313 489467 450763
8112 450763 233409 130865 -70632 -63660 -49880 26850 211045 159793 -81198 -52436 -108047
8101 -108047 -349591 -152236 -23246 97923 168292 154688 308969 198168 69351 242959
$$ packed form
8178B06046k42641j16969J08820N1916K25736M2211j94296L3098n4759k2526K41923
8167B78559K02380K6072J2268q8159o4453M6018p5654l20959k22109Q6502l9776
8156a59311K52128M1666K168Q9959j81447j92946J32281J58272K1272J02034J46729
8145D12805N1071j5335j98345k7130J17813m9020l5072J62066k4722j56861j54668
8134H2602k66107p4635K97880L06J46611J10381k00644k5071p6061o5090J21956
8123E2128J16669P6327K5608K7856j28597m770M172P6482J04438J39154l8704
8112D50763k17354j02544k01497O972J3780P6730J84195n1252k40991K8762n5611
8101a08047k41544J97355J28990J21169P0369j3604J54281j10801j28817J73608
$$ plain form
8091 242959 334111 207073 239694 189115 183677 188037 333316 262769 203990 21605 -209439
8080 -209439 -214511 -37759 80009 151271 74449 133600 171621 -40053 -63926 63212 226870
8069 226870 267326 294262 99078 -24968 -82652 -271793 -142066 86223 206019 339885
8059 339885 228685 27096 35942 -90992 201786 310230 456426 528329 506009 392847
8049 392847 -2565 26772 175779 141199 308737 496494 437751 368611 96045 -64510
8039 -64510 112226 191607 124827 260048 151308 7101 47681 -130535 -203983 262403 254680
8028 254680 220806 197750 130769 48742 99394 273956 430189 463149 378474 276496 184021
8017 184021 229517 493278 697364 534473 264568 270118 237461 272632 484732 622520 485341
$$ packed form
8091B42959R1152j27038L2621n0579n438M360J45279p0547n8779j82385k31044
8080b09439n072J76752J17768P1262p6822N9151L8021k11674k3873J27138J63658
8069B26870M0456K6936j95184j24046n7684j89141J29727K28289J19796J33866
8059C39885j11200k01589Q846j26934K92778J08444J46196P1903k2320j13162
8049C92847l95412K9337J49007l4580J67538J87757n8743o9140k72566j60555
8039f4510J76736P9381o6780J35221j08740j44207M0580j78216p3448M66386p723
8028B54680l3874k3056o6981q2027N0652J74562J56233L2960q4675j01978r2475
8017A84021M5496K63761K04086j62891k69905N550l2657L5171K12100J37788j37179
$$ plain form
8006 485341 274361 35839 -198122 -141627 -20485 90358 456647 681708 851985 772969
7996 772969 431684 249096 195476 269876 505992 701280 670433 652950 423909 285142
7986 285142 170300 157110 223804 466199 435367 434370 308899 125477 141099 125418 86771
7975 86771 376228 645346 675017 432448 281166 319183 182822 455695 652487 710676
7965 710676 589692 492981 262758 199576 221082 273796 472132 552024 665807 661264 709732
7954 709732 802164 845426 767656 756461 826894 824907 751671 754817 731850 596054 291486 205936
7942 205936 123385 66597 -57825 58213 198111 95275 71978 -118007 -180777 -212918 -210185
7931 -210185 40886 388182 648204 812528 588613 306354 228323 366852 430846 603775
$$ packed form
8006D85341k10980k38522k33961N6495J21142J10843L66289K25061J70277p9016
7996G72969l41285j82588n3620P4400K36116J95288l0847j7483k29041j38767
7986B85142j14842j3190O6694K42395l0832r97j25471j83422J5622j5681l8647
7975H6771K89457K69118K9671k42569j51282L8017j36361K72873J96792N8189
7965G10676j20984r6711k30223o3182K1506N2714J98336P9892J13783m543M8468
7954G09732R2432M3262p7770j1195P0433j987p3236L146k2967j35796l04568q5550
7942B05936q2551n6788j24422J16038J39898j02836k3297j89985o2770l2141K733
7931b10185K51071L47296K60022J64324k23915k82259p8031J38529O3994J72929
$$ plain form
7921 603775 661452 532190 512965 507939 308524 410194 570936 602162 581748 545087 393287
7910 393287 248910 137747 135311 159374 103763 242253 240844 314037 289532 100283 170946
7899 170946 187990 102650 283330 249230 183943 128203 127320 247160 199093 123012 12262
7888 12262 29732 145541 155224 31986 -33846 59923 15497 153784 309375 291529 311807
7877 311807 214070 256974 254945 288546 46092 -12125 66954 98915 161719 91180 232531
7866 232531 -147979 -237488 -307831 -349118 -169393 53838 63112 237042 307601 269034 365163
7855 365163 364541 309063 427542 482181 400641 407991 373439 328450 453989 396658 252408 127845
7843 127845 -16249 -236693 -300873 -244261 -293048 -87498 207920 232918 150608 92894 -26194
$$ packed form
7921F03775N7677j29262j9225n026j99415J01670J60742L1226k0414l6661j51800
7910C93287j44377j11163k436K4063n5611J38490j409P3193k4505j89249P0663
7899A70946J7044q5340J80680l4100o5287n5740q83J19840m8067p6081j10750
7888A2262J7470J15809R683j23238o5832R3769m4426J38287J55591j7846K0278
7877C11807r7737M2904k029L3601k42454n8217P9079L1961O2804p0539J41351
7866B32531l80510q9509p0343m1287J79725K23231R274J73930P0559l8567R6129
7855C65163o22n5478J18479N4639q1540P350l4552m4989J25539n7331j44250j24563
7843A27845j44094k20444o4180N6612m8787K05550K95418K4998q2310n7714j19088
$$ plain form
7832 -26194 177663 293081 268458 367215 331537 346241 381512 317111 201191 99389 117593
7821 117593 186072 374120 402580 137711 -10225 37791 54924 71302 158943 211220 235810
7810 235810 588352 241959 126294 119909 7240 43966 23023 31679 51905 -9388 -11639
7799 -11639 37823 22465 17535 75158 73916 259136 401385 374940 520001 447772 188432
7788 188432 244029 154865 51461 249177 256261 257676 308668 111553 48416 203090 264124
7777 264124 132051 108786 37561 52270 104601 73806 141249 132180 137980 81588 -68627 -18869
7765 -18869 152597 -6744 36145 87100 88649 118749 264928 329545 417530 404076 213684
7754 213684 206453 150377 132452 282916 329570 431359 507109 324759 16222 -116334 -62204
$$ packed form
7832b6194K03857J15418k4623R8757l5678J4704L5271o4401j15920j01802J8204
7821A17593O8479J88048K8460k64869j47936M8016J7133J6378Q7641N2277K4590
7810B35810L52542l46393j15665o385j12669L6726k0943Q656K0226o1293k251
7799a1639M9462j5358m930N7623j242J85220J42249k6445J45061p2229k59340
7788A88432N5597q9164j03404J97716P084J415N0992j97115o3137J54674O1034
7777B64124j32073k3265p1225J4709N2331l0795O7443r069N800n6392j50215M9758
7765a8869J71466j59341M2889N0955J549L0100J46179O4617Q7985j3454j90392
7754B13684p231n6076j7925J50464M6654J01789P5750j82350l08537j32556N4130
$$ plain form
7743 -62204 -176347 -190579 -11588 19504 77933 137128 50249 90242 55806 -15537 25312
7732 25312 282412 509504 664819 738104 457918 150763 3701 12817 182141 391768
7722 391768 301452 322680 318750 -26245 -152031 -157790 -329147 -107340 105883 317468 373465
7711 373465 331020 146701 -15729 -77280 -37546 228746 321713 305864 305790 172283 -161453
7700 -161453 -143392 -209036 29148 382712 254429 226947 180269 -53910 -93852 177336 376459
7689 376459 357973 514975 513779 444728 389122 77360 90391 262458 251257 120300 384713
7678 384713 147925 -58358 -139854 -281751 -57087 6186 32517 115300 62196 -89276 16422
7667 16422 80181 -14124 220151 484679 149646 165648 285408 206825 253961 290130 330585
$$ packed form
7743f2204j14143j4232J78991L1092N8429N9195q6879L9993l4436p1343M0849
7732B5312K57100K27092J55315P3285k80186l07155j47062R116J69324K09627
7722C91768r0316K1228l930l44995j25786n759j71357K21807K13223K11585N5997
7711C73465m2445j84319j62430o1551L9734K66292R2967j5849p4j33507l33736
7700a61453J8061o5644K38184L53564j28283k7482m6678k34179l9942K71188J99123
7689C76459j8486J57002j196o9051n5606l11762J3031J72067j1201j30957K64413
7678C84713k36788k06283q1496j41897K24664O3273K6331Q2783n3104j51472J05698
7667A6422O3759r4305K34275K64528l35033J6002J19760p8583M7136L6169M0455
$$ plain form
7656 330585 369830 282136 264131 420047 507459 507520 485964 262358 -95701 -245967 -235158
7645 -235158 -167297 127328 150372 186425 260806 129608 -127824 -87768 -55946 154557 709049
7634 709049 669782 563341 531823 254177 109471 153424 70573 119077 222964 188401 49504
7623 49504 35751 -106904 -112249 89899 140321 134488 102881 -4902 29815 288535 480418
7612 480418 618958 554600 574982 286814 106201 66009 10486 248624 237762 136482 -98444
7601 -98444 -223393 -328773 -174502 -50501 226679 482492 415237 446963 426932 276350
7591 276350 186371 182680 283691 420502 400194 381837 181360 6621 12186 -33621 22340
7580 22340 113527 -88645 -173585 -37534 -15200 -6444 137547 288597 277737 278833 264149
$$ packed form
7656C30585L9245q7694j8005J55916Q7412O1k1556k23606l58059j50266J0809
7645b35158O7861K94625K3044L6053P4381j31198k57432M0056L1822K10503N54492
7634G09049l9267j06441l1518k77646j44706M3953q2851M8504J03887l4563j38897
7623D9504j3753j42655n345K02148N0422n833l1607j07783L4717K58720J91883
7612D80418J38540o4358K0382k88168j80613m0192n5523K38138j0862j01280k34926
7601i8444j24949j05380J54271J24001K77180K55813o7255L1726k0031j50582
7591B76350q9979l691J01011J36811k0308j8357k00477j74739N565m5807N5961
7580B2340R1187k02172q4940J36051K2334Q756J43991J51050j0860J096j4684
$$ plain form
7569 264149 219998 323670 370233 349670 303819 285640 192392 218868 334808 296954 247587
7558 247587 393607 317016 326504 290246 199329 343784 373508 358155 386408 356414 221008
7547 221008 95348 149904 91579 213387 423135 493022 385879 342967 212292 247603 554397
7536 554397 891003 1142201 1338840 1567226 1770775 2062659 2218521 2128946 2043121 1827873
7526 1827873 1551743 1207824 617590 421634 179293 150810 252922 538222 662762 466586
7516 466586 261778 192473 328809 356213 409288 328343 273233 319012 125623 56006 154165
7505 154165 271367 279223 275220 201229 7297 -126964 83297 190383 369182 472018 454787
7494 454787 281656 295670 170837 94533 271493 427591 598436 424963 285854 -46340
$$ packed form
7569B64149m4151J03672M6563k0563m5851j8179r3248K6476J15940l7854m9367
7558B47587J46020p6591R488l6258r0917J44455K9724j5353K8253k9994j35406
7547B21008j25660N4556n8325J21808K09748O9887j07143m2912j30675L5311L06794
7536E54397L36606K51198J96639K28386K03549K91884J55862q9575q5825k15248
7526A827873k76130l43919n90234j95956k42341k8483J02112K85300J24540j96176
7516D66586k04808o9305J36336K7404N3075q0945n5110M5779j93389o9617R8159
7505A54165J17202P856m003p3991j93932j34261K10261J07086J78799J02836j7231
7494D54787j73131J4014j24833p6304J76960J56098J70845j73473j39109l32194
$$ plain form
7484 -46340 -101714 -55694 86874 171881 208725 265219 158423 277803 316768 285075 359554
7473 359554 331039 305091 345759 280119 215003 329881 344994 389672 471686 543393 435833
7462 435833 175251 79932 -120686 -14453 280141 230572 296851 346759 162521 131447 144561
7451 144561 160058 331856 224163 143315 106557 -32459 -4147 56227 163116 318554 323391
7440 323391 234647 194816 109325 76108 210973 388317 395133 435308 442095 208839 63583
7429 63583 16072 125191 265287 258624 186972 223163 155125 -195275 -212253 -3283 87651
7418 87651 257544 371147 306609 324632 315804 125949 101613 98157 52030 81375 138435 214678
7406 214678 293256 399271 139831 15584 154984 89880 201970 250986 181273 233507 256742
$$ packed form
7484d6340n5374M6020J42568Q5007L6844N6494j06796J19380L8965l1693P4479
7473C59554k8515k5948M0668o5640o5116J14878J5113M4678Q2014P1707j07560
7462D35833k60582r5319k00618J06233K94594m9569O6279M9908j84238l1074J3114
7451A44561J5497J71798j07693q0848l6758j39016K8312O0374J06889J55438M837
7440C23391q8744l9831q5491l3217J34865J77344O816M0175O787k33256j45256
7429F3583m7511J09119J40096o663p1652L6191o8038l50400j6978K08970R0934
7418H7651J69893J13603o4538J8023q828j89855k4336l456m6127K9345N7060P6243
7406B14678P8578J06015k59440j24247J39400o5104J12090M9016o9713N2234K3235
$$ plain form
7395 256742 199950 273471 212096 114404 364466 298271 146534 99553 75833 -9976 4317
7384 4317 82386 125358 140878 118019 15628 31615 133983 133081 154342 129553 214218 400862
7372 400862 309957 196471 316929 211962 253665 230161 284735 193665 147874 -57865 12706
7361 12706 -56626 -139412 127870 291262 241427 328879 392747 58245 44076 -36570 8042
7350 8042 202436 351223 322963 234645 127241 85483 170139 194265 94086 376047 335023
7339 335023 201262 120838 40126 79114 273363 412255 379787 448676 198346 76126 104544
7328 104544 -20200 -5221 218128 129583 213153 117976 -116208 -212789 -24479 169944 252737
7317 252737 362115 313737 248720 348406 228377 216068 328290 188298 272582 244017 195271
$$ packed form
7395B56742n6792P3521o1375r7692K50062o6195j51737m6981k3720q5809J4293
7384D317P8069M2972J5520k2859j02391J5987J02368r02K1261k4789Q4665J86644
7372D00862r0905j13486J20458j04967M1703k3504N4574r1070m5791k05739P0571
7361A2706o9332q2786K67282J63392m9835Q7452O3868l34502j4169q0646M4612
7350H042J94394J48787k8260q8318j07404m1758Q4656K4126j00179K81961m1024
7339C35023j33761q0424q0712L8988J94249J38892l2468O8889k50330j22220K8418
7328A04544j24744J4979K23349q8545Q3570r5177k34184r6581J88310J94423Q2793
7317B52737J09378m8378o5017R9686j20029j2309J12222j39992Q4284k8565m8746
$$ plain form
7306 195271 24302 13589 -78698 -153955 -146121 -19872 302884 411115 385566 351801 105903
7295 105903 31270 -49680 -83235 6320 162937 160440 218546 371220 268485 -86105 -196156
7284 -196156 -189451 -238049 -58465 56788 189554 326420 320515 249254 294747 155983 239827
7273 239827 334470 324859 297372 296646 150582 115884 186849 198324 142751 190689 130646 18148
7261 18148 -70855 -92612 -49023 -76649 96055 61294 130025 109339 97083 111020 216700
7250 216700 294147 356881 251331 127434 163247 190282 310007 415323 550272 557180 378281
7239 378281 266176 332594 345235 247557 74423 -5702 111601 244369 104992 32559 -7441
7228 -7441 57672 117996 100319 -60179 -95555 -13572 -30384 22982 169816 284865 391109
$$ packed form
7306A95271j70969j0713r2287p5257P834J26249L22756J08231k5549l3765k45898
7295A05903p4633q0950l3555Q9555J56617k497N8106J52674j02735l54590j10051
7284a96156O705m8598J79584J15253J32766J36866n905p1261M5493j38764Q3844
7273B39827R4643r611k7487p26j46064l4698P0965J1475n5573M7938o0043j12498
7261A8148q9003k1757M3589k7626J72704l4761O8731k0686j2256J3937J05680
7250B16700P7447O2734j05550j23897L5813K7035J19725J05316J34949O908j78899
7239C78281j12105O6418J2641r7678j73134q0125J17303J32768j39377p2433m0000
7228g441O5113O0324j7677j60498l5376Q1983j6812N3366J46834J15049J06244
$$ plain form
7217 391109 400739 163113 94455 91254 254413 333217 301944 168393 329033 331888 236608
7206 236608 134454 21886 187797 442451 392152 275387 293170 18583 41992 263491
7196 263491 287476 174378 368789 213820 34771 48579 29908 71997 204578 7213
7186 7213 -64455 166174 -16003 -186748 170387 306027 425933 383197 330184 367374 146560
7175 146560 -121831 111147 365158 447547 643109 553560 354472 224418 183912 -128334
7165 -128334 -22449 117737 132438 48219 253334 231761 166901 123438 93276 204109 310111
7154 310111 202981 279828 367283 28500 100405 268612 307901 378038 369332 227461 323585
7143 323585 358495 338180 388445 300354 204542 246871 117373 143357 197023 157679 156965 271042
$$ packed form
7217C91109R630k37626o8658l201J63159P8804l1273j33551J60640K855r5280
7206B36608j02154j12568J65911K54654n0299j16765J7783k74587K3409K21499
7196B63491K3985j13098J94411j54969j79049J3808j8671M2089J32581j97365
7186G213p1668K30629j82177j70745L57135J35640J19906m2736n3013L7190k20814
7175A46560k68391K32978K54011Q2389J95562q9549j99088j30054m0506l12246
7165a28334J05885J40186J4701q4219K05115k1573o4860m3463l0162J10833J06002
7154C10111j07130P6847Q7455l38783P1905J68207L9289P0137q706j41871R6124
7143C23585L4910k0315N0265q8091r5812M2329j29498K5984N3666l9344p14J14077
$$ plain form
7131 271042 144859 192701 145501 -79995 -171064 -59304 84861 320494 490664 287997
7121 287997 303741 201821 120345 129645 342442 403009 549333 539363 372636 194551 313660
7110 313660 358877 435756 352677 117743 228448 -10494 -82254 59286 171245 318192
7100 318192 598744 542836 183223 -31163 -82566 -116868 98958 262183 211730 231829 278262
7089 278262 260025 50753 -217459 -92281 33828 257386 419733 431599 338143 266653
7079 266653 423200 319516 401674 498166 484039 400666 373634 133121 272484 404830 424639
7068 424639 321997 148583 12857 -39022 -117801 -93572 203231 226202 -28164 -115004 -258066
7057 -258066 -341815 -93984 213662 453331 553277 489664 271839 109267 -75495 56545
$$ packed form
7131B71042j26183M7842m7200k25496r1069J11760J44165K35633J70170k02667
7121B87997J5744j01920q1476R300K12797O0567J46324r970j66727j78085J19109
7110C13660M5217P6879q3079k34934J10705k38942p1760J41540J11959J46947
7100C18192K80552n5908l59613k14386n1403l4302K15826J63225n0453K0099M6433
7089B78262j8237k09272k68212J25178J26109K23558J62347J1866r3456p1490
7079B66653J56547j03684Q2158R6492j4127q3373k7032k40513J39363J32346J9809
7068D24639j02642j73414j35726n1879p8779K4229K96803K2971k54366q6840j43062
7057b58066q3749K47831L07646K39669R9946o3613k17825j62572j84762J32040
$$ plain form
7047 56545 321451 472887 418638 548780 503665 213517 56828 123465 275965 539279
7037 539279 507553 361238 245276 24588 -86412 -106057 59491 210306 332463 129736
7027 129736 29346 117250 -36984 17504 163287 225654 326901 273851 188121 186722 -8944
7016 -8944 73274 344844 304858 391968 550287 413396 285447 268063 274648 333420 341660 288825
7004 288825 286137 331456 242716 115540 138963 58195 58463 48307 -34319 45919 255411 257584
6992 257584 115160 693 -67847 -212292 -209363 -29187 250362 516088 426787 502424 442167
6981 442167 261597 336203 216819 218666 461419 447654 313161 224988 190026 179902 22774
6970 22774 26181 130959 232412 170045 42409 43609 -4837 -243354 -108356 109438 236261
$$ packed form
7047E6545K64906J51436n4249J30142m5115k90148j56689O6637J52500K63314
7037E39279l1726j46315j15962k20688j11000j9645J65548J50815J22157k02727
7027A29736j00390Q7904j54234N4488J45783O2367J01247n3050q5730j399j95666
7016h944Q2218K71570l9986Q7110J58319j36891j27949j7384O585N8772Q240n2835
7004B88825k688M5319q8740j27176K3423q0768K68j0156q2626Q0238K09492K173
6992B57584j42424j14467o8540j44445K929J80176K79549K65726q9301P5637o0257
6981D42167j80570P4606j19384J847K42753j3765j34493q8173l4962j0124j57128
6970B2774L407J04778J01453o2367j27636J200m8446k38517J34998K17794J26823
$$ plain form
6959 236261 321689 217589 198009 143288 -15786 -90535 95573 261596 95746 72887 55709
6948 55709 86301 252186 401484 542018 634035 518943 356942 362949 191202 327086 420998
6937 420998 424163 457524 429031 175616 108721 117005 -33884 -115714 -25316 -57408 -52682 8805
6925 8805 79526 266323 266564 182322 362364 181183 -116276 -5453 174278 285873 378817
6914 378817 476950 376572 414437 360819 113523 176435 38100 197845 312130 309732 495656
6903 495656 486350 370106 227228 287353 238738 63249 60416 52983 240773 331863 101731
6892 101731 16267 118598 21069 38711 259400 140964 167395 356157 294683 149445 228161
6881 228161 183570 179743 385569 567731 593470 530234 323798 235143 294889 59341 61374
$$ packed form
6959B36261Q5428j04100j9580n4721j59074p4749J86108J66023j65850k2859j7178
6948E5709L0592J65885J49298J40534R2017j15092j62001O007j71747J35884R3912
6937D20998L165L3361k8493k53415o6895Q284j50889q1830R0398l2092M726O1487
6925H805P0721J86797K41q4242J80042j81181k97459J10823J79731J11595R2944
6914C78817R8133j00378L7865n3618k47296O2912j38335J59745J14285k398J85924
6903D95656r306j16244j42878O0125m8615j75489k833p433J87790R1090k30132
6892A01731q5464J02331r7529J7642K20689j18436K6431J88762o1474j45238P8716
6881B28161m4591l827K05826J82162K5739o3236k06436q8655N9746k35548K033
$$ plain form
6870 61374 151755 152351 137956 188279 173500 59507 72053 68493 182451 306292 333190 218320
6858 218320 116465 -83708 -1657 198876 272267 437069 496474 471009 447166 244915 193718
6847 193718 273377 311084 380022 489959 295911 216368 231069 8938 -65985 170090 302981
6836 302981 422535 395152 230292 107669 -109965 -23936 24023 142083 214941 442411
6826 442411 566656 289308 166859 204550 -58813 -108497 70000 218233 412664 447677
6816 447677 234716 150914 213018 186415 216182 250251 305618 158662 147849 173202 318549
6805 318549 332142 159260 145003 380967 256786 39931 -41178 -140599 -25193 18987 -69445
6794 -69445 135522 379360 232120 150101 245172 197642 29779 174373 228988 234334 341967
$$ packed form
6870F1374R0381N96j4395N0323j4779j13993J2546l560J13958J23841K6898j14870
6858B18320j01855k00173Q2051K00533P3391J64802N9405k5465k3843k02251n1197
6847A93718P9659L7707O8938J09937j94048p9543J4701k22131p4923K36075J32891
6836C02981J19554k7383j64860j22623k17634Q6029M7959J18060P2858K27470
6826D42411J24245k77348j22449L7691k63363m9684J78497J48233J94431L5013
6816D47677k12961q3802O2104k6603K9767L4069N5367j46956j0813K5353J45347
6805C18549J3593j72882j4257K35964j24181k16855q1109r9421J15406M4180q8432
6794f9445K04967K43838j47240q2019R5071m7530j67863J44594N4615N346J07633
$$ plain form
6783 341967 442828 434692 451050 381483 262537 190131 226797 16188 132259 132049 60601
6772 60601 17832 -28749 78792 34707 153689 64777 160787 247990 370494 287956 281031
6761 281031 185668 248312 318393 349790 313326 319199 222018 183880 59097 -4586 -45750 152895
6749 152895 285409 416872 460755 359048 271013 225168 191810 134145 320319 118718 290979
6738 290979 483154 555832 512572 523920 207430 52952 -82068 -191910 -134053 30881
6728 30881 -33303 38814 134315 13814 140674 247047 138178 101037 103076 312655 364876
6717 364876 255898 264630 333679 475570 348274 406003 280971 237260 254479 368774 352636
6706 352636 393447 280107 192078 59496 158474 338039 233705 221365 163878 167179 -50887
$$ packed form
6783C41967J00861q136J6358o9567j18946p2406L6666k10609J16071k10p1448
6772F0601m2769m6581J07541m4085J18982q8912R6010Q7203J22504q2538o925
6761B81031r5363O2644P0081L1397l6464N873r7181l8138j24783o3683m1164J98645
6749A52895J32514J31463M3883j01707q8035m5845l3358n7665J86174k01601J72261
6738B90979J92175P2678m3260J1348l16490j54478j35020j09842N7857J64934
6728C0881o4184P2117R5501j20501J26860J06373j08869l7141K039K09579N2221
6717C64876j08978Q732O9049J41891j27296N7729j25032m3711J7219J14295j6138
6706C52636M0811j13340q8029j32582R8978J79565j04334j2340n7487L301k18066
$$ plain form
6695 -50887 -98585 -63142 80694 134303 354637 380149 574651 429502 317466 205502 207668
6684 207668 91506 210178 409159 423288 645856 372520 240345 322319 233665 105087
6674 105087 444636 503567 376259 418869 207992 -155672 17931 263270 192485 275900
6664 275900 399191 145025 115208 90947 9793 166135 133603 79306 154905 215487 47171
6653 47171 178265 172698 124506 336479 568860 534972 511801 370499 193156 131551 178099
6642 178099 346275 496207 537507 487640 311569 54824 -162380 -187717 -14889 42632
6632 42632 241321 198437 178996 111991 170884 161637 251946 106524 265644 295977 329965
6621 329965 416697 307343 354437 496547 487424 447354 479867 250684 252276 323514 191246
$$ packed form
6695e0887m7698L5443J43836N3609K20334K5512J94502j45149j12036j11964K166
6684B07668j16162J18672J98981J4129K22568k73336j32175Q1974q8654j28578
6674A05087L39549N8931j27308M2610k10877l63664J73603K45339p0785Q3415
6664B75900J23291k54166k9817k4261q1154J56342l2532n4297P5599O0582j68316
6653D7171J31094n567m8192K11973K32381l3888k3171j41302j77343o1605M6548
6642A78099J68176J49932M1300m9867j76071k56745k17204k5337J72828N7521
6632D2632J98689m2884j9441o7005N8893r247R0309j45422J59120L0333L3988
6621C29965Q6732j09354M7094J42110r123m0070L2513k29183J592P1238j32268
$$ plain form
6610 191246 303699 419788 323198 356306 356486 246109 112689 237291 132532 131922 393661
6599 393661 264557 130083 239407 193930 144547 227165 177874 233870 447730 628687 473120
6588 473120 439558 212975 35239 -138141 -75463 180800 332626 605447 789021 540256
6578 540256 171271 -33298 -82617 42792 195812 509934 741805 749805 632865 412521
6568 412521 50072 -213149 -174838 209745 363304 439787 331254 199790 -19665 -140341
6558 -140341 -201128 -95079 141504 323510 436661 287234 -5973 -181022 -116868 182252
6548 182252 689138 976415 751026 507419 265141 -75448 -124282 154565 277532 362498
6538 362498 336821 207312 139352 -179402 -263343 -134911 -14912 246570 444630 458775
$$ packed form
6610A91246J12453J16089r6590L3108J80j10377j33420J24602j04759o10K61739
6599C93661j29104j34474J09324m5477m9383Q2618m9291N5996K13860J80957j55567
6588D73120l3562k26583j77736j73380O2678K56263J51826K72821J83574k48765
6578E40256l68985k04569m9319J25409J53020L14122K31871Q000j16940k20344
6568D12521l62449k63221L8311L84583J53559P6483j08533j31464k19455j20676
6558a40341o0787J06049K36583J82006J13151j49427k93207j75049O4154K99120
6548A82252N06886K87277k25389k43607k42278l40589m8834K78847J22967Q4966
6538C62498k5677j29509o7960l18754q3941J28432J19999K61482J98060J4145
$$ plain form
6528 458775 185029 107854 50937 -7891 282202 355315 467595 702562 548320 512398 435035
6517 435035 267451 92519 126213 66952 167139 328156 369750 550980 581189 228494
6507 228494 -3985 -20085 -73484 55258 68450 322178 636812 684601 375060 119252
6497 119252 8258 22513 113771 468020 535400 464039 128766 -97942 -138322 -229603 -31272
6486 -31272 322590 492851 568580 515343 147074 -90798 69791 248911 493301 757763
6476 757763 752257 600564 296725 13102 -78512 201530 360445 473553 422428 350779 117194
6465 117194 11993 -148027 -78795 233018 328075 259482 261193 150129 143959 316632 232672
6454 232672 391255 355013 277469 423313 551234 372041 451850 573117 318581 96718
$$ packed form
6528D58775k73746p7175n6917n8828K90093P3113J12280K34967j54242l5922p7363
6517D35035j67584j74932L3694n9261J00187J61017M1594J81230L0209l52695
6507B28494k32479j6100n3399J28742J3192K53728L14634M7789l09541k55808
6497A19252j10994J4255R1258L54249O7380p1361l35273k26708m0380r1281J98331
6486c1272L53862J70261P5729n3237l68269k37872J60589J79120K44390K64462
6476G57763n506j51693l03839k83623r1614K80042J58915J13108n1125p1649k33585
6465A17194j05201j60020O9232L11813R5057o8593J711j11064o170J72673q3960
6454B32672J58583l6242p7544J45844J27921j79193P9809J21267k54536k21863
$$ plain form
6444 96718 97052 146963 272064 279417 227135 257106 224966 151213 66648 174315 242701 247116
6432 247116 335322 479081 505762 554832 344243 435319 359390 263302 231989 305005 419922
6421 419922 357796 174913 90182 166166 163053 137170 159450 253166 327744 300401 208551 334693
6409 334693 435974 169076 98202 222938 187753 576310 562298 433109 318278 32398
6399 32398 -180063 -209530 -110643 113319 284900 491915 479848 456636 345616 18091 -127511
6388 -127511 96452 189902 360253 573951 498559 568055 525685 497677 477657 373652 251129
6377 251129 377389 502328 405520 273149 247708 323797 209962 164663 77560 117523 197481
6366 197481 227572 206499 198244 104974 -21376 121655 468870 578894 630851 576408 385899
$$ packed form
6444I6718L34M9911J25101P353n2282K9971l2140p3753q4565J07667O8386M415
6432B47116Q8206J43759K6681M9070k10589R1076p5929r6088l1313P3016J14917
6421D19922o2126j82883q4731P5984l113k5883K2280R3716P4578k7343r1850J26142
6409C34693J01281k66898p0874J24736l5185L88557j4012j29189j14831k85880
6399C2398k12461k9467R8887K23962J71581K07015j2067k3212j11020l27525j45602
6388a27511K23963R3450J70351K13698p5392O9496m2370k8008k0020j04005j22523
6377B51129J26260J24939r6808j32371k5441P6089j13835m5299q7103L9963P9958
6366A97481L0091k1073q255r3270j26350J43031L47215J10024N1957n4443j90509
$$ plain form
6355 385899 245570 232778 209366 410074 737471 724642 592784 576722 365015 -10725
6345 -10725 -127083 -42716 85693 294435 577150 573285 311437 -83757 -256129 -52417
6335 -52417 170793 528235 787228 802759 636347 329687 255965 240915 320751 490158 563151
6324 563151 495628 418304 245240 93155 103778 279195 489682 484696 273172 375797 320596
6313 320596 298990 286121 279042 238765 299914 220556 269018 443047 481890 611198 471920
6302 471920 309683 84416 -81791 -58336 59987 297513 547983 608579 462840 248168
6292 248168 120257 43110 61513 176977 392070 610737 582523 449647 359220 387304 443531
6281 443531 464854 460794 360962 309291 312545 289950 218277 166672 206740 104657 76018 27541
$$ packed form
6355C85899j40329j2792k3412K00708L27397j2829j31858j6062k11707l75740
6345a0725j16358Q4367J28409K08742K82715l865k61848l95194j72372K03712
6335e2417K23210L57442K58993J5531j66412l06660p3722j5050P9836J69407P2993
6324E63151o7523p7324j73064j52085J0623J75417K10487m986k11524J02625n5201
6313C20596k1606j2869p079m0277O1149p9358M8462J74029L8843J29308j39278
6302D71920j62237k25267j66207K3455J18323K37526K50470O0596j45739k14672
6292B48168j27911p7147J8403J15464K15093K18667k8214j32876r0427K8084N6227
6281D43531K1323m060r9832n1671L254k2595p1673n1605M0068j02083k8639m8477
$$ plain form
6269 27541 101477 351 -115112 -118731 -1032 217905 342242 435402 609325 733516 683049
6258 683049 572111 644924 619281 471205 458101 346523 382886 462421 338605 268234 208694
6247 208694 54929 -88970 -114648 -72354 9269 313640 293166 424442 531682 430210
6237 430210 300496 378886 511964 579480 627426 513033 430494 490424 409681 195714 278669
6226 278669 292995 313085 319603 210730 199488 262814 144466 192849 316617 359340 432576
6215 432576 586363 574763 427812 327790 214556 179524 225038 373134 533501 727826
6205 727826 709571 409959 69072 -11274 15632 134949 292098 469200 528791 503995 299520
6194 299520 302153 235887 367214 513554 592217 590351 561734 456900 455816 344675 271116
$$ packed form
6269B7541P3936j01126j15463l619J17699K18937J24337R3160J73923J24191n0467
6258F83049j10938P2813k5643j48076j3104j11578L6363P9535j23816p0371n9540
6247B08694j53765j43899k5678M2294Q1623L04371k0474J31276J07240j01472
6237D30210j29714P8390J33078O7516M7946j14393q2539N9930q0743k13967Q2955
6226B78669J4326K0090O518j08873j1242O3326j18348M8383J23768M2723P3236
6215D32576J53787j1600j46951j00022j13234l5032M5514J48096J60367J94325
6205G27826j8255k99612l40887q0346K6906J19317J57149J77102N9591k4796k04475
6194B99520K633o6266J31327J46340P8663j866k8617j04834j084j11141p3559
$$ plain form
6183 271116 487138 459458 384843 296388 164147 27751 237353 212638 219871 371882 394068
6172 394068 193280 77715 -53168 -88168 289116 488183 575200 646953 538474 278005
6162 278005 369296 590336 690978 847843 802511 359981 246878 123421 54975 218677
6152 218677 506748 475250 313092 241117 33765 -27651 14556 159133 419140 509284 381823
6141 381823 531180 476350 455899 476610 589027 567332 614774 615157 480658 427870 367559
6130 367559 294673 476152 316901 421466 323415 289602 356567 368579 473114 509147 499002
6119 499002 408657 492110 447519 527150 561230 482456 336936 401153 338329 247572 364358
6108 364358 367482 285451 374570 314023 182372 48639 51533 2058 307802 533395 696700
$$ packed form
6183B71116K16022k7680p4615q8455j32241j36396K09602k4715P233J52011K2186
6172C94068k00788j15565j30883l5000L77284J99067Q7017P1753j08479k60469
6162B78005R1291K21040J00642J56865m5332m42530j13103j23457o8446J63702
6152B18677K88071l1498j62158p1975k07352o1416M2207J44577K60007R0144j27461
6141C81823J49357n4830k0451K0711J12417k1695M7442L83j34499n2788o0311
6130C67559p2886J81479j59251J04565r8051l3813O6965J2012J04535L6033j0145
6119D99002r0345Q3453m4591P9631L4080p8774j45520O4217o2824r0757J16786
6108C64358L124q2031Q9119o0547j31651j33733K894m9475L05744K25593J63305
$$ plain form
6097 696700 864998 843262 677412 525467 446408 373623 544966 519118 612656 560147 454369
6086 454369 163067 -10830 30856 23182 159570 310361 289014 160607 109305 131883 246196
6075 246196 282415 508333 585130 602971 710921 630296 464076 494079 460000 530098 521928
6064 521928 419646 399159 523471 583074 559341 568579 397855 272752 337050 328855 169740
6053 169740 235411 185132 350720 368139 196355 145170 333897 401504 446292 559508 449899
6042 449899 399480 412461 408454 412297 545267 611975 622133 434834 398931 443391 372727 402109
6030 402109 273298 199400 350147 409765 481004 541823 710185 688336 573850 630804 551307
6019 551307 477905 637685 571531 654001 776367 527532 226736 207031 45935 186981
$$ packed form
6097F96700J68298k1736j65850j51945p9059p2785J71343k5848R3538n2509j05778
6086D54369k91302j73897M1686p674J36388J50791k1347j28407n1302K2578J14313
6075B46196L6219K25918P6797J7841J07950q0625j66220L0003l4079P0098q170
6064E21928j02282k0487J24312N9603k3733R238j70724j25103O4298q195j59115
6053A69740O5671n0279J65588J7419j71784n1185J88727O7607M4788J13216j09609
6042D49899n0419J2981m007L843J32970O6708J0158j87299l5903M4460p0664K9382
6030D02109j28811p3898J50747N9618P1239O0819J68362k1849j14486N6954p9497
6019E51307p3402J59780o6154Q2470J22366k48835l00796j9705j61096J41046
$$ plain form
6009 186981 400317 376125 533346 477317 239514 64661 251696 125537 372553 750394
5999 750394 835500 888793 976477 660065 554832 598445 522908 629401 831277 716178 869241
5988 869241 640433 336515 222404 114635 239255 496346 715047 423344 343622 389280
5978 389280 201461 216128 420752 611686 972294 979919 900897 813413 605140 548123 717349
5967 717349 668486 674332 722611 698883 582725 468785 371698 438627 564308 575966 798040
5956 798040 562717 368631 258412 280635 258528 353506 519136 487193 422148 385954 88482
5945 88482 246632 475974 385145 730562 625996 465085 398448 417937 239690 505619
5935 505619 583455 705315 588732 520671 354523 523953 616495 595202 748594 793765 574032
$$ packed form
6009A86981K13336k4192J57221n6029k37803j74853J87035j26159K47016L77841
5999G50394Q5106N3293Q7684l16412j05233M3613p5537J06493K01876j15099J53063
5988H69241k28808l03918j14111j07769J24620K57091K18701k91703p9722M5658
5978C89280j87819J4667K04624J90934L60608P625p9022q7484k08273n7017J69226
5967G17349m8863N846M8279k3728j16158j13940r7087O6929J25681J1658K22074
5956G98040k35323j94086j10219K2223k2107R4978J65630l1943o5045l6194k97472
5945H8482J58150K29342r0829L45417j04566j60911o6637J9489j78247K65929
5935E05619P7836J21860j16583o8061j66148J69430R2542k1293J53392M5171k19733
$$ plain form
5924 574032 460047 388231 400995 394667 545693 803176 862301 815534 650895 490763 330227
5913 330227 317553 160333 274764 315969 437624 306830 643193 498044 315746 413681
5903 413681 626486 679330 846646 883416 651539 675327 679255 739011 810676 676461 616981
5892 616981 715042 633786 536697 489398 483917 179579 220144 281240 320947 387264 580948
5881 580948 508695 767105 641810 370049 349430 279159 418635 650163 901949 1070396
5871 1070396 943890 574680 296195 206847 222456 229291 680445 756292 763668 646599 569153
5860 569153 513347 598058 581966 715564 631198 658254 764139 615920 534336 706158 681455
5849 681455 602674 727853 650159 427712 414883 315656 252081 684676 750125 662741 682461
$$ packed form
5924E74032j13985p1816J2764o328J51026K57483N9125m6767j64639j60132j60536
5913C30227j2674j57220J14431M1205J21655j30794L36363j45149j82298R7935
5903D13681K12805N2844J67316L6770k31877K3788L928N9756P1665j34215n9480
5892F16981R8061q1256r7089m7299n481l04338M0565O1096L9707O6317J93684
5881E80948p2253K58410j25295k71761k0619p0271J39476K31528K51786J68447
5871A070396j26506l69210k78485q9348J5609O835M51154P5847P376j17069p7446
5860E69153n5806Q4711j6092J33598q4366K7056J05885j48219q1584J71822k4703
5849F81455p8781J25179p7694k22447j2829r9227o3575M32595O5449q7384J9720
$$ plain form
5838 682461 850543 694581 755174 592454 501816 779812 830647 627374 744808 715211
5828 715211 592243 772978 639258 616073 471889 479395 439083 539991 542316 790137 585846
5817 585846 470516 541885 411604 169667 233008 393283 447886 646567 680167 610849 522323
5806 522323 488160 623267 879874 842803 956839 901929 732505 494526 802932 927992
5796 927992 909348 981252 1088840 792384 452856 245178 252270 347679 324646 466217 583404
5785 583404 646712 704016 736952 498912 371479 535890 602324 530974 850321 821349 849577
5774 849577 985693 876640 712686 695692 724606 667835 426408 686953 870092 780011
5764 780011 857819 834619 849609 785644 914244 855447 911489 847337 886211 815137 736029
$$ packed form
5838F82461J68082j55962O0593j62720r0638K77996N0835k03273J17434k9597
5828G15211j22968J80735j33720k3185j44184P506m0312J00908K325K47821k04291
5817E85846j15330P1369j30281k41937O3341J60275N4603J98681L3600o9318q8526
5806E22323l4163J35107K56607l7071J14036n4910j69424k37979L08406J25060
5796I27992j8644P1904J07588k96456l39528k07678P092R5409k3033J41571J17187
5785E83404O3308N7304L2936k38040j27433J64411O6434p1350L19347k8972K8228
5774H49577J36116j09053j63954j6994K8914n6771k41427K60545J83139r0081
5764G80011P7808k3200J4990o3965J28600n8797N6042o4152L8874p1074p9108
$$ plain form
5753 736029 746782 875705 912127 721960 504727 527360 330623 502354 686251 668236
5743 668236 771006 973339 980776 800568 951367 877226 1044581 1068059 889123 987710 991316
5732 991316 817683 783255 909686 1078182 1151941 1226037 992404 823921 688215 502555
5722 502555 499605 788291 888782 1110690 1200628 873002 826116 835463 756984 825428 980969
5711 980969 981940 1034947 1021247 907605 1010618 1113519 1056651 1119389 1284430 1255978 1210017
5700 1210017 1157275 1079136 1087241 1158707 1321102 1511045 1328176 1133499 1089000 988030 806965
5689 806965 1071086 1227640 1225779 1227181 1116716 952053 987387 984457 983681 1191967 1207282 1379814
5677 1379814 1288682 1120491 1174797 1391493 1106635 1211202 1499245 1339110 1190288 1239213
$$ packed form
5753G36029J0753J28923L6422j90167k17233K2633j96737J71731J83897j8015
5743F68236J02770K02333P437j80208J50799p4141J67355K3478j78936R8587L606
5732I91316j73633l4428J26431J68496P3759P4096k33633j68483j35706j85660
5722E02555k950K88686J00491K21908Q9938l27626m6886R347p8479O8444J55541
5711I80969R71N3007j3700j13642J03013J02901n6868O2738J65041k8452m5961
5700A210017n2742p8139Q105P1466J62395J89943j82869j94677m4499j00970j81065
5689H06965K64121J56554j861J402j10465j64663L5334k930p76K08286J5315J72532
5677A379814r1132j68191N4306K16696k84858J04567K88043j60135j48822M8925
$$ plain form
5667 1239213 1167411 1333845 1732314 1692209 1470883 1433149 1198084 1111818 1163710 1234580 1408747
5656 1408747 1602062 1476525 1479053 1452459 1226408 1131926 1219863 1395278 1421578 1510067 1445440
5645 1445440 1364341 1195225 1308141 1528644 1532530 1583132 1672397 1643942 1534482 1621429 1630404
5634 1630404 1481483 1699557 1960234 2112720 2130357 2060352 1776973 1545001 1326287 1260736
5624 1260736 1466758 1680863 1928751 1968926 1775600 1585511 1565646 1615224 1475197 1681364
5614 1681364 1867861 1814521 1778213 1799281 1853552 1914812 1931460 1889686 1932120 2021939 2011321
5603 2011321 2004038 2054221 1945150 1993344 2022810 2013056 1886717 1978427 1988612 1808480 1853229
5592 1853229 1845599 1902177 2015915 2165174 2400701 2511398 2394484 2315449 2257968 2087714
$$ packed form
5667A239213p1802J66434L98469m0105k21326l7734k35065q6266N1892P0870J74167
5656A408747J93315j25537K528k6594k26051r4482Q7937J75415K6300Q8489o4627
5645A445440q1099j69116J12916K20503L886N0602Q9265k8455j09460Q6947Q975
5634A630404j48921K18074K60677J52486J7637p0005k83379k31972k18714o5551
5624A260736K06022K14105K47888M0175j93326j90089j9865M9578j40027K06167
5614A681364J86497n3340l6308K1068N4271O1260J6648m1774M2434Q9819j0618
5603B011321p283N0183j09071M8194K9466r754j26339R1710J0185j80132M4749
5592A853229p630N6578J13738J49259K35527J10697j16914p9035n7481j70254
$$ plain form
5582 2087714 1904540 1922963 2112319 2272280 2481758 2775946 2609563 2397578 2352775 2085965
5572 2085965 2038209 2240350 2452945 2805560 2791853 2633716 2622658 2569725 2376232 2342174
5562 2342174 2451366 2581284 2674150 2566071 2420160 2620177 2733437 2707506 2840493 3074616
5552 3074616 3050863 2928492 2645128 2550109 2765580 2951033 3216416 3258586 3252383 3272055 3112232
5541 3112232 3028104 3324040 3402203 3346278 3638983 3698468 3552649 3617486 3709034 3604038 3793101
5530 3793101 3957991 3713603 3546994 3503974 3542053 3707798 3915628 3955285 4252667 4154616
5520 4154616 3942725 3987142 4087818 4006848 4265671 4514244 4429013 4581759 4478293 4101786
5510 4101786 4159383 4224086 4416406 4766250 4904943 4682711 4726645 4491239 4221387 4553543
$$ packed form
5582B087714j83174J8423J89356J59961K09478K94188j66383k11985m4803k66810
5572B085965m7756K02141K12595L52615j3707j58137j1058n2933j93493l4058
5562B342174J09192J29918R2866j08079j45911K00017J13260k5931J32987K34123
5552C074616k3753j22371k83364r5019K15471J85453K65383M2170o203J9672j59823
5541C112232q4128K95936P8163n5925K92705N9485j45819O4837R1548j04996J89063
5530C793101J64890k44388j66609m3020L8079J65745K07830L9657K97382r8051
5520D154616k11891M4417J00676q0970K58823K48573q5231J52746j03466l76507
5510D101786N7597O4703J92320L49844J38693k22232M3934k35406k69852L32156
$$ plain form
5500 4553543 4789662 4774297 5014243 4964899 4779604 4898760 4979112 5188255 5655867 5828082
5490 5828082 5860423 5783798 5595585 5585885 5642345 5696493 5703006 5903723 5945419 6121875 6270232
5479 6270232 6281906 6454859 6899326 6901324 6999776 6909548 6711852 6669133 6826475 7274938 7720643
5468 7720643 7879709 7829285 7890039 7647474 7389758 7647052 7923960 8188353 8655263 8829287
5458 8829287 8801008 8940736 8993269 9018361 9271331 9450977 9702764 9985764 10078993 10054269
5448 10054269 10209189 10403470 10653994 11036175 11279045 11446498 11856725 12086649 12186029 12374013
5438 12374013 12665945 13036899 13212969 13662609 14136030 14382615 14472215 14696938 15158024 15369282
5428 15369282 15612962 16003135 16381866 16839990 17212881 17727939 18412816 18841099 19292019
$$ packed form
5500D553543K36119j5365K39946m9344j85295J19156Q0352K09143M67612J72215
5490E828082L2341p6625j88213r700N6460N4148O513K00717M1696J76456J48357
5479F270232J1674J72953M44467J998R8452r0228j97696m2719J57342M48463M45705
5468G720643J59066n0424O0754k42565k57716K57294K76908K64393M66910J74024
5458H829287k8279J39728N2533K5092K52970J79646K51787K83000R3229k4724
5448A0054269J54920J94281K50524L82181K42870J67453M10227K29924R9380J87984
5438A2374013K91932L70954J76070M49640M73421K46585Q9600K24723M61086K11258
5428A5369282K43680L90173L78731M58124L72891N15058O84877M28283M50920
$$ plain form
5419 19292019 19784439 20226842 20805073 21464022 22148968 22932036 23671178 24374132 24972199
5410 24972199 25850386 26684805 27483553 28537634 29527926 30515178 31743366 32753206 33846196
5401 33846196 35371508 36932070 38599812 40195676 41689006 43520319 45518681 47133902
5393 47133902 49430567 52008486 54666757 57377338 60478602 63600977 66973377 70665579
5385 70665579 74500017 78933168 83742010 88842602 94697317 101101143 108034234 115888007
5377 115888007 124279978 133453206 143863006 155496029 168376828 182617136 198541602
5370 198541602 216487778 235924331 256970945 279718627 303811526 328492701 353112747
5363 353112747 376194232 396407740 412846516 424332743 429653603 428838953 422219355 409957041
$$ packed form
5419A9292019M92420M42403N78231O58949O84946P83068P39142P02954N98067
5410B4972199Q78187Q34419P98748J054081R90292R87252J228188J009840J092990
5401C3846196J525312J560562J667742J595864J493330J831313J998362J615221
5393D7133902K296665K577919K658271K710581L101264L122375L372400L692202
5385G0665579L834438M433151M808842N100592N854715O403826O933091P853773
5377A15888007Q391971R173228J0409800J1633023J2880799J4240308J5924466
5370A98541602J7946176J9436553K1046614K2747682K4092899K4681175K4620046
5363C53112747K3081485K0213508J6438776J1486227N320860q14650o619598j2262314
$$ plain form
5355 409957041 393202091 373022147 350279128 325889920 300823319 275985790 252365371
5348 252365371 230147354 209741126 191309937 174836377 159888769 146633263 134925029
5341 134925029 124314493 114747852 106402810 98883692 92270493 86348760 80774363 75819484
5333 75819484 71224310 67049918 63169044 59753066 56762292 53994089 51175111 48753927
5325 48753927 46363806 44232018 42262850 40336812 38705823 37261945 35772057 34383472
5317 34383472 33244871 32022718 30802091 29657475 28397143 27172269 26225578 25230622
5309 25230622 24339736 23659917 22844137 22051492 21358330 20704924 20019675 19218819 18489898
5300 18489898 18009646 17782561 17321556 16912422 16470147 15905533 15283357 14849213 14576748
$$ packed form
5355D09957041j6754950k0179944k2743019k4389208k5066601k4837529k3620419
5348B52365371k2218017k0406228j8431189j6473560j4947608j3255506j1708234
5341A34925029j0610536r566641q345042p519118o613199n921733n574397m954879
5333G5819484m595174m174392l880874l415978k990774k768203k818978k421184
5325D8753927k390121k131788j969168j926038j630989j443878j489888j388585
5317C4383472j138601j222153j220627j144616j260332j224874r46691r94956
5309B5230622q90886o79819q15780p92645o93162o53406o85249q00856p28921
5300A8489898m80252k27085m61005m09134m42275n64614o22176m34144k72465
$$ plain form
5291 14576748 14304791 14074466 13611191 13156772 12613082 12411023 12065366 11782889 11433372
5282 11433372 11410254 11036455 10584887 10257620 9969981 9806406 9600080 9518857 9344571 9218092
5272 9218092 8790857 8531134 8440004 8351106 8189750 8126215 7814430 7564626 7487765 7346151
5262 7346151 7159925 7248732 6966250 6668861 6536407 6366944 6100808 6188171 6150017 6074020
5252 6074020 6114346 5790561 5510821 5404634 5193998 5090953 5140570 5063427 4991491 4892760
5242 4892760 4774003 4504535 4434494 4182033 4167507 4365905 4435687 4312183 4154871 4169533
5232 4169533 4100143 3888848 4012236 4017974 3849409 3716643 3665934 3596070 3404499 3522851
5222 3522851 3628793 3627413 3423354 3406903 3405114 3359424 3170476 3197439 3155919 3104580 3126234
$$ packed form
5291A4576748k71957k30325m63275m54419n43690k02059l45657k82477l49517
5282A1433372k3118l73799m51568l27267k87639j63575k06326q1223j74286j26479
5272I218092m27235k59723r1130q8898j61356o3535l11785k49804p6861j41614
5262G346151j86226Q8807k82482k97389j32454j69463k66136Q7363l8154p5997
5252F074020M0326l23785k79740j06187k10636j03045M9617p7143p1936r8731
5242D892760j18757k69468p0041k52461j4526J98398O9782j23504j57312J4662
5232D169533o9390k11295J23388N738j68565j32766n0709o9864j91571J18352
5222C522851J05942j380k04059j6451j789m5690j88948K6963m1520n1339K1654
$$ plain form
5211 3126234 2948742 2742444 2559265 2569306 2591834 2509386 2335187 2310304 2128212 2135164 2131237
5200 2131237 2248765 2401298 2505355 2485948 2261967 1985723 2004182 1776302 1720781 2007235
5190 2007235 2100532 1902395 1719613 1610566 1698985 1551689 1545733 1736949 1630191 1480841
5180 1480841 1425878 1337082 1327929 1581910 1699820 1581515 1687780 1764899 1501114 1343512
5170 1343512 1127951 1153574 1231102 1471831 1426095 1459392 1134272 922762 992202 1130928
5160 1130928 1166394 1351458 1289862 1028770 1036659 1079811 1176716 1389285 1420762 1367355 1332315
5149 1332315 1096608 986287 911447 843661 941959 1001893 859555 943500 961490 588096 315573
5138 315573 637279 676798 811643 912521 784360 761215 706027 720800 905493 1153710
$$ packed form
5211C126234j77492k06298j83179J0041K2528q2448j74199k4883j82092O952l927
5200B131237J17528J52533J04057j9407k23981k76244J8459k27880n5521K86454
5190B007235R3297j98137j82782j09047Q8419j47296n956J91216j06758j49350
5180A480841n4963q8796r153K53981J17910j18305J06265P7119k63785j57602
5170A343512k15561K5623P7528K40729m5736L3297l25120k11510O9440J38726
5160A130928L5466J85064o1596k61092P889M3152R6905K12569L1477n3407l5040
5149A332315k35707j10321p4840o7786R8298N9934j42338Q3945J7990l73394k72523
5138C15573L21706L9519J34845J00878j28161k3145n5188J4773J84693K48217
$$ plain form
5128 1153710 1057905 1170946 1074291 837439 839584 970935 910858 968047 1013033 858359 689481
5117 689481 690790 557467 652795 673001 551696 641896 621886 418177 362423 425378 387978
5106 387978 679611 835119 852667 787009 743463 707462 699670 833184 898349 920884 832459
5095 832459 525861 577295 568114 554552 643170 851640 851602 694616 391432 78132 107582
5084 107582 193534 320754 566979 676879 601982 435449 349852 373043 506705 814477
5074 814477 755006 638763 521328 502547 516739 437722 518618 502719 673737 550998 386228
5063 386228 185087 119198 102406 289114 579377 563158 430703 460069 431190 459339 667236
5052 667236 807154 579886 500648 404551 276681 246830 310383 451209 470348 428722 240875
$$ packed form
5128A153710r5805J13041r6655k36852K145J31351o0077N7189M4986j54674j68878
5117F89481J309j33323R5328K0206j21305R0200k0010k03709n5754O2955l7400
5106C87978K91633J55508J7548o5658m3546l6001p792J33514O5165K2535q8425
5095H32459l06598N1434r181j3562Q8618K08470l8j56986l03184l13300K9450
5084A07582Q5952J27220K46225J09900p4897j66533q5597K3191J33662L07772
5074H14477n9471j16243j17435j8781J4192p9017Q0896j5899J71018j22739j64770
5063C86228k01141o5889j6792J86708K90263j6219j32455K9366k8879K8149K07897
5052F67236J39918k27268p9238r6097j27870k9851O3553J40826J9139m1626j87847
$$ plain form
5041 240875 172287 -125417 -78291 172872 478101 772648 846149 783879 744722 722975 835660
5030 835660 817970 863604 1047637 973209 697193 833774 930666 768036 630756 676910 685389
5019 685389 595993 498919 437566 417193 400435 280828 378657 504788 538696 610437 466565
5008 466565 510981 720601 683618 473781 567433 686306 795021 726453 840606 751689 789955
4997 789955 789834 682831 619646 483807 429438 452156 552261 601359 622520 491153 270423
4986 270423 266065 336116 273827 374113 398247 491347 467684 496743 280892 155499 204711
4975 204711 397562 585480 589596 570991 752665 666238 543156 543831 231856 229864 520525
4964 520525 618235 736759 928696 713684 448427 472614 452399 626372 796255 977280
$$ packed form
5041B40875o8588k97704M7126K51163L05229K94547P3501o2270l9157k1747J12685
5030H35660j7690M5634J84033p4428k76016J36581R6892j62630j37280M6154Q479
5019F85389q9396r7074o1353k0373j6758j19607R7829J26131L3908P1741j43872
5008D66565M4416K09620l6983k09837R3652J18873J08715o8568J14153q8917L8266
4997G89955j21j07003o3185j35839n4369K2718J00105M9098K1161j31367k20730
4986B70423m358P0051o2289J00286K4134R3100k3663K9059k15851j25393M9212
4975B04711J92851J87918M116j8605J81674q6427j23082O75l11975j992K90661
4964E20525R7710J18524J91937k15012k65257K4187k0215J73973J69883J81025
$$ plain form
4954 977280 1175511 1166355 983371 853301 1087300 1191066 1209967 1689147 2044392 2547548
4944 2547548 3091591 3784727 4496137 4822051 4897081 4717450 4127927 3296533 2916804 2455499
4934 2455499 2061803 1873066 1724461 1416586 1186985 1162831 1100448 980215 700141 544011
4924 544011 533302 524937 531105 495764 509443 548634 635853 564971 802135 707672 665618 812302
4912 812302 690447 547175 758975 905804 954051 1054028 1149373 924283 737426 820315
4902 820315 811805 894699 885730 777355 739143 593301 446915 654658 843433 809298 933659
4891 933659 940361 665558 520758 463739 551175 695216 665416 629212 649986 506356 376667
4880 376667 565052 625448 411352 320244 463621 546588 475075 483478 541179 542905 611072
$$ packed form
4954I77280J98231r156j82984j30070K33999J03766J8901M79180L55245N03156
4944B547548N44043O93136P11410L25914P5030j79631n89523q31394l79729m61305
4934B455499l93696j88737j48605l07875k29601k4154o2383j20233k80074j56130
4924E44011j0709q365O168l5341J3679L9191Q7219p0882K37164r4463m2054J46684
4912H12302j21855j43272K11800J46829M8247R9977R5345k25090j86857Q2889
4902H20315q510Q2894q969j08375l8212j45842j46386K07743J88775l4135J24361
4891I33659O702k74803j44800n7019Q7436J44041k9800l6204K0774j43630j29689
4880C76667J88385O0396k14096r1108J43377Q2967p1513Q403N7701J726O8167
$$ plain form
4869 611072 586109 446787 287855 319553 462054 382379 365013 621990 800695 808614 716038
4858 716038 671191 667574 674553 549530 515269 598700 488530 442933 427970 429043 267491 269504
4846 269504 235764 376258 432825 373565 260797 202191 157029 479192 587956 717442 854028
4835 854028 856381 737392 666635 595459 470004 577821 748817 704830 711469 489397 306127
4824 306127 270199 225925 175158 150405 465639 614582 721375 650374 615460 548400 534563
4813 534563 595658 817612 1101516 1171945 1298401 1311516 1195468 1143490 1329886 1476887
4803 1476887 1669226 2160960 2587593 3181049 3682759 4220048 4550301 4607207 4543776 3857073
4793 3857073 3256932 2733328 2373462 2083751 1740430 1553555 1458584 1209748 997423 1114538
$$ packed form
4869F11072k4963j39322j58932L1698J42501p9675j7366K56977J78705P919r2576
4858G16038m4847l617O979j25023l4261Q3431j10170m5597j4963J073j61552K013
4846B69504l3740J40494N6567n9260j12768n8606m5162L22163J08764J29486J36586
4835H54028K353j18989p0757p1176j25455J07817J70996m3987O639k22072j83270
4824C06127l5928m4274n0767k4753L15234J48943J06793p1001l4914o7060j3837
4813E34563O1095K21954K83904P0429J26456J3115j16048n1978J86396J47001
4803A476887J92339M91734M26633N93456N01710N37289L30253N6906o3431o86703
4793C857073o00141n23604l59866k89711l43321j86875r4971k48836k12325J17115
$$ plain form
4783 1114538 1116016 1012043 857073 883972 542688 494894 395403 637908 734900 813464 1021372
4772 1021372 991858 803161 825803 900777 840104 980514 1243296 1360511 1268300 1328628 1370185
4761 1370185 1406870 1356474 1087350 973446 1015800 902696 892826 813026 775821 708589 713297
4750 713297 831078 958685 829040 626072 586549 584208 568838 610100 638921 715166 850729
4739 850729 998958 864302 791618 910418 928287 971283 884263 856845 1011377 1110902 900461
4728 900461 853068 870455 892978 712924 632515 564722 543333 551967 532491 642008 775740
4717 775740 1023857 1010039 1122366 1107848 1144697 1008788 870595 1098185 1232051 1310595
4707 1310595 1474110 1395528 1199046 1077459 854224 948258 1308616 1325655 1280247 1278457 1005721
$$ packed form
4783A114538J478j03973j54970K6899l41284m7794r9491K42505R6992P8564K07908
4772A021372k9514j88697K2642P4974o0673J40410K62782J17215r2211O0328M1557
4761A370185L6685n0396k69124j13904M2354j13104r870p9800l7205o7232M708
4750G13297J17781J27607j29645k02968l9523k341j5370M1262K8821P6245J35563
4739H50729J48229j34656p2684J18800J7869M2996q7020k7418J54532R9525k10441
4728I00461m7393J7387K2523j80054q0409o7793k1389Q634j9476J09517J33732
4717G75740K48117j3818J12327j4518L6849j35909j38193K27590J33866P8544
4707A310595J63515p8582j96482j21587k23235R4034L60358J7039m5408j790k72736
$$ plain form
4696 1005721 986019 1094043 1176853 1464627 1567709 1589700 1483441 1335240 1053008 1014447
4686 1014447 1289685 1439763 1586528 1768086 1742944 1485269 1599322 1595161 1705589 1888118
4676 1888118 1950869 2020524 2094183 2070372 2030513 2093533 2065661 2053432 2125147 2213350 2299830
4665 2299830 2360928 2431173 2379398 2202386 2211788 2311643 2554063 2664785 2743775 2826683 3016646
4654 3016646 2967711 2995696 3057757 3145955 3409635 3582704 3827539 4000475 4117158 4316821
4644 4316821 4411701 4627002 4822937 4986873 5441962 5923888 6294381 6745532 7243851 7734442
4634 7734442 8212796 8857226 10017675 11517548 13300354 15749522 19808076 26143936 33496662
4625 33496662 37782409 36413020 32442823 28717009 25600108 22749909 20373515 18542722
$$ packed form
4696A005721j9702J08024Q2810K87774J03082K1991j06259j48201k82232l8561
4686A014447K75238J50078J46765J81558k5142k57675J14053m161J10428J82529
4676A888118O2751O9655P3659k3811l9859O3020k7872j2229P1715Q8203Q6480
4665B299830O1098P0245n1775j77012R402R9855K42420J10722P8990Q2908J89963
4654C016646m8935K7985O2061Q8198K63680J73069K44835J72936J16683J99663
4644D316821R4880K15301J95935J63936M55089M81926L70493M51151M98319M90591
4634G734442M78354O44430J160449J499873J782806K449168M058554O335860P352726
4625C3496662M285747j369389l970197l725814l116901k850199k376394j830793
$$ plain form
4617 18542722 17397325 16724540 16685293 17097277 17816152 18809163 20469133 22820734 26057610
4608 26057610 29738952 33097851 35686535 37114450 38191714 39688520 42446411 46649441
4600 46649441 52340816 58203668 62059188 63082651 62548345 61907513 62477749 65038227 69793168
4591 69793168 75576432 79999506 80269469 76831293 72177561 67776284 64775210 63930913
4583 63930913 64289353 64793816 63744555 59948960 54692494 49574806 45266288 42208104
4575 42208104 40026364 38288330 36396015 33713953 30334525 26834174 23648259 20531814
4567 20531814 17852562 15705596 13576021 11715266 10328432 9401267 8623198 7969528 7253286
4558 7253286 6713701 6215912 5568774 5167944 4985581 4970724 5188241 5073716 4751152 4523568
$$ packed form
4617A8542722j145397o72785l9247M11984P18875R93011J659970K351601L236876
4608B6057610L681342L358899K588684J427915J077264J496806K757891M203030
4600D6649441N691375N862852L855520J023463n34306o40832N70236K560478M754941
4591F9793168N783264M423074K69963l438176m653732m401277l001074q44297
4583F3930913L58440N04463j049261l795595n256466n117688m308518l058184
4575D2208104k181740j738034j892315k682062l379428l500351l185915l116445
4567B0531814k679252k146966k129575j860755j386834r27165p78069o53670p16242
4558G253286n39585m97789o47138m00830j82363j4857K17517j14525l22564k27584
$$ plain form
4548 4523568 4254680 3926987 3905555 3735190 3822739 3878997 3712274 3375490 3254849 2996606
4538 2996606 2576524 2558402 2565562 2613873 2612465 2526055 2242708 2328538 2113787 2065236 2066371
4527 2066371 1976721 2028926 2115204 2021372 1898246 1977059 1881594 1691705 1739135 1608486 1691133
4516 1691133 1808696 1755509 1645639 1374879 1151989 1233068 1153095 1138349 1294696 1263050
4506 1263050 1212533 1119011 821570 855012 804552 812217 1020003 1326832 1343590 1251544 1323143
4495 1323143 995085 788968 708451 890066 968923 1267378 1225354 1196033 1043170 601297
4485 601297 429463 572159 604720 795218 1013494 948943 798538 702309 686881 694416 828694
4474 828694 807688 941951 1020246 1115135 902369 839859 745881 603091 443287 393268 481802
$$ packed form
4548D523568k68888l27693k1432j70365Q7549N6258j66723l36784j20641k58243
4538B996606m20082j8122P160M8311j408q6410k83347Q5830k14751m8551J135
4527B066371q9650N2205Q6278r3832j23126P8813r5465j89889M7430j30649Q2647
4516A691133J17563n3187j09870k70760k22890Q1079p9973j4746J56347l1646
4506A263050n0517r3522k97441L3442n0460P665K07786L06829J6758r2046P1599
4495A323143l28058k06117q0517J81615P8857K98455m2024k9321j52863m41873
4485F01297j71834J42696L2561J90498K18276o4551j50405r6229j5428P535J34278
4474H28694k1006J34263P8295R4889k12766o2510r3978j42790j59804n0019Q8534
$$ plain form
4463 481802 458685 449759 425278 226303 229739 341805 289874 620680 938044 875976 760441
4452 760441 730608 533200 468840 619246 642926 797334 1048595 842314 723601 621630
4442 621630 330343 277446 297465 316212 467535 527274 531447 626522 571999 391263 448049
4431 448049 439953 453439 772182 906998 657238 509079 325613 58486 175936 263629
4421 263629 448706 589529 811069 597792 554432 379289 257157 504049 615238 823411
4411 823411 1044460 1078006 954116 863330 663551 724645 902959 1110781 1383405 1760503
4401 1760503 2089536 2589808 3066141 3315111 3783403 4113500 4047322 3931504 3774902 3319546
4391 3319546 2919929 2369379 1917067 1954378 1746056 1510670 1307240 867006 591405 687647
$$ packed form
4463D81802k3117q926k4481j98975L436J12066n1931L30806L17364o2068j15535
4452G60441k9833j97408o4360J50406K3680J54408K51261k06281j18713j01971
4442F21630k91287n2897K0019J8747J51323N9739M173R5075n4523j80736N6786
4431D48049q096J3486L18743J34816k49760j48159j83466k67127J17450Q7693
4421B63629J85077J40823K21540k13277m3360j75143j22132K46892J11189K08173
4411H23411K21049L3546j23890r0786j99779O1094J78314K07822K72624L77098
4401A760503L29033N00272M76333K48970M68292L30097o6178j15818j56602m55356
4391C319546l99617n50550m52312L7311k08322k35386k03430m40234k75601R6242
$$ plain form
4381 687647 391040 234841 525393 658265 694485 642044 342311 250569 413341 251553
4371 251553 160419 349310 410052 524872 485465 204920 134393 226424 156593 -24515 119313
4360 119313 362861 396599 423133 380928 380573 381053 444478 477041 511726 416810 336496 373071
4348 373071 390961 370215 297936 249196 329026 167389 156425 268926 125839 -284 185299
4337 185299 310593 288403 511987 396726 322836 388858 243811 201784 442869 471962 477302
4326 477302 506542 309437 133753 232698 298215 295512 429493 556241 502309 409324 314801
4315 314801 296427 332515 203358 500178 554541 466614 528159 481005 339055 387080 253501
4304 253501 278299 383618 430812 422421 477360 496198 449149 437361 397302 349104 413542 437722
$$ packed form
4381F87647k96607j56199K90552J32872L6220n2441k99733r1742J62772j61788
4371B51553r1134J88891O0742J14820l9407k80545p0527R2031o9831j81108J43828
4360A19313K43548L3738K6534m2205l55M80O3425L2563L4685r4916q0314L6575
4348C73071J7890k0746p2279m8740P9830j61637j0964J12501j43087j26123J85583
4337A85299J25294k2190K23584j15261p3890O6022j45047m2027K41085K9093N340
4326D77302K9240j97105j75684R8945O5517k703J33981J26748n3932r2985r4523
4315C14801j8374L6088j29157K96820N4363q7927O1545m7154j41950M8025j33579
4304B53501K4798J05319M7194q391N4939J8838m7049j1788m0059m8198O4438K4180
$$ plain form
4292 437722 697219 1011792 753642 672757 707097 467615 350515 608842 587333 577897 703300
4281 703300 814319 653227 591873 480647 642999 838155 765946 695876 667215 569845 460914
4270 460914 464576 324524 374639 641282 640769 563787 522171 355229 250267 367179 585766
4259 585766 700000 763357 833519 981825 1087482 921292 679892 633079 478197 622942
4249 622942 808963 727145 838478 543685 413000 456486 367907 258968 599234 721363
4239 721363 787057 914047 812354 840058 922641 828004 1019036 1197278 1211184 1274729 1310246
4228 1310246 1153083 1134824 1245880 1094094 1108309 1270283 1310377 1256519 1398594 1398460 1467602
4217 1467602 1328440 1305029 1335565 1573351 1606560 1832909 2011226 1867776 1808439 1591537
$$ packed form
4292D37722K59497L14573k58150q0885L4340k39482j17100K58327k1509r436J25403
4281G03300J11019j61092o1354j11226J62352J95156p2209p0070k8661r7370j08931
4270D60914L662j40052N0115K66643n13p6982m1616j66942j04962J16912K18587
4259E85766J14234O3357P0162J48306J05657j66190k41400m6813j54882J44745
4249F22942J86021q1818J11333k94793j30685M3486q8579j08939L40266J22129
4239G21363O5694J26990j01693K7704Q2583r4637J91032J78242J3906O3545L5517
4228A310246j57163j8259J11056j51786J4215J61974M0094n3858J42075j34O9142
4217A467602j39162k3411L0536K37786L3209K26349J78317j43450n9337k16902
$$ plain form
4207 1591537 1601245 1536029 1412250 1603489 1878213 1708363 1622780 1528309 1305186 1173724
4197 1173724 1150005 1337753 1556209 1442890 1405300 1382874 1147912 947099 1158267 1137863
4187 1137863 1075046 1306225 1356055 1032466 816391 887463 636897 692169 750058 669461 657233
4176 657233 721287 708118 659251 808539 794217 802397 809324 829607 1032777 894911 781537
4165 781537 821672 987783 785855 647746 613469 536572 444167 491919 609516 655150 654661
4154 654661 478036 417237 131514 181603 428006 538068 531246 338751 161869 42010
4144 42010 40077 38288 322128 552575 579830 417589 410589 239423 170252 191786 221957 428067
4132 428067 530045 470652 318056 225453 197726 309793 385161 391938 401846 580358 361271
$$ packed form
4207A591537R708o5216j23779J91239K74724j69850q5583r4471k23123j31462
4197A173724k3719J87748K18456j13319l7590k2426k34962k00813K11168k0404
4187A137863o2817K31179M9830l23589k16075P1072k50566N5272N7889q0597j2228
4176F57233O4054j3169m8867J49288j4322Q180O927K0283K03170j37866j13374
4165G81537M0135J66111k01928j38109l4277p6897r2405M7752J17597M5634m89
4154F54661j76625o0799k85723N0089K46403J10062o822j92495j76882j19859
4144D2010j933j789K83840K30447K7255j62241p000j71166o9171K1534L0171K06110
4132D28067J01978n9393j52596r2603k7727J12067P5368O777R908J78512k19087
$$ plain form
4121 361271 383540 482500 371372 530385 580391 467588 546552 466270 450322 665506 809062
4110 809062 593289 376534 377428 156027 75622 144269 327177 633900 676690 647603 477834
4099 477834 196912 396968 542879 580684 792130 868728 937063 738053 517638 559364
4089 559364 676671 737510 902623 1092046 1063913 864302 590269 465705 518716 776584
4079 776584 1113491 1218942 1272770 1362475 1337511 1291709 1211533 1429569 1606613 1768154 1857686
4068 1857686 2010770 2229616 2280370 2488781 2846636 3005689 3127156 3587030 4016462 4554591
4058 4554591 5440777 6507869 7982235 10057056 13527435 19147102 24798042 26861455
4050 26861455 24979321 21605254 18338318 15236358 12724790 10616020 8995410 7695966
$$ packed form
4121C61271K2269R8960j11128J59013N0006j12803P8964q0282j5948K15184J43556
4110H09062k15773k16755Q94k21401q0405O8647J82908L06723M2790k9087j69769
4099D77834k80922K00056J45911L7805K11446P6598O8335j99010k20415M1726
4089E59364J17307O0839J65113J89423k8133j99611k74033j24564N3011K57868
4079G76584L36907J05451N3828Q9705k4964m5802q0176K18036J77044J61541Q9532
4068A857686J53084K18846N0754K08411L57855J59053J21467M59874M29432N38129
4058D554591Q86186J067092J474366K074821L470379N619667N650940K063413
4050B6861455j882134l374067l266936l101960k511568k108770j620610j299444
$$ plain form
4042 7695966 6556074 5915040 5617054 5123567 4569290 4005233 3600303 3345995 3209870
4033 3209870 3251811 3297961 3505634 3429925 3124604 2548029 2389859 2264802 2102688 2195519
4023 2195519 2256334 2015008 1666879 1380640 1373177 1244744 1242610 1530275 1732883 1685744 1286789
4012 1286789 1203050 926534 669793 831283 875366 925140 1145395 1062839 768039 569363
4002 569363 457995 480609 562607 727380 1108028 1312687 1023521 793371 733121 689988
3992 689988 726489 944927 1084790 1241600 1143407 890550 625342 514384 479932 553736
3982 553736 572188 549214 637037 480049 236486 314556 414660 658311 800644 765334 813235
3971 813235 771768 649049 672878 888423 806593 802349 896447 727640 635048 689293 642066
$$ packed form
4042G695966j139892o41034k97986m93487n54277n64057m04930k54308j36125
4033C209870M1941M6150K07673p5709l05321n76575j58170j25057j62114R2831
4023B195519O0815k41326l48129k86239p463j28433k134K87665K02608m7139l98955
4012A286789q3739k76516k56741J61490M4083M9774K20255q2556k94800j98676
4002E69363j11368K2614Q1998J64773L80648K04659k89166k30150o0250m3133
3992F89988L6501K18438J39863J56810r8193k52857k65208j10958l4452P3804
3982E53736J8452k2974Q7823j56988k43563P8070J00104K43651J42333l5310M7901
3971H13235m1467j22719K3829K15545q1830m244R4098j68807r2592N4245m7227
$$ plain form
3960 642066 526537 586260 425348 252250 452351 623126 695835 758872 713804 723769 725526
3949 725526 656263 730161 896249 909111 1053874 1218806 1060774 1042750 1136066 1336680 1416639
3938 1416639 1771901 1953071 2081217 2294131 2349258 2538708 2685999 3035292 3364893 3553607
3928 3553607 3813571 4079272 4103314 4049768 4260022 4301536 4209237 4260019 4293770 4240625 4246132
3917 4246132 4140504 4210468 4300792 4150577 4007030 3905061 3531995 3332634 3288771 2911859
3907 2911859 2404632 2328469 2168971 2000185 1766695 1689291 1712293 1604426 1474250 1139363
3897 1139363 1147494 1114595 1015347 1081614 987102 903640 894412 701893 501468 576809 615572
3886 615572 594951 611789 661575 570334 531627 535540 644461 697641 787048 855774 826051 895910
$$ packed form
3960F42066j15529N9723j60912j73098K00101J70775P2709O3037m5068R965J757
3949G25526o9263P3898J66088J2862J44763J64932j58032j8024R3316K00614P9959
3938A416639L55262J81170J28146K12914N5127J89450J47291L49293L29601J88714
3928C553607K59964K65701K4042n3546K10254M1514r2299N0782L3751n3145N507
3917D246132j05628O9964R0324j50215j43547j01969l73066j99361m3863l76912
3907B911859n07227p6163j59498j68786k33490p7404K3002j07867j30176l34887
3897A139363Q131l2899r9248O6267r4512q3462r228j92519k00425P5341L8763
3886F15572k0621J6838M9786r1241l8707L913J08921N3180Q9407O8726k9723O9859
$$ plain form
3874 895910 866175 681337 622331 773926 764825 798724 835301 794265 739207 722612 713020 735529
3862 735529 691286 570638 636969 851762 820478 964828 1118736 949893 899997 889791 654970
3851 654970 676094 692126 739363 731583 674360 683444 635802 553014 420795 567531 615794 658612
3839 658612 732915 687379 547543 518336 503368 493341 618795 672432 709073 688704 358039
3828 358039 338297 357031 525171 849186 739917 798969 783397 879811 808120 834427 1025559
3817 1025559 1305058 1452378 1433820 1409348 1526625 1337853 1205212 1389739 1605165 1796227
3807 1796227 1955922 2082384 1953678 1992360 2059576 1949901 2016354 1951078 1828093 1926978
3797 1926978 1886829 1863616 1848106 1930476 1859531 1667003 1525897 1471715 1727129 1899320 1697781
$$ packed form
3874H95910k9735j84838n9006J51595r101L3899L6577m1036n5058j6595r592K2509
3862G35529m4243j20648O6331K14793l1284J44350J53908j68843m9896j0206k34821
3851F54970K1124J6032M7237p780n7223R084m7642q2788j32219J46736M8263M2818
3839F58612P4303m5536j39836k9207j4968j0027J25454N3637L6641k0369l30665
3828C58039j9742J8734J68140L24015j09269N9052j5572R6414p1691K6307J91132
3817A025559K79499J47320j8558k4472J17277j88772j32641J84527K15426J91062
3807A796227J59695J26462j28706L8682O7216j09675O6453o5276j22985R8885
3797A926978m0149k3213j5510Q2370p0945j92528j41106n4182K55414J72191k01539
$$ plain form
3786 1697781 1663564 1763512 1617807 1686456 1733155 1845595 1995249 2043557 2037220 1798621 1663444
3775 1663444 1700129 1652808 1723954 1922048 1933635 1776626 1723006 1766200 1488855 1418288 1442005
3764 1442005 1597914 1881278 1683391 1785532 2044977 1968720 1859543 1889889 1659062 1420753
3754 1420753 1492752 1362984 1260871 1365693 1430494 1376860 1339889 1340332 1260289 969773 871862
3743 871862 809296 693749 601660 708518 872831 823298 607916 585172 555750 432240 469239
3732 469239 282944 374833 397179 426033 585904 513593 585130 631557 460975 667785 722229
3721 722229 462720 526005 747525 870979 852370 740080 686517 757966 721988 634580 540203
3710 540203 711877 703878 690719 556502 402218 489714 732325 584077 619194 832265 698267
$$ packed form
3786A697781l4217R9948j45705O8649M6699J12440J49654M8308o337k38599j35177
3775A663444L6685m7321P1146J98094J1587j57009n3620M3194k77345p0567K3717
3764A442005J55909K83364j97887J02141K59445p6257j09177L0346k30827k38309
3754A420753P1999j29768j02113J04822O4801n3634l6971M43q0043k90516r7911
3743H71862o2566j15547r2089J06858J64313m9533k15382k2744k9422j23510L6999
3732D69239j86295R1889K2346K8854J59871p2311P1537M6427j70582K06810N4444
3721G22229k59509O3285K21520J23454j8609j12290n3563P1449l5978q7408r4377
3710E40203J71674p999j3159j34217j54284Q7496K42611j48248L5117K13071j33998
$$ plain form
3699 698267 731661 804125 763710 604706 581769 548333 551006 460789 77128 220920 381794
3688 381794 189461 532627 468869 259132 237601 458983 375366 368360 638348 607901 558070
3677 558070 511750 426400 149189 201990 419015 418252 415090 427322 283689 84732 -103984
3666 -103984 -117775 -195163 198634 454162 579705 521803 294988 122469 148553 213896 164266
3655 164266 440292 771629 440843 179168 144066 -125874 -70982 117455 243419 344652
3645 344652 366104 209862 116804 97413 172034 337783 649520 666142 434517 290511 227374
3634 227374 88807 -7901 -63811 160003 441303 437500 344880 192686 102520 54891 54421
3623 54421 143828 361870 508546 638460 629161 491290 386285 248370 237683 359082 515026
$$ packed form
3699F98267L3394P2464m0415j59004k2937l3436K673r0217l83661J43792J60874
3688C81794j92333L43166o3758k09737k1531K21382q3617p006K69988l0447m9831
3677E58070m6320q5350k77211N2801K17025p63l162J2232j43633j98957j88716
3666a03984j3791p7388L93797K55528J25543n7902k26815j72519K6084O5343m9630
3655A64266K76026L31337l30786k61675l5102k69940N4892J88437J25964J01233
3645C44652K1452j56242r3058j9391P4621J65749L11737J6622k31625j44006o3137
3634B27374j38567r6708n5910K23814K81300l803r2620j52194r0166m7629m70
3623E4421Q9407K18042J46676J29914r299j37871j05005j37915j0687J21399J55944
$$ plain form
3612 515026 573702 490587 255575 93480 115953 88173 147548 351667 391121 275830 255934
3601 255934 148007 130031 124855 91341 189592 273274 488758 555688 651800 391079 218611
3590 218611 240951 187476 159254 339380 278437 168551 400644 370379 96228 59715 -2267
3579 -2267 199841 437984 378269 190921 69226 -134103 -77198 36454 36575 279621 438344
3568 438344 326896 332110 170684 -74275 45123 46067 219034 707196 846950 548238 393221
3557 393221 213810 115709 214184 251358 208504 497781 398386 130950 90502 160350 85449
3546 85449 216244 246299 267456 346197 166867 20683 78892 115508 53683 108808 261497
3535 261497 444394 420251 199093 -5035 -80621 236356 358538 356257 258508 284806 259491
$$ packed form
3612E15026N8676q3115k35012j62095K2473k7780N9375K04119L9454j15291j9896
3601B55934j07927j7976n176l3514R8251Q3682K15484O6930R6112k60721j72468
3590B18611K2340n3475k8222J80126o0943j09886K32093l0265k74151l6513o1982
3579b267K02108K38143n9715j87348j21695k03329N6905J13652J21K43046J58723
3568D38344j11448N214j61426k44959J19398R44J72967M88162J39754k98712j55017
3557C93221j79411r8101R8475L7174m2854K89277r9395k67436m0448O9848p4901
3546H5449J30795L0055K1157P8741j79330j46184N8209L6616o1825N5125J52689
3535B61497J82897k4143k21158k04128p5586L16977J22182k281r7749K6298k5315
$$ plain form
3524 259491 105431 247897 404547 611623 602439 392414 321460 382183 324415 171490 126436
3513 126436 257077 255652 246628 56649 -147026 -105989 112629 183150 417834 439263 313131
3502 313131 275913 357667 372536 476341 409228 410748 547277 377773 154206 107193 112326
3491 112326 186515 414628 563144 445367 371361 285254 264715 415237 491195 563344 735464
3480 735464 635690 451039 375553 175381 172736 123665 234424 364464 249486 169815 122481
3469 122481 42971 255417 352250 325860 254763 526193 640714 705329 732964 713225 820975
3458 820975 771743 674023 693777 687874 741737 855582 867006 706834 581806 468518 365807
3447 365807 669857 851570 717091 905305 1091807 1048969 1049276 1085317 1048815 1116661 1210996
$$ packed form
3524B59491j54060J42466J56650K07076r184k10025p0954O0723n7768j52925m5054
3513A26436J30641j425r024j89979k03675M1037K18618P0521K34684K1429j26132
3502C13131l7218Q1754J4869J03805o7113J520J36529j69504k23567m7013N133
3491A12326P4189K28113J48516j17777p4006q6107k0539J50522P5958P2149J72120
3480G35464r9774j84651p5486k00172k645m9071J10759J30040j14978p9671m7334
3469A22481p9510K12446R6833k6390p1097K71430J14521O4615K7635j9739J07750
3458H20975m9232r7720J9754n903N3863J13845J1424j60172j25028j13288j02711
3447C65807L04050J81713j34479J88214J86502m2838L07L6041l6502O7846R4335
$$ plain form
3436 1210996 1292816 1398480 1485996 1185115 1105439 962301 877857 989530 1089338 1165730 1212121
3425 1212121 1176278 897358 626417 623388 638054 685460 714534 741390 800831 627774 551494
3414 551494 371513 315729 226350 359839 342947 359386 409947 397011 315232 304863 370269
3403 370269 600183 463563 529950 544902 400774 143313 234200 209302 153297 434084 543168
3392 543168 513556 480836 408352 179688 207001 209449 264702 439416 660995 606447 553914
3381 553914 306680 192939 133068 38489 -4778 81261 255985 195773 337849 367140 377973
3370 377973 570501 505942 437329 507631 643238 706859 812246 910698 801411 706847 577795
3359 577795 742089 811923 828551 916571 786996 640751 387347 274583 284488 517096 454142
$$ packed form
3436A210996Q1820J05664Q7516l00881p9676j43138q4444J11673R9808P6392M6391
3425A212121l5843k78920k70941l029J4666M7406K9074K6856N9441j73057p6280
3414E51494j79981n5784q9379J33489j6892J6439N0561j2936q1779j0369O5406
3403C70269K29914j36620O6387J4952j44128k57461R0887k4898n6005K80787J09084
3392E43168k9612l2720p2484k28664K7313K448N5253J74714K21579n4548n2533
3381E53914k47234j13741n9871r4579m3267Q6039J74724o0212J42076K9291J0833
3370C77973J92528o4559o8613P0302J35607O3621J05387R8452j09287r4564j29052
3359E77795J64294O9834J6628Q8020j29575j46245k53404j12764R905K32608o2954
$$ plain form
3348 454142 464640 538850 534088 297297 129012 58762 31686 179901 380864 426216 308799
3337 308799 250373 85090 -135551 -220192 -65057 -68073 189533 354472 344621 320012 151938
3326 151938 63438 216395 415082 546332 521744 555979 483062 288831 144163 -7309
3316 -7309 6508 109714 21446 101668 180449 83692 5919 38500 229168 312561 512512
3305 512512 544425 526031 412154 236587 144311 146915 105227 212898 284376 263589 193018
3294 193018 214865 123608 57601 131709 238581 233857 300672 393796 365014 520961 371910
3283 371910 253505 363780 365139 196009 189919 202948 254855 256927 227080 100657 185499
3272 185499 218413 119554 30304 139522 167731 299468 374269 294988 348121 532262 398060
$$ packed form
3348D54142J0498P4210m762k36791j68285p0250k7076J48215K00963M5352j17417
3337C08799n8426j65283k20641q4641J55135l016K57606J64939r851k4609j68074
3326A51938q8500J52957J98687J31250k4588L4235p2917j94231j44668j51472
3316g309J3817J03206q8268Q0222P8781r6757p7773L2581J90668Q3393J99951
3305E12512L1913j8394j13877j75567r2276K604m1688J07671P1478k0787p0571
3294A93018K1847r1257o6007P4108J06872m724O6815R3124k8782J55947j49051
3283C71910j18405J10275J359j69130o090J3029N1907K072k9847j26423Q4842
3272A85499L2914r8859q9250J09218K8209J31737P4801p9281N3133J84141j34202
$$ plain form
3261 398060 293526 474022 397399 223973 113692 -68358 3512 320098 286701 244917
3251 244917 268222 203663 72684 258854 99023 57069 150840 186244 188651 347908 382593
3240 382593 296604 256585 373605 496191 392430 350066 298710 335183 338887 258392 78041
3229 78041 220869 266318 90950 253873 441202 272045 188539 219932 166653 124506 166999
3218 166999 54208 220804 303638 154106 -20239 89380 123402 107336 222007 42136
3208 42136 108805 161741 145296 262427 407706 229990 206199 157991 -30637 199 215992
3197 215992 170394 289920 608928 548031 428494 273886 -6091 15488 235758 287857
3187 287857 416037 464841 303175 14610 -109722 -130047 -201460 -104892 -49165 133300 148723
$$ packed form
3261C98060j04534J80496p6623j73426j10281j82050P1870L16586l3397m1784
3251B44917K3305o4559j30979J86170j59831m1954R3771L5404K407J59257L4685
3240C82593q5989m0019J17020J22586j03761m2364n1356L6473L704q0495j80351
3229G8041J42828M5449j75368J62923J87329j69157q3506L1393n3279m2147M2493
3218A66999j12791J66596Q2834j49532j74345J09619L4022j6066J14671j79871
3208D2136O6669N2936j6445J17131J45279j77716k3791m8208j88628L0836K15793
3197B15992m5598J19526L19008o0897j19537j54608k79977K1579K20270N2099
3187B87857J28180M8804j61666k88565j24332k0325p1413R6568N5727J82465J5423
$$ plain form
3176 148723 -12292 -15229 -48247 -108909 54803 247415 357406 361710 216949 98952 152863
3165 152863 250509 542757 661853 446127 256579 167571 -10448 -170687 -112096 -6947
3155 -6947 206020 281994 231644 334113 181753 -17067 89604 207276 364180 409683 379783
3144 379783 208858 151627 154199 135922 8226 -70935 -21282 -82286 -45692 183214 318104
3133 318104 505747 632812 417322 314026 218041 306714 336889 460861 675617 470340
3123 470340 276605 61243 -1389 161308 306978 365574 497449 363690 -57527 -137589
3113 -137589 -199501 -31864 110635 437931 553975 556481 593464 403439 434592 272332 369399
3102 369399 629241 633205 448291 450968 393572 354651 357726 445327 472331 588406 564180 306305
$$ packed form
3176A48723j61015k937l3018o0662J63712J92612J09991M304j44761j17997N3911
3165A52863R7646K92248J19096k15726j89548q9008j78019j60239N8591J05149
3155f947K12967P5974n0350J02469j52360j98820J06671J17672J56904M5503k9900
3144C79783j70925n7231K572j8277j27696p9161M9653o1004L6594K28906J34890
3133C18104J87643J27065k15490j03296r5985Q8673L0175J23972K14756k05277
3123D70340j93735k15362o2632J62697J45670N8596J31875j33759m21217q0062
3113a37589o1912J67637J42499L27296J16044K506L6983j90025L1153j62260R7067
3102C69399K59842L964j84914K677n7396l8921L075Q7601K7004J16075k4226k57875
$$ plain form
3090 306305 189885 421630 679875 753812 681817 665019 542362 347842 263054 114940
3080 114940 118536 329286 279218 213900 360589 348018 204006 372697 384205 517628 507232
3069 507232 191810 175517 456163 499110 472137 765936 645264 388007 302639 53997
3059 53997 65229 310179 336831 314803 409203 378061 60590 115499 13690 14294 271577
3048 271577 346846 365439 418147 332927 -2987 18737 156957 -19004 87620 176376 115801
3037 115801 232980 235595 262234 340921 331443 244846 421154 392168 439375 542646 459515
3026 459515 224517 160622 63018 -117846 -24452 139526 154364 88425 214006 144705 95285
3015 95285 -105727 -157859 -148106 72173 87703 195161 267403 269991 134098 184554 178400 242704
$$ packed form
3090C06305j16420K31745K58245P3937p1995j6798j22657j94520q4788j48114
3080A14940L596K10750n0068o5318J46689j2571j44012J68691J1508J33423j0396
3069E07232l15422j6293K80646M2947k6973K93799j20672k57257q5368k48642
3059E3997J1232K44950K6652k2028R4400l1142l17471N4909j01809O04K57283
3048B71577P5269J8593N2708q5220l35914K1724J38220j75961J06624Q8756o0575
3037A15801J17179K615K6639P8687r478q6597J76308k8986M7207J03271q3131
3026D59515k34998o3895r7604j80864R3394J63978J4838o5939J25581o9301m9420
3015I5285k01012n2132R753K20279J5530J07458P2242K588j35893N0456o154O4304
$$ plain form
3003 242704 238943 114926 -13910 -93489 96815 33189 204708 334183 129004 100110 47618
2992 47618 -208915 -203061 106414 307035 359953 400686 274879 -21094 -148869 -63792 -120491
2981 -120491 -184541 97246 136717 149902 -27346 -17766 206872 275642 184398 152079 214394
2970 214394 199839 350838 497665 425397 223068 155589 -484 -47684 31156 -106528 -38913
2959 -38913 13236 -40292 -64809 29566 19954 212809 366579 269742 279074 258537 93714 -41184
2947 -41184 32362 20133 246191 262317 333356 150471 21163 -187468 -321795 -122132 95829
2936 95829 244412 297616 323598 231976 49419 84937 -39541 27906 188823 297818 296979
2925 296979 180363 -115045 -269893 -407935 -281146 -71280 36415 90992 -21403 -191747
$$ packed form
3003B42704l761j24017j28836p9579J90304o3626J71519J29475k05179k8894n2492
2992D7618k56533N854L09475K00621N2918M0733j25807k95973j27775Q5077n6699
2981a20491o4050K81787L9471J3185j77248R580K24638O8770r1244l2319O2315
2970B14394j4555J50999J46827p2268k02329o7479j56073m7200P8840j37684O7615
2959c8913N2149n3528k4517R4375r612J92855J53770r6837R332k0537j64823j34898
2947d1184P3546j2229K26058J6126P1039j82885j29308k08631j34327J99663K17961
2936I5829J48583N3204K5982r1622j82557L5518j24478O7447J60917J08995q39
2925B96979j16616k95408j54848j38042J26789K09866J07695N4577j12395j70344
$$ plain form
2915 -191747 -307890 -406264 -269996 -43805 151307 372270 468880 395637 255957 234306
2905 234306 117110 50754 101701 152712 121444 54019 67811 -53445 19247 41401 -93684
2894 -93684 -129841 -29660 29495 -50497 -8112 -63047 -146780 -105367 -120996 -115336 188944 128904
2882 128904 547 71190 -37202 -294961 -119479 -164220 -24096 324174 440954 300053
2872 300053 180839 72623 72147 52529 -139536 67438 353977 245890 47369 -21135 -43790
2861 -43790 -109865 -29541 -98303 -134479 -39245 -136117 -155944 -35668 45155 139979 248374
2850 248374 178546 176976 60224 -123214 -156693 30018 26406 24654 -25368 70554 163515 52286
2838 52286 2804 196348 256251 89590 131203 62537 98907 262790 332773 325399 402936
$$ packed form
2915a91747j16143r8374J36268K26191J95112K20963R6610p3243j39680k1651
2905B34306j17196o6356N0947N1011l1268o7425J3792j21256P2692K2154j35085
2894i3684l6157J00181N9155p9992M2385n4935q3733M1413j5629N660L04280o0040
2882A28904j28357P0643j08392k57759J75482m4741J40124L48270J16780j40901
2872C00053j19214j08216m76j9618j92065K06974K86539j08087j98521o8504k2655
2861d3790o6075Q0324o8762l6176R5234r6872j9827J20276Q0823R4824J08395
2850B48374o9828j570j16752j83438l3479J86711l612j752n0022R5922R2961j11229
2838E2286m9482J93544N9903j66661M1613o8666L6370J63883O9983p374P7537
$$ plain form
2827 402936 76747 -98407 -58045 -302775 -549578 -365514 -85384 -85713 9024 -36054 12844
2816 12844 37138 -221516 -242934 2801 171227 257680 405541 253867 163306 304898 76438
2805 76438 20046 70098 47722 12864 -75714 -143228 -22937 142515 160613 150162 205369
2794 205369 27170 -62389 -5088 213730 256856 160780 229115 180120 19520 -128926 -169367
2783 -169367 -252931 38730 -8451 6676 8264 -42811 -163519 4714 170084 287425 531988
2772 531988 497103 187963 67661 64364 -78205 16260 184544 16347 17012 91178 -374104
2761 -374104 -327014 -230201 -248985 78347 288198 137332 88330 79408 -128392 42763 167704
2750 167704 83561 204657 125578 17246 39381 22887 23214 179638 221041 80617 27109
$$ packed form
2827D02936l26189j75154M0362k44730k46803J84064K80130l29R4737m5078M8898
2816A2844K4294k58654k1418K45735J68426Q6453J47861j51674r0561J41592k28460
2805G6438n6392N0052k2376l4858q8578o7514J20291J65452J8098j0451N5207
2794B05369j78199q9559N7301K18818M3126r6076O8335m8995j60600j48446m0441
2783a69367q3564K91661m7181J5127J588n1075j20708J68233J65370J17341K44563
2772E31988l4885l09140j20302l297j42569R4465J68284j68197O65P4166m65282
2761c74104M7090R6813j8784L27332K09851j50866m9002q922k07800J71155J24941
2750A67704q4143J21096p9079j08332K2135j6494L27J56424M1403j40424n3508
$$ plain form
2739 27109 -66192 -152751 -37266 -23235 93085 431006 302449 342323 361837 98275 16994
2728 16994 3649 -183874 -141905 -98210 -388863 -332681 2900 21825 109574 297932 -49557
2717 -49557 -79432 -113757 -168612 89658 350074 378134 516442 673332 488051 289430 179480
2706 179480 -145427 -163925 -147025 -196366 -67091 415 -90570 -185005 -208451 -230654 -209176
2695 -209176 -135298 -184538 -24576 164835 226222 227427 39208 -10105 91265 -61965 -103550
2684 -103550 22294 -15438 -41585 -36591 -147362 -69501 44151 -93098 -52944 294486 248911
2673 248911 246137 313507 152773 -1519 35458 -15280 -12042 -10798 -178006 -71222 9980
2662 9980 48796 -18036 -13075 -310180 -269587 -23237 -106455 -42729 86648 122679 176160 129119
$$ packed form
2739B7109r3301q6559J15485J4031J16320L37921j28557L9874J9514k63562q1281
2728A6994j3345j87523M1969M3695k90653N6182L35581J8925Q7749J88358l47489
2717d9557k9875l4325n4855K58270K60416K8060J38308J56890j85281j98621j09950
2706A79480l24907j8498J6900m9341J29275O7506r0985r4435k3446k2203K1478
2695b09176P3878m9240J59962J89411O1387J205j88219m9313J01370j53230m1585
2684a03550J25844l7732k6147M994j10771P7861J13652j37249M0154L47430m5575
2673B48911k774O7370j60734j54292L6977n0738L238J244j67208J06784Q1202
2662I980L8816o6832M961k97105M0593K46350q3218O3726J29377L6031N3481m7041
$$ plain form
2650 129119 94012 165236 274448 306264 345606 210773 -34196 -78680 -65488 50567 210530
2639 210530 123573 260205 100139 -28152 -77039 -49284 33494 142199 265773 224688 241655
2628 241655 -105697 -396492 -303963 -80009 1139 185400 221407 161184 190214 -30052 -37893
2617 -37893 113686 -3524 -22789 162438 298981 340547 315699 -13845 -215262 -141114 -213682
2606 -213682 -391235 -207882 29740 76788 190637 78740 11115 -34078 -218074 -140342
2596 -140342 144426 180403 462256 557395 475157 425374 306982 -59210 -162464 -8539
2586 -8539 111042 348501 328425 217055 91917 -6845 -91878 153212 259733 217258 414439
2575 414439 285232 90 -51839 -66905 -28183 247305 227312 60993 61444 -162046 -412113
$$ packed form
2650A29119l5107P1224J09212L1816L9342j34833k44969m4484J3192J16055J59963
2639B10530q6957J36632j60066j28291m8887K7755Q2778J08705J23574m1085J6967
2628B41655l47352k90795R2529K23954Q1148J84261L6007o0223K9030k20266p841
2617c7893J51579j17210j9265J85227J36543M1566k4848l29544k01417P4148p2568
2606b13682j77553J83353K37622M7048J13849j11897o7625m5193j83996P7732
2596a40342K84768L5977K81853R5139q2238m9783j18392l66192j03254J53925
2586h539J19581K37459k0076j11370j25138r8762q5033K45090J06521m2475J97181
2575D14439j29207k85142n1929j5066L8722K75488j9993j66319M51k23490k50067
$$ plain form
2564 -412113 -337526 -352388 -80336 217243 -15801 -99304 46224 -34299 -84840 179831 343296
2553 343296 378136 387085 273786 256495 263166 120524 147312 216959 109330 -28100 71013
2542 71013 -92534 39376 99011 -81993 -140980 -91148 -102761 -92444 12929 90086 181284
2531 181284 2660 -111552 -48754 -137520 -268757 -156507 134794 23729 34904 121406
2521 121406 5183 20797 -82091 -119792 22684 232980 363232 292548 256626 52421
2511 52421 131104 170171 195618 252519 37226 -278374 -249941 -50891 -218452 -143928 -213166
2500 -213166 -173965 -143064 -314770 -298798 -8726 151467 72663 41749 -123595 -231939 -67140
2489 -67140 -162550 -119101 227332 365873 423900 340039 237076 88209 -63531 -142785 91350
$$ packed form
2564d12113P4587j4862K72052K97579k33044q3503J45528q0523n0541K64671J63465
2553C43296L4840Q949j13299j7291O671j42642K6788O9647j07629j37430R9113
2542G1013j63547J31910N9635j81004n8987M9832j1613J0317J05373P7157R1198
2531A81284j78624j14212O2798q8766j31237J12250K91301j11065J1175Q6502
2521A21406j16223J5614j02888l7701J42476K10296J30252p0684l5922k04205
2511E2421P8683L9067K5447N6901k15293l15600K8433J99050j67561P4524o9238
2500b13166L9201L0901j71706J5972K90072J60193p8804l0914j65344j08344J64799
2489f7140r5410M3449L46433J38541N8027q3861j02963j48867j51740p9254K34135
$$ plain form
2478 91350 244206 345144 359852 242033 296931 -30169 -166474 -171122 -132724 -105853 -174637
2467 -174637 -188397 -262965 -226232 -261100 -197286 -136905 -95174 112049 153602 103692 -18752
2456 -18752 98486 303812 247542 314261 279829 208421 140081 143644 165698 101174 66484 -41402
2444 -41402 41293 -16355 -5573 70888 28518 -59040 -42479 -37758 -1135 124800 283616 396239
2432 396239 293411 185606 -57647 -69335 -50970 -54505 44252 74210 319942 164490 -120368
2421 -120368 -14384 67992 22560 64719 197763 280391 417409 413556 37047 62344 95057
2410 95057 -91085 43759 108037 -26072 -15466 -47838 -254192 -108028 -58675 903 189249
2399 189249 338621 253616 135826 186166 69366 57752 200400 119365 90358 217899 319801
$$ packed form
2478I1350J52856J00938J4708j17819N4898l27100j36305m648L8398K6871o8784
2467a74637j3760p4568L6733l4868O3814O0381M1731K07223M1553m9910j22444
2456a8752J17238K05326n6270O6719l4432p1408o8340L563K2054o4524l4690j07886
2444d1402Q2695n7648J0782P6461m2370q7558J6561M721L6623J25935J58816J12623
2432C96239j02828j07805k43253j1688J8365l535R8757K9958K45732j55452k84858
2421a20368J05984Q2376m5432M2159J33044Q2628J37018l853l76509K5297L2713
2410I5057j86142J34844O4278j34109J0606l2372k06354J46164M9353N9578J88346
2399A89249J49372q5005j17790N0340j16800j1614J42648q1035k9007J27541J01902
$$ plain form
2388 319801 434845 395027 198842 123378 219799 61847 24541 104393 175560 292443 268747
2377 268747 215942 209754 70503 24375 138057 78401 -11281 -34477 -158577 -221299 -112718
2366 -112718 79126 237030 145273 218675 277809 98319 218793 271561 165230 351463
2356 351463 633997 649919 614078 579210 397400 151827 -11438 25522 235655 439225
2346 439225 443071 347458 420098 367097 216746 235528 402811 525499 549567 575117 439293
2335 439293 608984 679778 805960 973579 1075042 988105 956836 1037911 969659 1116031 1431945
2324 1431945 1710896 2017280 2079085 2227103 2620131 3232644 4454245 6491611 9113260
2315 9113260 10390332 9545326 7989322 6467306 5401823 4602977 3667084 3047637 2356629
$$ packed form
2388C19801J15044l9818j96185p5464R6421j57952l7306P9852P1167J16883k3696
2377B68747n2805o188j39251m6128J13682n9656q9682k3196j24100o2722J08581
2366a12718J91844J57904r1757P3402N9134j79490J20474N2768j06331J86233
2356C51463K82534J5922l5841l4868j81810k45573j63265L6960K10133K03570
2346D39225L846r5613P2640n3001j50351J8782J67283J22688K4068K5550j35824
2335D39293J69691P0794J26182J67619J01463q6937l1269Q1075o8252J46372L15914
2324A431945K78951L06384O1805J48018L93028O12513J221601K037366K621649
2315I113260J277072q45006j556004j522016j065483p98846r35893o19447o91008
$$ plain form
2306 2356629 1819727 1357601 1053480 968419 829628 785324 823222 850036 966371 862666
2296 862666 565579 581419 530000 502825 540482 772703 810983 739674 523887 302926 297329
2285 297329 272012 175288 248373 345605 194979 106487 277922 268326 214128 303116 243235
2274 243235 45689 -50959 11122 -91824 29169 63082 155365 149822 136344 130303 191984
2263 191984 36679 35354 39496 -87516 48719 301903 477662 487878 461482 139181 128879
2252 128879 -31093 -183656 -38903 86637 115529 170536 196337 2600 -62467 -41472 -96208
2241 -96208 -77603 51597 70151 190944 121045 -54332 -48870 -230441 -228198 -21897 181927
2230 181927 91106 161608 166458 -10713 11195 88662 68367 189271 305278 110561 58278
$$ packed form
2306B356629n36902m62126l04121q5061j38791m4304L7898K6814J16335j03705
2296H62666k97087J5840n1419k7175L7657K32221L8280p1309k15787k20961n597
2285B97329k5317r6724P3085R7232j50626q8492J71435r596n4198Q8988n9881
2274B43235j97546r6648O2081j02946J20993L3913R2283n543j3478o041O1681
2263A91984j55305j325M142j27012J36235K53184J75759J0216k6396l22301j0302
2252A28879j59972j52563J44753J25540K8892N5007K5801j93737o5067K0995n4736
2241i6208J8605J29200J8554J20793o9899j75377N462j81571K243K06301K03824
2230A81927r0821P0502M850j77171K1908P7467k0295J20904J16007j94717n2283
$$ plain form
2219 58278 -44677 -19798 79296 205674 179653 241920 10744 -391757 -302779 -158063 -120104
2208 -120104 -97789 -89993 -199767 -172269 -199914 -197987 -56456 185685 292547 265473 102368
$$ packed form
2219E8278j02955K4879R9094J26378k6021O2267k31176m02501Q8978J44716L7959
2208a20104K2315P796j09774K7498k7645J927J41531K42141J06862k7074j63105
$$ [...]
##END NTUPLES=NMR SPECTRUM
##END=
