##TITLE=1H_DE-80H_X3
 200.13MHz, d2o
 8 sc
 
 19ns.26.2.2025
##JCAMPDX= 6.0         $$ Bruker NMR JCAMP-DX V2.0
##DATA TYPE= NMR SPECTRUM
##DATA CLASS= NTUPLES
##ORIGIN= UXNMR, Bruker Analytische Messtechnik GmbH
##OWNER= pz
$$ XWIN-NMR		Version 3.5
$$ Fri Jan 30 09:56:12 2026 Russian Standard Time (UT+4h)  Yarkov@DPX200
##.OBSERVE FREQUENCY= 200.1313
##.OBSERVE NUCLEUS= ^1H
##.ACQUISITION MODE= SIMULTANEOUS
##.ACQUISITION SCHEME= undefined
##.AVERAGES= 8
##.DIGITISER RES= 18
##SPECTROMETER/DATA SYSTEM= spect
##.PULSE SEQUENCE= zg30
##.SOLVENT NAME= DMSO
##.SHIFT REFERENCE= (INTERNAL, DMSO, 0, 15.4957)
##AUDIT TRAIL= $$ (NUMBER, WHEN, WHO, WHERE, WHAT)
$$ ##TITLE= Audit trail, XWIN-NMR		Version 3.5
$$ ##JCAMPDX= 5.01
$$ ##ORIGIN= Bruker BioSpin GmbH
$$ ##OWNER= Yarkov
$$ C:/Bruker/XWIN-NMR/data/yarkov2/nmr/H-C/1/pdata/1/auditp.txt
$$ ##AUDIT TRAIL=  $$ (NUMBER, WHEN, WHO, WHERE, WHAT)
(   1,<2026-01-30 09:54:38.68 +0400>,<Yarkov>,<DPX200>,
      <created by zg, POWCHK disabled, PULCHK disabled
       configuration hash MD5:
       00 E9 B6 7A A2 85 ED C7 34 08 36 98 17 FE 4E 26
       data hash MD5: 16K
       21 29 36 C0 16 EB DA 80 0F 3F CA 62 24 56 DB 8D>)
(   2,<2026-01-30 09:54:43.34 +0400>,<Yarkov>,<DPX200>,
      <Start of raw data processing
       efp BC_mod = 2 LB = 0.25 FT_mod = 6 PKNL = 1 PHC0 = -5296.897 PHC1 = 7.62193 SI = 16K 
       data hash MD5: 16K
       7A 3D BD 30 31 2C 78 F9 10 99 3C 8A C9 7E F0 47>)
(   3,<2026-01-30 09:55:10.00 +0400>,<Yarkov>,<DPX200>,
      <pk PHC0 = -9.207617 PHC1 = 7.2 
       data hash MD5: 16K
       30 AB C7 AB F0 40 7A D0 36 FC B8 B0 0E 8F 87 85>)
$$ ##END=
$$ 
$$ hash MD5
$$ DC EE DE AC 3A DE 75 86 A5 6F 46 AB F0 D0 8B 12
##$RELAX= 
##$RELAX= 
##$RELAX= 
##$RELAX= 
##$RELAX= 
##$RELAX= 
$$ Bruker specific parameters
$$ --------------------------
##$DU= <C:/Bruker/XWIN-NMR>
##$EXPNO= 1
##$NAME= <H-C>
##$PROCNO= 1
##$TYPE= <nmr>
##$USER= <yarkov2>
##$AMP= (0..31)
100 100 100 100 100 100 100 100 100 100 100 100 100 100 100 100 100 100 
100 100 100 100 100 100 100 100 100 100 100 100 100 100 
##$AQSEQ= 0
##$AQ_mod= 1
##$AUNM= <au_zg>
##$AUTOPOS= <>
##$BF1= 200.13
##$BF2= 200.13
##$BF3= 200.13
##$BF4= 200.13
##$BF5= 200.13
##$BF6= 200.13
##$BF7= 200.13
##$BF8= 200.13
##$BYTORDA= 1
##$CFDGTYP= 0
##$CFRGTYP= 5
##$CHEMSTR= <none>
##$CNST= (0..31)
1 1 145 1 1 1 1 1 1 1 1 1 1 1 1 1 1 1 1 1 1 1 1 1 1 1 1 1 1 1 1 1 
##$CPDPRG= <>
##$CPDPRG1= <>
##$CPDPRG2= <>
##$CPDPRG3= <>
##$CPDPRG4= <mlev>
##$CPDPRG5= <mlev>
##$CPDPRG6= <mlev>
##$CPDPRG7= <mlev>
##$CPDPRG8= <mlev>
##$CPDPRGB= <>
##$CPDPRGT= <>
##$D= (0..31)
0 0.7 0 0 0 0 0 0 0 0 0 0.03 0 0 0 0 0 0 0 0 0 0 0 0 0 0 0 0 0 0 0 0 
##$DATE= 1769752478
##$DBL= (0..7)
120 120 120 120 120 120 120 120 
##$DBP= (0..7)
150 150 150 150 150 150 150 150 
##$DBP07= 0
##$DBPNAM0= <>
##$DBPNAM1= <>
##$DBPNAM2= <>
##$DBPNAM3= <>
##$DBPNAM4= <>
##$DBPNAM5= <>
##$DBPNAM6= <>
##$DBPNAM7= <>
##$DBPOAL= (0..7)
0.5 0.5 0.5 0.5 0.5 0.5 0.5 0.5 
##$DBPOFFS= (0..7)
$$ [...]
##$SUBNAM2= <"">
##$SUBNAM3= <"">
##$SUBNAM4= <"">
##$SUBNAM5= <"">
##$SUBNAM6= <"">
##$SUBNAM7= <"">
##$SUBNAM8= <"">
##$SUBNAM9= <"">
##$SW= 18.0517328524113
##$SWIBOX= (0..15)
0 0 2 0 0 0 0 0 0 0 0 0 0 0 0 0 
##$SW_h= 3612.71676300578
##$TD= 16384
##$TD0= 1
##$TE= 0
##$TE2= 300
##$TE3= 300
##$TEG= 300
##$TL= (0..7)
0 120 120 120 120 120 120 120 
##$TP= (0..7)
150 150 150 150 150 150 150 150 
##$TP07= 0
##$TPNAME0= <>
##$TPNAME1= <>
##$TPNAME2= <>
##$TPNAME3= <>
##$TPNAME4= <>
##$TPNAME5= <>
##$TPNAME6= <>
##$TPNAME7= <>
##$TPOAL= (0..7)
0.5 0.5 0.5 0.5 0.5 0.5 0.5 0.5 
##$TPOFFS= (0..7)
0 0 0 0 0 0 0 0 
##$TUNHIN= 0
##$TUNHOUT= 0
##$TUNXOUT= 0
##$USERA1= <user>
##$USERA2= <user>
##$USERA3= <user>
##$USERA4= <user>
##$USERA5= <user>
##$V9= 5
##$VALIST= <valist>
##$VCLIST= <CCCCCCCCCCCCCCC>
##$VD= 0
##$VDLIST= <DDDDDDDDDDDDDDD>
##$VPLIST= <PPPPPPPPPPPPPPP>
##$VTLIST= <TTTTTTTTTTTTTTT>
##$WBST= 1024
##$WBSW= 4
##$XGAIN= (0..3)
0 0 0 0 
##$XL= 0
##$YL= 0
##$YMAX_a= 150230
##$YMIN_a= -143346
##$ZGOPTNS= <>
##$ZL1= 120
##$ZL2= 120
##$ZL3= 120
##$ZL4= 120
##$ABSF1= 0
##$ABSF2= 0
##$ABSG= 0
##$ABSL= 0
##$ALPHA= 0
##$AQORDER= 0
##$ASSFAC= 0
##$ASSFACI= 0
##$ASSFACX= 0
##$ASSWID= 0
##$AUNMP= <proc_1d>
##$AZFE= 0.1
##$AZFW= 0.1
##$BCFW= 0
##$BC_mod= 2
##$BYTORDP= 0
##$COROFFS= 0
##$CY= -3
##$DATMOD= 1
##$DC= 0
##$DFILT= <>
##$DTYPP= 0
##$F1P= 0
##$F2P= 0
##$FCOR= 1
##$FTSIZE= 16384
##$FT_mod= 6
##$GAMMA= 0
##$GB= 0
##$INTBC= 1
##$INTSCL= 3.241238e-09
##$ISEN= 128
##$LB= 0.25
##$LEV0= 0
##$LPBIN= 0
##$MAXI= 10000
##$MC2= 0
##$MEAN= 0
##$ME_mod= 0
##$MI= 1.114404
##$NCOEF= 0
##$NC_proc= -6
##$NLEV= 6
##$NOISF1= 3.799351
##$NOISF2= 2.8
##$NSP= 0
##$NTH_PI= 0
##$NZP= 0
##$OFFSET= 15.4957
##$PC= 1
##$PHC0= -5306.104
##$PHC1= 14.82193
##$PH_mod= 1
##$PKNL= yes
##$PPARMOD= 0
##$PSCAL= 0
##$PSIGN= 0
##$REVERSE= no
##$SF= 200.130005204483
##$SI= 16384
##$SIGF1= 3
##$SIGF2= 2
##$SINO= 0.751879
##$SIOLD= 32768
##$SREGLST= <19F.Aceton>
##$SSB= 0
##$STSI= 16384
##$STSR= 0
##$SW_p= 3612.71676300578
##$SYMM= 0
##$S_DEV= 0
##$TDeff= 16384
##$TDoff= 0
##$TI= <>
##$TILT= no
##$TM1= 0
##$TM2= 0
##$TOPLEV= 0
##$USERP1= <user>
##$USERP2= <user>
##$USERP3= <user>
##$USERP4= <user>
##$USERP5= <user>
##$WDW= 1
##$XDIM= 16384
##$YMAX_p= 511829410
##$YMIN_p= -728826
$$ End of Bruker specific parameters
$$ ---------------------------------
##NTUPLES= NMR SPECTRUM
##VAR_NAME=  FREQUENCY,     SPECTRUM/REAL,   SPECTRUM/IMAG
##SYMBOL=    X,             R,               I
##VAR_TYPE=  INDEPENDENT,   DEPENDENT,       DEPENDENT
##VAR_FORM=  AFFN,          ASDF,            ASDF
##VAR_DIM=   16384,         16384,           16384
##UNITS=     HZ,            ARBITRARY UNITS, ARBITRARY UNITS
##FACTOR=    0.220516191357247, 1,           1
##FIRST=     3101.1544981333, 0,             0
##LAST=      -511.562264872483, 0,           0
##MIN=       -511.562264872483, -728826,     0
##MAX=       3101.1544981333, 511829410,     0
$$ Real data points
##PAGE= N=1
##DATA TABLE= (X++(R..R)), XYDATA
$$ [...]
8607B406548o3304k37566j65418k7253j35558k16302n9159J36157N572r5620j78778
$$ 2406548 2343244 2105678 1940260 1913007 1777449 1561147 1501988 1638145 1643717 1548097 1369319
8596A369319k43821j20353p2309q1043L0185K05841Q3884k0947j03202K7098N1720
$$ 1369319 1125498 1005145 932836 851793 881978 1087819 1171703 1150756 1047554 1074652 1126372
8585A126372J49087Q6589j34739q9675K9784Q9000K20755L53415L2560j00975
$$ 1126372 1275459 1362048 1227309 1137634 1167418 1256418 1477173 1830588 1863148 1762173
8575A762173j39678o7017L32437K2113k53653l1096J3446j48251j54080j77630
$$ 1762173 1622495 1555478 1887915 1910028 1656375 1625279 1638725 1490474 1336394 1158764
8565A158764k17905q5616o1386p2943Q8123M9807k38978j62346L8742L3059Q4102
$$ 1158764 940859 855243 793857 720914 809037 858844 619866 457520 496262 529321 613423
8554F13423J62125O2261j3655p3086j96185o5039J27089j54136r5112J02033P7589
$$ 613423 775548 837809 824154 751068 554883 489844 616933 462797 367685 469718 547307
8543E47307J01573r0733k13080k2260K4851k53309k4064J30973K0227J17200O3648
$$ 547307 648880 558147 345067 322807 347658 94349 70285 201258 221485 338685 402333
8532D02333j46594j04783K322k4147K36104R8875o2788j02998j0640k5710J14359
$$ 402333 255739 150956 153278 129131 365235 464110 401322 298324 287684 261974 376333
8521C76333K15252J11875m6043j16019k38603o7394N2128J88014K97720O4272
$$ 376333 591585 703460 657417 541398 302795 235401 287529 475543 773263 837535
8511H37535j91680k94892Q7862J47722M6881j30220j41938Q2263Q9498k5795j30010
$$ 837535 645855 350963 438825 586547 633428 503208 361270 443533 533031 507236 377226
8500C77226M4270L3322j55409j76764L1283O9297o6275j66891l1826J10208R1760
$$ 377226 421496 454818 299409 122645 153928 223225 156950 -9941 -41767 68441 160201
8489A60201m3719p9976M8611J51693J01740K2034J09731J29984K36993L5856J71825
$$ 160201 116482 36506 85117 236810 338550 360584 470315 600299 837292 873148 1044973
8478A044973J06221k1607n5292n9577l0001K11808J88921j14130k79300k55917
$$ 1044973 1151194 1129587 1074295 1014718 984717 1196525 1385446 1271316 992016 736099
8468G36099q1274l024j2549j65831j63014m5025J01323O2892m367M1684k03762
$$ 736099 654825 651801 639252 473421 310407 265382 366705 429597 425230 466914 263152
8457B63152k89277j51003J14245J94784N2471q0131J26454J34675J30874K6022
$$ 263152 -26125 -177128 -62883 131901 184372 104241 230695 365370 496244 522266
8447E22266J34888L52930J91706j33338j47051J0742J2325J68396J37294R5011
$$ 522266 657154 1010084 1201790 1068452 921401 932143 944468 1112864 1250158 1345169
8437A345169q3110k04819p6250N6614m9446j94472k90290k44221L5926J01844
$$ 1345169 1262059 1057240 980990 1037604 988158 793686 503396 259175 295101 396945
8427C96945J7299l1815K0733R0684J27739P0210j55598k24183o1490p2138l0717
$$ 396945 414244 382429 403162 493846 621585 691795 536197 312014 250524 178386 147669
8416A47669M3216j1058K46682K91680J74807R0267R2223j91665l1578K17785K63031
$$ 147669 190885 179827 426509 718189 892996 983263 1075486 883821 852243 1070028 1333059
8405A333059K90039J30541j02934L6558R3339q6406j87369l39954m49664j64471
$$ 1333059 1623098 1753639 1650705 1687263 1780602 1694196 1506827 1166873 717209 552738
8395E52738K16384K23112J1555k52501k97135j28110l9204K4898J27397O2833
$$ 552738 769122 992234 1003789 751288 454153 326043 286839 311737 439134 501967
8385E01967j73663j59649J3884J47302k9982r5766j08924R1322K7258k4449J66173
$$ 501967 328304 168655 182539 329841 299859 204093 95169 186491 213749 189300 355473
8374C55473J49186K42769J42368J05954r4485N7482oJ8688N2445n7309k1863L384
$$ 355473 504659 747428 889796 995750 901265 958747 958741 977429 1029874 972565 950702 954086
8362I54086j36999k08435j62799l4396N6241q3000j13755r0213O2880N0108J1845
$$ 954086 817087 608652 445853 411457 467698 384698 270943 180730 243610 293718 305563
8351C05563j0714j08381m7213l3554O8668J63170J8765k23079j78483M1396K51993
$$ 305563 294849 186468 139255 105701 174369 337539 356304 133225 -45258 -3862 248131
8340B48131L7841q2938k25722j41308O5260J48653J96536q729j45034m9615J45448
$$ 248131 285972 203034 -22688 -163996 -98736 49917 246453 237724 92690 43075 188523
8329A88523J14654O1437n9157k53503k12073K5691J44840J68402p0976q9183M698
$$ 188523 303177 364614 305457 51954 -160119 -134428 10412 178814 107838 18655 23353
8318B3353J14443k373r2147L965J87840J34835j25828k07248r383n4771N5492
$$ 23353 137796 135423 43276 47241 235081 369916 244088 36840 27457 -27314 28178
8307B8178R9971J73133q267j75366j39059K0710J08381j1410j28522l9317K37077
$$ 28178 128149 301282 293015 117649 -21410 -700 107681 96271 -32251 -71568 165509
8296A65509K08768r1101k45464m4791J00585J32646l1246k07866k86854N1459
$$ 165509 374277 283176 37712 -7079 93506 226152 194906 -12960 -299814 -248355
8286b48355J21169K14014K00245J35307j14627j97921k08088r0715R2053J32550
$$ -248355 -127186 86828 287073 422380 307753 109832 -98256 -188971 -96918 35632
8276C5632K3326P5744r7883j77254p5761j18595K41125K16370j3452Q8896J3369
$$ 35632 58958 134702 36819 -140435 -216196 -334791 -93666 122704 109252 198148 211517
8265B11517p7572O7310n0752p6590m4026R0586J29926m9562M700k8289p2841j69484
$$ 211517 133945 201255 150503 73913 29887 120473 250399 200837 205537 177248 104407 -65077
8253f5077o5565J44632L0344j37636j72687m1094J24276K16315k9405j09476J60690
$$ -65077 -130642 13990 44334 -93302 -265989 -307083 -182807 33508 4103 -105373 55317
8242E5317R7752j73999m4520m0888j00835J09904K09980J44052O8878q6981k27694
$$ 55317 153069 -20930 -65450 -106338 -207173 -97269 112711 256763 325641 238660 10966
8231A0966r7628Q0165j6301j31906o2164M0241J49830Q8600M4841N1695j11357
$$ 10966 -86662 -6497 -22798 -154704 -216868 -176627 -26797 61803 106644 158339 46982
8220D6982r0935Q3440n9851j05469J55482J60695O2742J9393k26653j34730R4115
$$ 46982 -43953 39487 -20364 -125833 29649 190344 253086 272479 45826 -88904 5211
8209E211r1724m7904J73401P194Q89R2072R1215K4983j01180k73598j07354J55031
$$ 5211 -86513 -134417 38984 46178 47067 139139 230354 255337 154157 -119441 -226795 -71764
8197g1764J25087J09237j70988m62228k58170L81515K40705K29904M5200j77557
$$ -71764 53323 162560 -8428 -470656 -728826 -347311 -106606 123298 168498 -9059
8187i059j24203J06969K01251j3504n335j12244j04542M4970M3564J2093P5058
$$ -9059 -133262 -26293 174958 161454 156119 43875 -60667 -15697 27867 39960 115018
8176A15018m2881J23229J39231l4667k03879j44273m6633L6339O5630R1379K00447
$$ 115018 72137 195366 334597 299930 96051 -48222 -94855 -58516 7114 98493 298940
8165B98940J24583j10970k43865j86594j05354N3098Q8696L9590k9979Q7920J74835
$$ 298940 423523 312553 68688 -117906 -223260 -170162 -81466 -41876 -71855 16065 190900
8154A90900M2270n733m192M9451k1451j57105k63998j2598K65416J96935m3433
$$ 190900 233170 227437 223245 272696 251245 94140 -169858 -182456 82960 279895 236462
8143B36462l0453l8691l6300o9833j36756j41991n1413K34955K72461J91099q0041
$$ 236462 206009 167318 131018 61185 -75571 -217562 -268975 -34020 238441 429540 349499
8132C49499k19191k26903M8913J64011P3170j08469j10505K73146K02765l0760
$$ 349499 130308 -96595 -47682 116329 189499 81030 -29475 243671 446436 415676
8122D15676k40439k62791q9699J45625M8236K4719L8873j94812j40179J44333
$$ 415676 175237 -87554 -177253 -31628 16608 41327 80200 -114612 -254791 -110458
8112a10458J13991j9180O992q5963J3034l834J09263O9138L7323m2044p0512M7608
$$ -110458 3533 -15647 -8655 -94618 -81584 -85418 23845 92983 130306 88262 17750 65358
8100F5358P6806N263j50985l7371J98367J62888r2927l6864p2306o3115K8537
$$ 65358 142164 147427 -3558 -40929 157438 320326 227399 190535 118229 55114 83651
8089H3651Q6241P3978j8463q970o5692M8033j67927k85798o4489J33483J53036
$$ 83651 169892 243870 225407 216437 150745 198778 30851 -254947 -319436 -185953 -32917
8078c2917O1633J3803Q9561J50146l4698j71519o4927q5310j1797J27501R0653
$$ -32917 28716 42519 132080 282226 247528 76009 11082 -74228 -86025 41476 132129
8067A32129o7327q3584M4347J79605K09337k68891k72912J12595O8555L5831J47819
$$ 132129 64802 -18782 25565 205170 414507 145616 -127296 -14701 53854 89685 237504
8056B37504K9311k1113J597j33654M772J78778j01440k99704J44331K6808r3394
$$ 237504 266815 245702 247299 113645 118417 297195 195755 -103949 40382 67190 -26204
8045b6204J09533O5798R9391N6227j2607k98595k06713j3673K11653K13463K1864
$$ -26204 83329 149127 248518 304745 292138 -6457 -213170 -226843 -15190 198273 220137
8034B20137k00996j36017j45415j08250M6612K7275K30390K44242J7715R689J52450
$$ 220137 19141 -116876 -262291 -370541 -323929 -296654 -66264 177978 195693 205382 357832
8023C57832j16601l67828j10185J64924J94783O5705k71931j72097J81628K62901
$$ 357832 241231 -126597 -236782 -71858 122925 188630 -83301 -255398 -73770 189131
8013A89131P0804m1062r2698k97985n0813J72416K49163J44440j5497p1826p6513
$$ 189131 259935 218873 126175 -171810 -222623 -50207 198956 343396 327899 256073 179560
8002A79560j28505N8927R3222O4162n057l7599j4011j65024M9911O8171P5043
$$ 179560 51055 109982 203204 267366 262309 224710 210699 45675 95586 163757 238800
7991B38800n8329j69485k59860r0917K43795P8633p2665m4325L8453K5807J27693
$$ 238800 180471 10986 -248874 -339791 -95996 -17363 -90028 -134353 -95900 -70093 57600
7980E7600Q1393K8557M2125k7844m8972k9573j02698j1517M6139J45123J70706
$$ 57600 138993 167550 209675 181831 132859 103286 588 -10929 35210 180333 351039
7969C51039j6921j51161j33736n983l0412J80213J26841j07465j02509K0669m1131
$$ 351039 334118 182957 49221 43238 12826 193039 319880 212415 109906 130575 89444
7958H9444k8496L9013O9847O516j42334n8399L5696R8452J339N5029J75832J64864
$$ 89444 60948 99961 169808 176324 33990 -24409 11287 109739 111078 166107 341939 506803
7946E06803q3288j50377q7310r842k0045j22110N2810J63415R2412K3212L1469
$$ 506803 423515 273138 185828 175986 155941 33831 86641 250056 342468 365680 397149
7935C97149j69733j21334l3469k7028K8704L049p7834J1504K05680Q7117O5786
$$ 397149 227416 106082 72613 45585 74289 77338 -496 11008 216688 303805 369591
7924C69591p1031k51886j70932j12831L1427J52792J64625O5650J73495r1352
$$ 369591 298560 46674 -124258 -237089 -205662 -52870 111755 177405 350900 259548
7914B59548k20469j34193L6852J51609R6539k4609q0710R3517L9930k34502j11213
$$ 259548 39079 -95114 -58262 93347 189886 165277 84567 178084 218014 -16488 -127701
7903a27701M3671O8004N3782m0353P43M1140p652P2567J16653Q9323m8885j78913
$$ -127701 -84030 -16026 37756 -2597 -1854 39286 31634 104201 220854 310177 261292 82379
7891H2379m6317M0783N6322N2949k0159J57308m4521k27502j98623K0894J93027
$$ 82379 36062 76845 133167 186116 165957 323265 278744 51242 -147381 -126487 66540
7880F6540J60682p704j22492j07983m2246K584N7246O7747J05542J26345j35660
$$ 66540 227222 219518 97026 -10957 -53203 -50619 6627 74374 179916 306261 170601
7869A70601j90156k32049j56478O6284J70874K25883J81597R797m5693p1009l5134
$$ 170601 -19555 -251604 -408082 -341798 -170924 54959 236556 246353 200660 129651 94517
7858I4517J4529Q2851j20263j59152O8969J51865n252J04933N8704J0290n8430
$$ 94517 109046 191897 71634 -87518 -18549 133316 128064 232997 291701 301991 243561
7847B43561k56242j42143K43044O3833k06412j21430J96636J68333J29565K3346
$$ 243561 -12681 -154824 88220 152053 -54359 -175789 20847 189180 318745 342091
7837C42091P0316Q8062j28287j05754j06391q7876j2342L1844J44013J23784Q4094
$$ 342091 412407 500469 372182 266428 160037 72161 59819 91663 235676 359460 443554
7826D43554j86629q1597M0593n945j22015J8909R5746L2108j0479n7007k5715
$$ 443554 256925 175328 215921 209976 87961 106870 202616 234724 224245 167238 141523
7815A41523o1369r8312j01732K9782p0781J25563J56057L1776K9274K03j33015
$$ 141523 80154 -18158 -119890 -90108 -160889 -35326 120731 152507 181781 181984 48969
7804D8969n6335j80028p6330R8820J82502P8814Q5246l8820j11508q3271l8680
$$ 48969 -7366 -187394 -263724 -164904 17598 96412 181658 142838 31330 -51941 -90621
7793i0621J29224J36633p6752j40596J30599K44830J93439j29947j37139O443
$$ -90621 38603 175236 98484 -42112 88487 333317 526756 396809 259670 266113
7783B66113p0559j14226R0325J84730R9505l3853j30572k08635P629L9924r4571
$$ 266113 195554 81328 171653 356383 455888 422035 291463 82828 90457 130381 35810
7772C5810q6767k1023N2970L8075N4921o2226p219J38690K1513r6835l7783J36132
$$ 35810 -50957 -71980 -19010 19065 73986 11760 4541 143231 164744 67909 30126 166258
7760A66258J88179l5105j11636j3655N4250l9622L327N6969K6464j84395l07485
$$ 166258 354437 319332 207696 194041 248291 208669 211996 268965 295429 111034 -196451
7749a96451j58629L02890L87500J02996k68413j82960j45563j48846J84304K30608
$$ -196451 -355080 -52190 335310 438306 169893 -13067 -158630 -307476 -123172 107436
7739A07436J81390K42614j05487l42095j83182J9849M8785O6799J70491l5966
$$ 107436 288826 531440 425953 83858 -99324 -79475 -30690 36109 206600 170634
7729A70634j45173m602K2207J48143O0030k04389k21595N5351J84107J5219l0599
$$ 170634 25461 20859 43066 191209 251239 46850 -174745 -119394 64713 79932 49333
7718D9333l4234L1418O2260r4795M4582J84205j2754q2152j5009n4480M7125K17613
$$ 49333 15099 46517 108777 13982 58564 242769 230015 147863 132854 78374 125499 343112
7706C43112N828j10706O4097J3424j34635O1080j78362j73706K50951K24539Q895
$$ 343112 348940 238234 302331 315755 181120 242200 63838 -109868 141083 365622 374517
7695C74517p0931j11689j15678J9516r8214j26040N5635m7901r438K33354M5676
$$ 374517 303586 191897 76219 95735 -2479 -128519 -72884 -120785 -130223 103131 148807
7684A48807j56519p7697j51534j3207L36446L4924k39074J71322J30421J66445
$$ 148807 -7712 -85409 -236943 -250150 86296 121220 -117854 53468 183889 350334
7674C50334K42496k9604k88143q0674n7746p5505J24849Q1047l7116N3837j5292
$$ 350334 592830 563226 275083 194409 136663 61158 186007 267054 229938 283775 268483
7663B68483j04377j3051L5689n1871J37305J09018r5424Q2189j2002j41180k7266
$$ 268483 164106 151055 186744 134873 272178 381196 285772 367961 355959 214779 187513
7652A87513r4007n4424J21395k6079j26701O4272Q4826j24505j47646J1700M3198
$$ 187513 93506 39082 160477 134398 7697 71969 156795 32290 -115356 -103656 -60458
7641f0458P8460L7105j13242l9322J10679J1126j1080O8814q2543r8882k7057
$$ -60458 18002 55107 -58135 -97457 13222 24348 13268 82082 -461 -99343 -126400
7630a26400J96041L20664N6352k42824p8181k5335l6057k0880P1395J52324K83775
$$ -126400 69641 390305 446657 203833 125652 100317 64260 43380 114775 267099 550874
7619E50874Q5604j75030k35866q0978o6086o8298L4579r3110J26190K55071J58938
$$ 550874 636478 461448 225582 144604 78518 10220 44799 -48311 77879 332950 491888
7608D91888j31308j99980n5861m8384j49998j84560J4992J39017j0191J0367K72449
$$ 491888 360580 160600 104739 56355 -93643 -278203 -263211 -124194 -134385 -124018 148431
7597A48431K14591p4891k90216j66970P3066J41330L2058j3295K71537j1205j94755
$$ 148431 363022 288131 -2085 -169055 -95989 45341 77399 64104 335641 324436 129681
7586A29681m8840K5966J38150p273q3794R9161Q8959m5797q8955r682J25184J10183
$$ 129681 80841 106807 244957 237684 153890 253051 342010 296213 207258 197576 322760 432943
7574D32943n5207j51558r8502p7754O4271J47871j09553j98311o2893P7719J46433
$$ 432943 377736 226178 127676 49922 114193 262064 152511 -45800 -108693 -30974 115459
7563A15459J11281p3479j50322J2144J01147R2711M1698j61574k85500J1169K84915
$$ 115459 226740 153261 2939 15083 116230 208941 250639 89065 -196435 -185266 99649
7552I9649K81885M71k39743j10224R3325Q8424M7699J80965K34567L00676M34447
$$ 99649 381534 382005 142262 32038 125363 213787 261486 442451 677018 977694 1412141
7541A412141J21743o4598j34676l76770n21653j62474O3253n0603n9715p2627
$$ 1412141 1533884 1469286 1334610 957840 436187 273713 336966 286363 226648 154021
7531A54021O742L6889n7065k69559q4191J50309R4332K94745P6203j95972r0635
$$ 154021 160763 197652 140587 -128972 -213163 -62854 31478 326223 402426 206454 115819
7520A15819j34849j98172O9660J87468P303p0526l6007O7712K54200Q2942k04749
$$ 115819 -19030 -217202 -147542 39926 47229 -23297 -59304 8408 262608 345550 140801
7509A40801m2506j10093n7793O5894N0979J28526J76031J15300j56924j10006
$$ 140801 98295 -11798 -69591 -3697 47282 175808 351839 467139 310215 200209
7499B00209j5804p0182P996J43915o3744j3049N2026M5225J2452o3030j24258
$$ 200209 184405 114223 122219 266134 202390 189341 241367 286592 299044 236014 111756
7488A11756j11931J4658j04340o863J8461l0072J0297L1819K6570J75919R4851
$$ 111756 -175 14483 -89857 -96720 -78259 -108331 -98034 -66215 -39645 136274 231125
7477B31125o4461N0351J90143j45022k91384j02961O31P5452K13168J37860p1303
$$ 231125 166664 217015 407158 262136 -29248 -132209 -131578 -56126 157042 294902 223599
7466B23599L8625k24766k56130J93557K61875J5182L7226R252j24923l1935J6099
$$ 223599 262224 37458 -218672 -25115 236760 251942 289168 298420 173497 141562 157661
7455A57661J6601O0787o5624j16205L4145O0291J9225K6661R2673M9784M6695
$$ 157661 174262 235049 169425 53220 87365 147656 166881 193542 286215 335999 382694
7444C82694k58394k32911O5142N4134J2663M6770Q3324Q1246J10868j9397k76987
$$ 382694 124300 -108611 -43469 10665 23328 70098 153422 234668 345536 326139 49152
7433D9152k33214R0255J28445J55923p786q7586M886J06879J08488l5550j51551
$$ 49152 -184062 -93807 34638 190561 182775 95189 100075 206954 315442 279892 128341
7422A28341j88907j21593q8523O7388K46629K49284n7451j740J80272J9122o6853
$$ 128341 -60566 -182159 -270682 -203294 43335 292619 235168 233428 413700 432822 365969
7411C65969k19810k27600m3488J66905K43825Q6277j2581q3998j60439q2694j13156
$$ 365969 146159 -81441 -124929 41976 285801 372078 359497 275499 115060 32366 -80790
7400h0790j0496J49129q6123j09874P3760L03093P6625j67745k03639J25221L52295
$$ -80790 -91286 57843 -28280 -138154 -64394 238699 315324 147579 -56060 69161 421456
7389D21456l247l81634k09054M3118J92859J95969J03756j2933n7793j54391k62331
$$ 421456 418209 36575 -172479 -129361 63498 259467 363223 350290 292497 138106 -124225
7378a24225J0472J89910M6100j094N5365Q1425J03776o7833j55599k7564p370
$$ -124225 -113753 76157 122257 121163 176528 257953 361729 293896 138297 110733 103363
7367A03363m6817P8500J00592m0828p3291K4441r1023R4097J78809J0796j26596
$$ 103363 56546 135046 235638 194810 121519 145960 54937 149034 327843 338639 212043
7356B12043j46256p5757M0610k9432l9155N7621K17588N9552k19039n0583n8513
$$ 212043 65787 -9970 30640 1208 -37947 19674 237262 296814 77775 27192 -31321
7345c1321M409m7891j14944J72726J79128N0229q9990j36505m5599k6438j08298
$$ -31321 -26912 -74803 -189747 -17021 162107 212336 122346 -14159 -59758 -86196 -194494
7334a94494j00238J78640K86716M8521M199R9720J13099o3833k88268k28201J17689
$$ -194494 -294732 -116092 170624 219145 223344 323064 436163 372330 84062 -144139 -26450
7323b6450K94909Q9801j14464J3226r681M1059L7957K5362K6722j36817j91042
$$ -26450 268459 358260 243796 257022 247341 288400 326357 351719 378441 241624 50582
7312E0582j57325J12137J89549Q0155j04911j74616j14147J46757K2984j23489
$$ 50582 -106743 5394 194943 275098 170187 -4429 -118576 28181 51165 -72324
7302g2324m027k3113J62963J18206P8961p2400j1211m3899k12619j32108M5059
$$ -72324 -76351 -99464 63499 181705 260666 188266 177055 133156 -79463 -211571 -166512
7291a66512J56233J56721J12496M7947r6473k16857q0418J07715K55240J30705
$$ -166512 -10279 146442 258938 306885 210412 -6445 -86863 20852 276092 406797
7281D06797r4545j38204R372J34925K049j14757K6660J6216p5268N9626M7431
$$ 406797 312252 174048 183420 318345 320394 205637 232297 248513 173245 232871 280302
7270B80302q0689j37201j99381J9677J94544J19335j30132m4989m0677r3449j5494
$$ 280302 199613 62412 -136969 -117292 77252 196587 66455 21466 -19211 -112660 -128154
7259a28154n2633J26568Q9665n3406K4926M9810Q3408p9298l0578r756q2217N4040
$$ -128154 -180787 -54219 35446 -17960 6966 56776 140184 60886 30308 20552 -61665 -7625
7247g625j36726k9453L37838K54156R7628J0224j27850p4452j08410q5532l7366
$$ -7625 -144351 -173804 164034 418190 515818 526042 398192 323740 215330 129798 92432
7236I2432J35751J67394N9866Q5702j35521j12316j87694k05927O8783K06410
$$ 92432 228183 395577 455443 541145 405624 293308 105614 -100313 -31530 174880
7226A74880k8603o8511j1841k3327J9743N6073o0579j42215O4438o2706k9377
$$ 174880 146277 77766 65925 42598 62341 118414 57835 -84380 -19942 -82648 -112025
7215a12025P3829N6732N2811J4444K4382P6218O0914p6643r0852N5990R0357k2497
$$ -112025 -38196 18536 71347 85791 110173 186391 247305 170662 79810 135800 226157 203660
7203B03660m9507j70795N8947K67413m5216p4238o9024p0412J51035N4820k45838
$$ 203660 154153 -16642 42305 309718 264502 190264 121240 50828 201863 256683 10845
7192A0845j77238K01491K92792J77670R4545k09444l60205j16373n2810J46531
$$ 10845 -166393 35098 327890 505560 600105 390661 30456 -85917 -138727 7804
7182G804R4206N0862j04333J09697K43900n7822j80861k08417j38154J46058J13414
$$ 7804 102010 152872 48539 158236 402136 344314 163453 -44964 -183118 -37060 76354
7171G6354K0406J99226M9280q173K5318n0940j98559p5502j03529r4685J66051
$$ 76354 96760 295986 345266 337093 362411 311471 112912 37410 -66119 -160804 5247
7160E247J83574o7891Q5744J2245O3365j4900k35753j71605K1294K19466J56399
$$ 5247 188821 120930 206674 218919 282284 267384 31631 -139974 -118680 100786 257185
7149B57185J61430J72731j11367j77763k93799k00643K29363J25402j21731J01615
$$ 257185 418615 591346 479979 302216 8417 -192226 37137 162539 40808 142423
7139A42423J06958l3996p9525j26437p3539J42091N9356k52951L5993J70820m282
$$ 142423 249381 215385 135860 9423 -64116 77975 137331 -115620 -79627 91193 86911
7128H6911K36604J62956L9787M5567k10811l80292j68078J9333k0825M26423L71297
$$ 86911 323515 486471 526258 571825 361014 -19278 -187356 -168023 -188848 237575 608872
7117F08872j58679k67223k36987j72889K34241K86166k3537n848l9572p4216K3657
$$ 608872 450193 182970 -54017 -226906 7335 293501 269964 264116 224544 150328 173985
7106A73985J03463j11774o0736l9768k13508J37397K11523R2820P4848q9929q0766
$$ 173985 277448 165674 104938 65170 -148338 -10941 200582 293402 368250 278321 197555
7095A97555J09513P7911n4181j54867R0546K3399J53914J20152k09028j57938
$$ 197555 307068 384979 330798 175931 266477 289876 443790 563942 354914 196976
7085A96976q8246j35307j26958N5756J21784L9592J61703J714j12856m0836j94858
$$ 196976 108730 -26577 -153535 -97779 24005 63597 225300 227014 114158 73322 -121536
7074a21536K0943L23064R0153q0481p2565j40924Q457q722r4315M3669K77729
$$ -121536 -100593 222471 312624 232143 159578 18654 27111 18389 -75926 -32257 245472
7063B45472J60951j80814j39858q0413j0408J99965J53086J85235j05625k78038
$$ 245472 406423 225609 85751 5338 -5070 194895 347981 533216 427591 149553
7053A49553k37976J06586K56289j3663m8324L5031k04855P616J63842J06835o5933
$$ 149553 -88423 18163 274452 260789 212465 247496 42641 50257 214099 320934 255001
7042B55001k05996m1232J56828K34582j21130j64047J893K4204J80264J65515
$$ 255001 49005 7773 164601 399183 278053 114006 115899 140103 320367 485882
7032D85882j09706p4303k21154k06815J24613K55359p5455j98759K0884P0245
$$ 485882 376176 301873 80719 -126096 -1483 253876 178421 -20338 546 70791
7022G0791P0088R6447q5845m9397R5010r1893m9593j4249q4704j9808K01866K59463
$$ 70791 140879 237326 151481 102084 197094 105201 55608 41359 -43345 -63153 138713 398176
7010C98176P6215l8632k37520j21495l0427j23239M2905J45232J39347J80961
$$ 398176 474391 435759 198239 76744 46317 -76922 -34017 111215 250562 431523
7000D31523k7329l7737j15338j45868Q9528N9681L6328j04719j61447N1882J84084
$$ 431523 404194 366457 251119 105251 194779 254460 290788 186069 24622 76504 260588
6989B60588P5667j18245j06332j62131p8027J92537J69363R793o0570j00679M6957
$$ 260588 336255 218010 111678 -50453 -128480 64057 233420 243213 182643 81964 128921
6978A28921J50714J9237j87002j62393J27820K54075J58411q4397j68750j3626
$$ 128921 279635 298872 111870 -50523 77297 331372 489783 405386 236636 223010
6968B23010k3762J4573N1964r7544p6026k2643J8891J02342J71696o6755k85507
$$ 223010 199248 213821 265785 168241 92215 69572 88463 190805 362501 295746 10239
6957A0239k988K21662J18558j04069l69319j44977K76799J42641L1080L4231R0763
$$ 10239 7251 228913 347471 243402 -125917 -270894 5905 148546 179626 213857 304620
6946C04620J07346o7901k11214j39735M2947L4339L6706J20598L8587N8066K3985
$$ 304620 411966 344065 132851 -6884 36063 70402 107108 227706 266293 324359 348344
6935C48344j99611q0333n2310q3305M862K03673M20272K0716l27110k69559J8786
$$ 348344 148733 68400 16090 -67215 -62353 141320 561592 582308 255198 -14361 4425
6924D425L75161Q6142m3493q8265j47242r3206q0220N3707K02651O1190j76568
$$ 4425 379586 465728 422235 333970 186728 93522 13302 67009 269660 330850 154282
6913A54282p3165J23900K63982J7266j21309r5325j5208M6374j86493j35777J1529
$$ 154282 81117 205017 468999 486265 364956 269631 254423 300797 114304 -21473 -9944
6902i944m6381R5339J86587j252p7465j71538p9140Q8428Q9410j31867N1363J03305
$$ -9944 -56325 39014 225601 224349 146884 -24654 -103794 -15366 74044 -57823 -6460 96845
6890I6845M6138K12750m6303j72282r5867K3739N1946K9589o1380j18490J86471
$$ 96845 142983 355733 309430 137148 41281 65020 116966 146555 85175 -33315 153156
6879A53156J44456p6244n1268N5386j6123o1964p6751k1522K08257J39245p8805
$$ 153156 297612 221368 170100 225486 209363 147399 70648 49126 257383 396628 317823
6868C17823o8904n0834q0288o3943q5349J61075J66106K3618j52924p4475J6744
$$ 317823 248919 198085 117797 53854 -31495 129580 295686 319304 166380 91905 108649
6857A08649J1043l0439J39513o738j79476p0254m5111J56271J11420j12476j42300
$$ 108649 119692 89253 228766 222028 42552 -27702 -72813 83458 194878 82402 -59898
6846e9898J48095O4936N081m7762k8858k5432J30629l3004j36182J97664P7873
$$ -59898 88197 153133 158214 110452 81594 56162 186791 153787 17605 215269 293142
6835B93142q3137r5780m2936J6601J66380P4302N4249j1159k58037l41956J43527
$$ 293142 210005 114225 71289 87890 254270 328572 382821 371662 113625 -228331 -84804
6824h4804K79401J6265M2699j23099R4656K14539j93897l15617n4091J06032O9677
$$ -84804 194597 210862 253561 130462 225118 439657 245760 -69857 -123948 -17916 51761
6813E1761J03356l1805j07564J71267J89170j83661N4042O9848k3243o0027k12792
$$ 51761 155117 123312 15748 187015 376185 192524 246566 316414 293171 233144 20352
6802B0352n7019K37320J67692K0090M194j27539j71761O6311o6620o6062K30091
$$ 20352 -36667 200653 368345 388435 392629 265090 93329 159640 93020 26958 257049
6791B57049P1677r2096Q0515l330k30678P9366Q1053k0736j12664j13274m8170
$$ 257049 328726 236630 317145 313815 83137 162503 243556 222820 110156 -3118 -51288
6780e1288K29136J96207j30701Q985M614M5635N5926k12150j71617P5890J94158
$$ -51288 177848 374055 243354 252339 256953 302588 358514 146364 -25253 50637 244795
6769B44795J07337J11174j23145j98183l9887J19239L4719K6430J6971k3445O6660
$$ 244795 352132 463306 340161 141978 102091 221330 256049 282479 299450 276005 342665
6758C42665R2164L0445m1691n5647k18661k56237n3797O0198K07441K17269p9244
$$ 342665 434829 465274 423583 367936 149275 -106962 -160759 -100561 106880 324149 244905
6747B44905j65541j1722K33390N2854j30345j63527j3117J51222K5070J5359j0346
$$ 244905 79364 67642 301032 353886 223541 60014 46897 198119 223189 238548 228202
6736B28202K3189o5538q8463l9036N1829R4857J13300J6640m5049j40527j41172
$$ 228202 251391 185853 97390 58354 110183 205040 318340 334980 289931 149404 8232
6725H232K02213K45435J05182o8653j08261j61140n2516q6470j24106J81193K42671
$$ 8232 210445 455880 561062 492409 384148 223008 170492 84022 -40084 141109 383780
6714C83780J1187l9883j34527r5529J12239n1825j28180j26584j5946L09261K67414
$$ 383780 394967 355084 220557 125028 237267 185442 57262 -69322 -85268 223993 491407
6703D91407j35474k43229j61368p0162n3171R547J35097K14615J57730p3202n3987
$$ 491407 355933 112704 -48664 -118826 -171997 -162450 -27353 187262 344992 271790 217803
6692B17803J13391R2453r4824j06481q5119m2366J5004k6750R0892J99775m2923
$$ 217803 331194 423647 328823 222342 137223 94857 109861 83111 174003 373778 330855
6681C30855r1266L6683N1140L9957o8813j15387n0709J50951N8753k30891r7832
$$ 330855 239589 276272 327412 367369 298556 183169 132460 283411 342164 111273 13441
6670A3441p0521J77145J28966r8270N4873R6485j08516j78799J0286J55615J92026
$$ 13441 -57080 120065 249031 150761 205634 302119 193603 14804 25090 180705 372731
6659C72731n7760k20306n7501J42273J13300L0733m5020j13144j80775o9129K04249
$$ 372731 314971 94665 37164 179437 292737 323470 278450 165306 -15469 -84598 119651
6648A19651L57915o971j29919n036n1089l3736j2207P5971J1145j09714j97013
$$ 119651 477566 470595 340676 335640 284551 250815 238608 314579 325724 216010 18997
6637A8997j54031J17871J35784k5494r0543N4915K35618O8920m7397j27464j14941
$$ 18997 -135034 -17163 118621 93127 2584 57499 293117 362037 314640 187176 72235
6626G2235p548N8848J61579J3463m4326j2244o1380L2816K3399k5754j3009P0057
$$ 72235 64687 123535 285114 298577 254251 242007 180627 213443 236842 211088 198079 268136
6614B68136o929o7377m3860L3095J12367J0295r4744j90293l5509L7362J84967
$$ 268136 261207 193830 149970 183065 295432 305727 210983 20690 -14819 22543 207510
6603B07510J08970j07941j39689j72796m2417K80383J29808n4874j11560k11883
$$ 207510 316480 208539 68850 -103946 -146363 134020 263828 208954 97394 -114489
6593a14489m7220K26278L07109P8462Q96k13470j73601J42601P1361r8623R2830
$$ -114489 -161709 64569 371678 450140 451036 237566 63965 206566 277927 179304 272134
6582B72134P3322O6544l9165r5355J89001J81230o7120k56654j8274j3878j36708
$$ 272134 345456 412000 372835 277480 466481 647711 580591 323937 305663 291785 155077
6571A55077R5261J87632Q5860j69138l12236j49181K63240K61850m3380k55451
$$ 155077 250338 437970 523830 354692 42456 -106725 156515 418365 374985 119534
6561A19534j64855o0947K6234M3601O3135J059n6345M240J37551J22786M4026
$$ 119534 -45321 -106268 -80034 -36433 26702 27761 -28584 -24344 113207 235993 280019
6550B80019r1044k01503r1934J7008L09628J97712J20672n9184m7082J8978J9862
$$ 280019 188975 -12528 -104462 -87454 222174 419886 540558 481374 434292 453270 473132
6539D73132q5067r5485J40591m1441j87098p6359J95736J22738L8907j07099q9211
$$ 473132 388065 292580 433171 391730 204632 128273 324009 446747 485654 378555 289344
6528B89344o4752k9870J17960J14252q642k02362p3389n423l275j40378q1302
$$ 289344 224592 194722 312682 426934 418292 215930 142541 137118 133843 -6535 -87837
6517h7837J10344L17587P2457m7719q142p9491j97868J5038J10888L4851N7931
$$ -87837 22507 340094 412551 364832 356690 277199 79331 94369 205257 240108 298039
6506B98039l7894J333O3116O4668o6044P2739n149L1676J2503k19856o1053o902
$$ 298039 260145 261478 324594 389262 323218 395957 390808 422484 434987 215131 154078 147176
6494A47176K1506J42398K33468m0132k38103k40717j5425K91936K11285q3088
$$ 147176 168682 311080 544548 504416 266313 25596 10171 302107 513392 430304
6484D30304k04399j68601q8062J64027K11476L5434n5510n4483K4348R6052m5131
$$ 430304 225905 57304 -30758 133269 344745 380179 324669 270186 294534 390586 345455
6473C45455q7472j18084o166Q6636R4792P3903l6003M2621M5783j22494J626K00624
$$ 345455 257983 139899 133733 220369 315161 389064 353061 395682 441465 318971 320597 521221
6461E21221R8711j08906j30319j47644L4787K26310J37691j25560j83877j63417
$$ 521221 619932 511026 380707 233063 267850 494160 631851 506291 322414 158997
6451A58997N5158j9500r0681j39219R3142J55967J39401J06578L895r4944j05522
$$ 158997 214155 194655 103974 -35245 57897 213864 353265 459843 463738 368794 263272
6440B63272j36027l7933J05369J51662K78874M4090j85587k77446n5542R6192
$$ 263272 127245 89312 194681 346343 625217 669307 483720 206274 150732 246924
6430B46924K04951J09716n1072l0395O5052j8981j5581m6346M9767p9081k08262
$$ 246924 451875 561591 510519 480124 545176 526195 510614 464268 514035 434954 226692
6419B26692j3613J51893J31122j78082j37209j81j3789Q4959J4485P6560p3126
$$ 226692 213079 364972 496094 318012 180803 180622 166833 251792 266277 342837 269711
6408B69711j76215n5095K43835J39761j33909k70941m1214J74076J61966J2170
$$ 269711 93496 38401 282236 421997 288088 17147 -24067 150009 311975 324145
6398C24145N3560J32467J2872l5501l6235l8962j88283o2725K04584J33822N1829
$$ 324145 377705 510172 523044 487543 451308 412346 224063 161338 365922 499744 551573
6387E51573L6947q5677J2547r4997j25622O4556J97006L8322j78684j06265k7532
$$ 551573 588520 502843 515390 420393 294771 359327 556333 594655 415971 309706 282174
6376B82174l0898l0426p9237m7850R5132J49782K3307j58027j89658r4523R9139
$$ 282174 251276 220850 141613 93763 188895 338677 361984 203957 14299 -80224 18915
6365A8915K38102R0937J7628r8537M8497l4970n4216K9563K0528j17883m0224
$$ 18915 257017 347954 365582 267045 315542 280572 226356 255919 276447 158564 118340
6354A18340N1532l8276J98608K52832J18960j64048j76228j2843J36493J44187
$$ 118340 169872 131596 330204 583036 701996 537948 361720 348877 485370 629557
6344F29557j05297n3242R0900l5243O463L7368j26971j70733k19492m0859J74513
$$ 629557 524260 471018 561918 526675 533138 570506 443535 272802 53310 12451 186964
6333A86964K36827K7353q2438O6258j28356j34202P9937O1842j09636k00464j13917
$$ 186964 423791 451144 368706 434964 306608 172406 252343 314185 204549 4085 -109832
6322a09832J82484L65959Q7160j15915p6261j56418l80N3941K0723P2752L6303
$$ -109832 72652 438611 525771 409856 333595 177177 176797 230738 251461 324213 360516
6311C60516J6870J16549J13049j5893j09969j11702O203N2389J09086J6746q75
$$ 360516 377386 493935 606984 591091 481122 369420 375623 428012 537098 553844 552969
6300E52969l1525j15027J8895N2483n004J8115P7703L2240j17381q2645j2560
$$ 552969 521444 406417 425312 477795 472791 490906 568609 600849 483468 400823 388263
6289C88263j25249j17717j4676K08578K52175M5728J19927k9995j23117j33345
$$ 388263 263014 145297 130621 339199 591374 637102 757029 727034 603917 470572
6279D70572j60021O016J14389q1415n8742K1383R5311J33322R9971j8640m00311
$$ 470572 310551 316567 430956 349541 290799 312182 407493 540815 640786 622146 221835
6268B21835k34154R0948L25425K46098o2105j6865L3552P8873L4889p0292j34615
$$ 221835 -12319 78629 404054 650152 588047 571182 604734 683607 718496 648204 513589
6257E13589j6505K46712O5233r0432P1772o5512q1597J60804J0666n2112l8503
$$ 513589 497084 743796 809029 718597 790369 724857 643260 804064 814730 762618 724115
6246G24115M1476K6079J05861o7770k12294j04577N667Q6025K59766k9679k57501
$$ 724115 765591 791670 897531 829761 617467 512890 518557 604582 864348 834669 577168
6235E77168j75306J26067L14252L8479k11328k66944l8K24504J94988J19777j4606
$$ 577168 401862 527929 842181 880660 669332 402388 402350 626854 821842 941619 927013
6224I27013j88717N896M0320n0077P0541M8459j7729M4315K95875O4010p3592
$$ 927013 738296 744192 784512 734435 804976 853435 835706 880021 1175896 1239906 1166314
6213A166314n8814j27647J72225Q8964k72140m7875J84442J45044J46900m1130
$$ 1166314 1107500 979853 1152078 1241042 968902 921027 1105469 1250513 1397413 1356283
6203A356283j77741n2688J35535J30449K20046O7335j92432N0782J49501o5843
$$ 1356283 1178542 1125854 1261389 1391838 1611884 1679219 1486787 1537569 1687070 1621227
6193A621227J93547J55979J8650O6540J71727m9314L7713K53565J49419L70318
$$ 1621227 1814774 1970753 1989403 2055943 2227670 2178356 2216069 2469634 2619053 2989371
6183B989371M54616N7916J46196L88037O36448Q93573Q39255N35716P05618J100528
$$ 2989371 3443987 3501903 3648099 4036136 4672584 5566157 6405412 6941128 7646746 8747274
6173H747274J163481J170940Q87621P8577m49698l97355o87795p21039q31234
$$ 8747274 9910755 11081695 11969316 12047893 11598195 11200840 10513045 9792006 8960772
6164H960772j128404n81665k19669k97112l39573k03753j58871j26224L12921
$$ 8960772 7832368 7250703 7031034 6733922 6394349 6190596 6031725 5905501 6218422
6155F218422M48684K85280K21206J41736N05016J043450J208369J183528J457769
$$ 6218422 6667106 6952386 7173592 7315328 7820344 8863794 10072163 11255691 12713460
6146A2713460J824722K274352K704665K505880J788032R71419k95209j268249
$$ 12713460 14538182 16812534 19517199 22023079 23811111 24782530 24487321 23219072
6138B3219072j766007k307610k431677k116492j866997j674718j118380r95509
$$ 23219072 21453065 19145455 16713778 14597286 12730289 11055571 9937191 8941682
6130H941682q94998n41053l51744n02945k33063j08237r2149J55497K26363J09326
$$ 8941682 8046684 7505631 7153887 6650942 6417879 6309642 6217493 6372990 6599353 6708679
6120F708679L17785N25469O10807Q32434R09252Q18562R67182Q60006N61513M53735
$$ 6708679 7026464 7551933 8162740 8995174 9904426 10722988 11690170 12550176 13111689 13565424
6110A3565424m05925j088555j192479j146549j080340j057938r65799p42316m95453
$$ 13565424 13159499 12070944 10878465 9731916 8651576 7593638 6627839 5885523 5390070
6101E390070n05374n82981j86221k15259n76412m07250k75558l2469Q543o9177
$$ 5390070 4884696 4301715 4115494 3900235 3323823 2916573 2641015 2608546 2617089 2547912
6091B547912k13958j30476m3290O3887K6308j36872l34855j84367N5224J15645
$$ 2547912 2333954 2203478 2160188 2224075 2250383 2113511 1778656 1594289 1649513 1765158
6081A765158N0419r9650M9245J11794k2826j27810k10648j37001j59275L6071
$$ 1765158 1815577 1715927 1765172 1876966 1854140 1726330 1515682 1378681 1219406 1255477
6071A255477K65327j3926n6325n4592j29295P4737J46929m7429k03139j49012
$$ 1255477 1520804 1506878 1450553 1395961 1266666 1341403 1488332 1440903 1237764 1088752
6061A088752j37625m5991K21714J91185j2344j01510j58289p2706n1849J2051
$$ 1088752 951127 905136 1126850 1318035 1305691 1204181 1045892 973186 921337 933388
6051I33388O0589J5679R0959n1453j35358o5363r4376J18180Q0200K9204N2445
$$ 933388 993977 1009656 1100615 1049162 913804 848441 754065 872245 952445 981649 1034094
6040A034094j32965q330o5556J06535R9511R2136n3444j57936P2902O4442k75539
$$ 1034094 901129 892799 827243 933778 1033289 1125425 1071981 914045 986947 1051389 775850
6029G75850q2380Q2882L11682K13106j71738j91064j09118j4369R3722J02191
$$ 775850 693470 776352 1088034 1301140 1129402 938338 829220 814851 908573 1010764
6019A010764O4281K6243o2412k11390r7753J35905L8441K7244k6875k11766j81594
$$ 1010764 1075045 1101288 1038876 827486 729733 865638 904079 931323 904448 692682 511088
6008E11088j4050O6357J65327Q4338q4779j69221p1917J3459J3663J04792o6833
$$ 511088 497038 563395 728722 813060 728281 559060 487143 500602 514265 619057 552224
5997E52224k5070Q9100J13307J65767j5478r5446k4416L2785l5144J455K24836
$$ 552224 527154 616254 729561 895328 879850 784404 759988 792773 757629 759084 983920
5986I83920J32530o4236Q7939q4657n3839l6077j53552L2475j741n5247n2082
$$ 983920 1116450 1052214 1140153 1055496 1001657 965580 812028 844503 842762 787515 735433
5975G35433j6021O0193q3998m8599j49699j88944L8569n9557l4685J60943Q2489
$$ 735433 719412 779605 695607 647008 497309 308365 346934 287377 252692 413635 496124
5964D96124L4828r2668K6102J49307K6486k55862k48984J69611L22209J17303
$$ 496124 530952 438284 464386 613693 640179 384317 135333 304944 627153 744456
5954G44456j808n9163p0725L13p5249p6522k006R6292J0150J25596J92999l9403
$$ 744456 742648 683485 612760 613073 537824 461302 459296 555588 565738 691334 884333 844930
5942H44930j59328k48464j01871J82976K29010p3874j71919N3936J58937k2660
$$ 844930 685602 437138 335267 518243 747253 673379 501460 555396 714333 691673
5932F91673K0290j15269j75489n9582q5727J11205K87501J39064M2534L451l18438
$$ 691673 711963 596694 421205 361623 275896 387101 674602 813666 856200 859651 541213
5921E41213l12037k0735M8093J09115M51502M8078k20671j06956k83982J03259
$$ 541213 229176 208441 256534 365649 817151 865229 644558 537602 253620 356879
5911C56879L02723p1884j8310Q2269j54947k29927K07351J81090L6071O9103j53921
$$ 356879 659602 587718 569408 651677 496730 266803 474154 655244 691315 760418 606497
5900F06497q8147R5071j28755j17939R1032J22384J3958K8360j02751j28646J74107
$$ 606497 518350 613421 484666 366727 457759 580143 594101 622461 519710 391064 565171
5889E65171j4030j09542J63143O3766M3092P4628k35452j78894J25856J72733
$$ 565171 551141 441599 604742 668508 711600 786228 550776 371882 497738 670471
5879F70471N6544J06516M4340j63737L7170L3408j28001Q2559j18601k09219Q9862
$$ 670471 727015 833531 877871 714134 751304 784712 656711 739270 620669 411450 501312
5868E01312R3818j39371k78826M1180L74673L11241J22k98666r5229m9037k15552
$$ 501312 595130 455759 176933 218113 592786 904027 904149 605483 510254 461217 245665
5857B45665M7506K24656J56074N8274j51828r4758J08343J89448q9323p488O7167
$$ 245665 293171 517827 673901 732175 580347 485589 593932 783380 694057 686569 753736
5846G53736j22073j06799R6796J6560K68294L00485j38466r8860M5129j41142
$$ 753736 631663 524864 621660 638220 906514 1206999 1068533 969673 1014802 873660
5836H73660k03154K8616j9117j4765J43324Q9255J12229Q435l05169k61231L8620
$$ 873660 670506 699122 680005 665240 808564 897819 1010048 1018483 713314 452083 490703
5825D90703J96278k2210l8535k9841q546K27733p949r8999o4576j14460K051K31369
$$ 490703 686981 664771 626236 596395 587849 815582 807633 708634 644058 529598 531649 763018
5813G63018J03165r096J03151N0478j69970l2890q104j29576J22560R580Q5257
$$ 763018 866183 857087 960238 1010716 840746 807856 799752 670176 792736 802316 887573
5802H87573L61324P9048k21220k42589j12279Q1623J8973J09970J15081K85626
$$ 887573 1248897 1327945 1106725 864136 751857 833480 852453 962423 1077504 1363130
5792A363130n7314l66413j69982n8146P4095q5574j11788K34873J63287q4916
$$ 1363130 1305816 939403 769421 711275 785370 699796 588008 822881 986168 901252
5782I01252j24110P4150J00424j62507j96158L6831R4258J77150j0639M8699K6895
$$ 901252 777142 851292 951716 789209 593051 629882 724140 901290 890651 939350 966245
5771I66245J39565R4191j27830k25281j11479J2076L28501L01796k6399j83223
$$ 966245 1105810 1200001 1072171 846890 735411 747487 1075988 1377784 1351385 1168162
5761A168162k31086L0831k0825J52220P1839j06537L5000n1772J7032M2823j58673
$$ 1168162 937076 967907 947082 1099302 1171141 1064604 1099604 1047832 1064864 1107687 949014
5750I49014O5275N9234Q2184Q2535O5277j17390j12357P286q0239N8562J14812
$$ 949014 1014289 1073523 1155707 1238242 1303519 1186129 1073772 1081058 1000819 1059381 1174193
5739A174193j40458R056L04939P5099j51924j91610J70J06542N3839J4626n5895
$$ 1174193 1033735 1042791 1347730 1422829 1270905 1079295 1079465 1186007 1239846 1254472 1198577
5728A198577K5837j10349M1567K26866J1305K5002l6660j15534O4117j37154k983
$$ 1198577 1224414 1114065 1155632 1382498 1393803 1418805 1382145 1266611 1330728 1193574 1190591
5717A190591J49299O2743N3413J91750J84388j43514l46833j70919r8699Q0513
$$ 1190591 1339890 1402633 1456046 1647796 1832184 1688670 1341837 1170918 1072219 1152732
5707A152732k7495k3711K61691J0440j6876Q4708K35268J20156k30665k71714
$$ 1152732 1125237 1101526 1363217 1373657 1356781 1441489 1676757 1796913 1566248 1294534
5697A294534j1621J03598J48140R0565K48153J07323j81907k20884j01637M4369
$$ 1294534 1282913 1386511 1534651 1625216 1873369 1980692 1798785 1577901 1476264 1520633
5687A520633J30475M1691j19756m5593P1355Q297K20623O4313j66709j36240j20871
$$ 1520633 1651108 1692799 1573043 1527450 1598805 1607102 1827725 1892038 1725329 1589089 1468218
5676A468218J39546J11715P6101J57648l0583k55237j00459J02890J20013n2855
$$ 1468218 1607764 1719479 1795580 1953228 1922645 1667408 1566949 1669839 1789852 1736997
5666A736997k8115K86642J85531J16294l8192k03131p0482j47641L5482L32761
$$ 1736997 1708882 1995524 2181055 2297349 2259157 2056026 1985544 1837903 1873385 2206146
5656B206146K36432r3655j53593J23687J67855N517k27122l13456m4433Q4506
$$ 2206146 2442578 2348923 2195330 2319017 2486872 2492389 2265267 1951811 1907378 1991884
5646A991884J93267J76952J67009K8831L3720J41760l0371k23891j29897j20653
$$ 1991884 2185151 2362103 2529112 2557943 2591663 2733423 2703052 2479161 2349264 2228611
5636B228611O59L7650j0883K26499K07571j06610q6975Q539j3593j53174n383
$$ 2228611 2229270 2266920 2256037 2482536 2690107 2583497 2496522 2505061 2491468 2338294 2332911
5625B332911J44906L87616K87168k77040j63385J89447k1361j29303Q8462J45992
$$ 2332911 2477817 2865433 3152601 2875561 2712176 2901623 2880262 2750959 2839421 2985413
5615B985413J30775J41290R0524Q1984J23608k56056l14855R2056P7492j9629
$$ 2985413 3116188 3257478 3348002 3429986 3553594 3297538 2982683 3074739 3152231 3132602
5605C132602J4451j75949j9096K18459O5909j29870o4417p2592j5175K56114J0932
$$ 3132602 3147053 2971104 2952008 3170467 3236376 3106506 3042089 2969497 2954322 3210436 3221368
5594C221368j56563J75391J37274K86041K98404j29849j06154J18377J44316O0808
$$ 3221368 3064805 3240196 3377470 3663511 3961915 3832066 3725912 3844289 3988605 4049413
5584D049413J67486J07289p9487J35863M875n4896J49421n2288K3665L10655Q2032
$$ 4049413 4216899 4324188 4244701 4380564 4385439 4330543 4479964 4427676 4451341 4761996 4844028
5573D844028n8823l7340J17587R1J29649J29282R703J64966Q657o2390K65789
$$ 4844028 4785205 4747865 4865452 4865543 4995192 5124474 5134177 5299143 5307800 5245410 5511199
5562E511199J95378K1892L1830J00478K13279L67098K01361J0198J99095M50882
$$ 5511199 5706577 5728469 5760299 5860777 6074056 6441154 6642515 6652713 6851808 7302690
5552G302690M45745P33900P32296J21706l09480m33139l64415j06811J7774P0436
$$ 7302690 7748435 8482335 9214631 9336337 9026857 8593718 8229303 8122492 8140266 8210702
5542H210702K13205J97382j20023k36971J79953J99964K45747Q2541k6157J34119
$$ 8210702 8423907 8621289 8501266 8264295 8444248 8644212 8889959 8972500 8946343 9080462
5532I080462L60231J55776J43465K13428J5607P5508L18537J77766J32429J92750
$$ 9080462 9440693 9596469 9739934 9953362 9968969 10044477 10363014 10540780 10673209 10865959
5522A0865959R4876J97699M97851K96573M6544K20026L36723L94042N54931L90526
$$ 10865959 10960835 11158534 11656385 11952958 11999502 12219528 12556251 12950293 13505224 13895750
5512A3895750K44620K74372K69737K89693L20681K43137L04468N92298M40347
$$ 13895750 14140370 14414742 14684479 14974172 15294853 15537990 15842458 16434756 16875103
5503A6875103M49433N26043M67105J53342K30553L76946O69436R04519P81568
$$ 16875103 17324536 17850579 18317684 18471026 18701579 19078525 19747961 20652480 21434048
5494B1434048N29010O48040O91126O01177O84467P99811P85235R56596J124898
$$ 21434048 21963058 22611098 23302224 23903401 24587868 25387679 26172914 27129510 28254408
5485B8254408J015923J171160J390217J519876J596681J530537J700727J985289
$$ 28254408 29270331 30441491 31831708 33351584 34948265 36478802 38179529 40164818
5477D0164818K194187K335439K614897L017780L063199L199322L433613L738005
$$ 40164818 42359005 44694444 47309341 50327121 53390320 56589642 60023255 63761260
5469F3761260M057350M324616M693877N537345O106277O410885P025518P886921
$$ 63761260 67818610 72143226 76837103 82374448 88480725 94891610 101917128 109804049
5461A09804049Q877913R971749J1461050J3287416J5157950J7495481J9898699
$$ 109804049 118681962 128653711 140114761 153402177 168560127 186055608 205954307
5454B05954307K3140120K6855990L0525121L4022581L7253120L9156960L8498504
$$ 205954307 229094427 255950417 286475538 320498119 357751239 396908199 435406703
5447D35406703L4375859K6198712J4592433J255703j2440017k4157333l2315132
$$ 435406703 469782562 495981274 510573707 511829410 499389393 475232060 442916928
5440D42916928l7314276l9366791l8608142l6213271l2913559k9195098k5566328
$$ 442916928 405602652 366235861 327627719 291414448 258500889 229305791 203739463
5433B03739463k2250171j9099086j6615391j4534389j2398407j0710548r448071
$$ 203739463 181489292 162390206 145774815 131240426 118842019 108131471 98683400
5426I8683400q136196o970640o026707n252125m772353m449774m041763l645520
$$ 98683400 90547204 83576564 77549857 72297732 67525379 63075605 59033842 55388322
5418E5388322l248269k662934k477213k280017k134671k068600j912417j531480
$$ 55388322 52140053 49477119 46999906 44719889 42585218 40516618 38604201 37072721
5410C7072721j604954j586811j409511j199062j241500j225745r74831q64500
$$ 37072721 35467767 33880956 32471445 31272383 30030883 28805138 27830307 26965807
5402B6965807q51888r90760j036709q04113p81032q01985o20250m03796n13567
$$ 26965807 26113919 25123159 24086450 23282337 22501305 21699320 21079070 20675274 20161707
5393B0161707o79578p67098o25362o15608o44481o96320m25843l35293l96187
$$ 20161707 19482129 18715031 18089669 17474061 16829580 16133260 15707417 15372124 14975937
5384A4975937l59248m27434m28151n87736n46113m04223l19462k72485m13380
$$ 14975937 14616689 14189255 13761104 13173368 12627255 12223032 11903570 11631085 11217705
5375A1217705l09344k63193k16639l18459l27209q7199j59623k50869m76553m34674
$$ 11217705 10908361 10645168 10428529 10110070 9782861 9695662 9536039 9285170 8808617 8373943
5365H373943j90159L0090J21611J228k32544l77520l61274k46618j97494k02063
$$ 8373943 8183784 8213874 8335485 8336713 8104169 7726649 7365375 7118757 6921263 6719200
5355F719200p2761r2730j04723l3046p1682j74902j71474j82429p1478p0049k57568
$$ 6719200 6646439 6553709 6448986 6415940 6344258 6169356 5997882 5815453 5743975 5673926 5416358
5344E416358k45617j87212p0193m4277k4889p0916j94438k38209q9949J4527j09027
$$ 5416358 5170741 4983529 4913336 4869059 4844170 4773254 4578816 4340607 4250658 4265185 4156158
5333D156158j84465r8997N5937J43409J3408k04289j28722o0438L913J08460J4299
$$ 4156158 3971693 3872696 3928633 4072042 4085450 3881161 3752439 3692001 3695914 3804374 3818673
5322C818673p8972r4533k6162q3608j6672j17424r3484J58704K24333j00235k16987
$$ 3818673 3739701 3645168 3619006 3535398 3518726 3401302 3307818 3466522 3690855 3590620 3373633
5311C373633r0802m9339n5282j06223j83329m2064J14332J8423J23993K0267k60266
$$ 3373633 3282831 3233492 3178210 3071987 2888658 2846594 2960926 2979349 3103342 3123609 2863343
5300B863343k85998r4803O0996R9553O9013j26022n6409N5036K8438L0442j54100
$$ 2863343 2577345 2482542 2543538 2643091 2712104 2586082 2529673 2584709 2613147 2643589 2489489
5289B489489l92727k14274N191N4524L0331Q229m9896J6516R3183m6045r9292
$$ 2489489 2096762 1882488 1887679 1942203 1972534 1980763 1930867 1947383 2040566 1994521 1895229
5278A895229n3028j59295j36159R4897K16513P0276q2029k77354j10047J12732
$$ 1895229 1842201 1682906 1546747 1641644 1858157 1928433 1846404 1569050 1459003 1571735
5268A571735r6471j50233J041J04456M7738n5029j69129m4454K09435K13940J44887
$$ 1571735 1475264 1325031 1326072 1430528 1478266 1423237 1254108 1209654 1419089 1633029 1777916
5257A777916j56129l51742j83416n266J38556N0407L6016k7328j04226K01j7398
$$ 1777916 1621787 1270045 1086629 1081363 1219919 1270326 1306342 1279014 1174788 1174989 1157591
5246A157591j00485o0824r6748J6694J09806K6950j18498r2551l9975r9689J62955
$$ 1157591 1057106 996282 899534 916228 1026034 1052984 934486 841935 801960 702271 865226
5235H65226M7028k45627k79080K6480J53562J98696R9719j79197k63837j31986
$$ 865226 912254 666627 387547 414027 567589 766285 866004 686807 422970 290984
5225B90984q2614K08420M09342o5198k17907j43897P2831J45434J74051j57909
$$ 290984 208370 416790 826132 760934 543027 399130 471961 617395 791446 633537
5215F33537j58383M1633k4585j03491O9017N7713P3352k943k13503k5565J61857
$$ 633537 475154 516787 492202 388711 457728 515441 588793 585850 372347 346782 508639
5204E08639q0749r5061O8176L2827N8958Q0105J41374J11141L6263j65393j40197
$$ 508639 427890 332829 401005 433832 492790 572895 714269 825410 861673 696280 556083
5193E56083P9349l8619p7510O9751R6901J7168r6442k90629j50638m9105K309
$$ 556083 635432 596813 519303 589054 685955 703123 606681 316052 165414 116309 118618
5182A18618J50984R3688j10456k04515N1994O0747M5869m7963n7240M1946o1718
$$ 118618 269602 363290 252834 48319 100313 161060 206929 158966 101726 143672 81954
5171H1954o6874q2340J54416L71642Q3831j367L0207O1684q4019k23590n5313
$$ 81954 15080 -67260 87156 458798 542629 541262 571469 633153 549134 325544 270231
5160B70231J64465J2842j32906R26J90547n7106k85355j40147L1585J77499K0022
$$ 270231 434696 447538 314632 315558 506105 448999 163644 23497 55082 232581 252603
5149B52603k35932K6399K66743N9393k18307q0283k6696j17712j9546j3607M202
$$ 252603 16671 43070 309813 369206 150899 70616 43920 -73792 -93338 -106945 -102743
5138a02743K47610J74940n4446J9986o1789L283J14893P5193n0674K3310j0038
$$ -102743 144867 319807 265361 285347 223558 226841 341734 416927 366253 389563 379525
5127C79525m6120n4910j41361m1532J73756Q4978p7691m2606r5072k97177j53057
$$ 379525 333405 278495 137134 95602 269358 354336 276645 234039 138967 -158210 -311267
5116c11267J41352K37568K92073L7370j83130j87002k19029j20715K02245K56163
$$ -311267 -169915 67653 359726 397096 213966 26964 -192065 -312780 -110535 145628
5106A45628J16843K3217p5992k5980M8097L6344Q1956N1606j16504j08944L3061
$$ 145628 262471 285688 209696 183716 231813 268157 350113 401719 285215 176271 209332
5095B09332m8843j70281P9253J71880N7519K4414j8169l906j09552j49886j76991
$$ 209332 160489 -9792 69461 241341 298860 323274 305105 301199 191647 41761 -135230
5084a35230j2431L61768K48860O8047J9322k18042m05044r9471K94556K76462
$$ -135230 -147661 214107 462967 531014 550336 332294 -72750 -172221 122335 398797
5074C98797j8040j40359p9341J22991J14091o8389M1564J76397P4024j49499k67269
$$ 398797 380757 240398 161057 284048 398139 329750 371314 547711 621735 472236 204967
5063B04967j05786J54014J53768K10049L48597N5600k78459k69492j11472N966
$$ 204967 99181 253195 406963 617012 965609 1021209 742750 473258 361786 367752
5053C67752J09462J30585P0059o1971q1955p0630p0261J5272j06725j7317J9491
$$ 367752 477214 607799 677858 615887 533932 463302 393041 408313 301588 284271 303762
5042C03762J55091J96041K4819j61048m6124J39474J82673M2174j05468j9703
$$ 303762 458853 654894 679713 518665 472541 612015 794688 836862 731394 711691
5032G11691O6100L212N0737J32442J52488P4624M9513P6200N3111R5428J16089
$$ 711691 777791 781003 831740 964182 1116670 1191294 1240807 1317007 1370118 1465546 1581635
5021A581635J57693J92502R9311j04011j58840J58130L71040K17372L101O0443
$$ 1581635 1739328 1931830 2031141 1927130 1768290 1926420 2297460 2514832 2517933 2578376
5011B578376J91835J72097K67338M30106N38136P22491P51371P56901R63068J243241
$$ 2578376 2770211 2942308 3209646 3639752 4177888 4900379 5651750 6408651 7371719 8614960
5001H614960J458256J485171J159179N22011J47648n03295j015889j215222j323602
$$ 8614960 10073216 11558387 12717566 13239577 13387225 12883930 11868041 10652819 9329217
4992I329217r68781o04949o07267m45719j18113j89791k99404j23099P25J13762
$$ 9329217 8360436 7755487 7148220 6702501 6584388 6394597 6095193 5972094 5972819 6086581
4982F086581K98318K70966L35446M84030O19863P95473J205808J576523J744463
$$ 6086581 6384899 6655865 6991311 7475341 8095204 8890677 10096485 11673008 13417471
4973A3417471K277148K917487L314778L166318J749518R2409j128121k374431
$$ 13417471 15694619 18612106 21926884 25093202 26842720 26935129 25807008 23432577
4965B3432577l027497l067056k783799k214564j515604j217213r33310o26502
$$ 23432577 20405080 17338024 14554225 12339661 10824057 9606844 8673534 8047032
4957H047032n82258p32398n14574k41612O972K05322R354J3377K12756K66406
$$ 8047032 7464774 6732376 6217802 5976190 5983162 6188484 6197838 6211215 6423971 6690377
4947F690377L03910L40268O05397Q78081J115605J174040J146251J000981N61160
$$ 6690377 6994287 7334555 7939952 8818033 9933638 11107678 12253929 13254910 13816070
4938A3816070j85202m14271n67772p31831j065409j350384j336349j127294r04357
$$ 13816070 13630868 13216597 12648825 11916994 10851585 9501201 8164852 7037558 6133201
4929F133201q48834p19926n91477l90991k09867k78507m69138l74530k01933Q6970
$$ 6133201 5284367 4564441 3972964 3581973 3372106 3093599 2624461 2249931 2047998 2134968
4919B134968N99k2596L9310j00613j98378k92090m0385L11287m3330k94846q1237
$$ 2134968 2135567 2112971 2152281 2051668 1853290 1561200 1520815 1832102 1788772 1493926 1412689
4908A412689Q1734P8953L0999o4044N880K8665k27940k59710J21661N8344m2235
$$ 1412689 1494423 1573376 1604375 1540331 1546211 1574876 1346936 1087226 1208887 1267231 1224996
4897A224996J50752N3655l0778j08882k45653M1035J00502p5568j77497J57156
$$ 1224996 1375748 1429403 1398625 1289743 1044090 1085125 1185627 1110059 932562 1089718
4887A089718J57168j59098j52981j71518J5270J11043k51298j18260J95070M9798
$$ 1089718 1246886 1087788 934807 763289 778559 889602 638304 520044 715114 764912
4877G64912p6763L2921N6211o3827o2353L6112J16995J27070m5069r3893N6184
$$ 764912 688149 721070 777281 713454 651101 687213 804208 931278 886209 792316 848500
4866H48500p4189r8812P3065L8746p4194p3866M3512J35075K0120j80584j86942
$$ 848500 774311 675499 748564 787310 713116 639250 682762 817837 837957 657373 470431
4855D70431K8658M6657L5493M3324r1298n1964l932l1486N4376P9867L3113j5080
$$ 470431 499089 545746 581239 624563 533265 481301 477369 445883 500259 580126 613239 598159
4843E98159M5394O3468j19934n5442L5714J99504L17916Q9608o8489j85382k65164
$$ 598159 643553 707021 587087 531645 567359 766863 1084779 1174387 1105898 920516 655352
4832F55352j63233K2292M4957k3050k1904k0106R1745J48588J3111j23759j70110
$$ 655352 492119 514411 559368 536318 514414 494308 586053 734641 747752 623993 453883
4821D53883j03405j31N4103o4260k1418R5159J81336J58288j9610j04183j00018
$$ 453883 350478 350347 404450 340190 318772 413931 595267 753555 733945 629762 529744
4810E29744j0426j29494Q0224J43834L8059j33194k3510K99860J52001r4629k07127
$$ 529744 519318 389824 470048 613882 651941 518747 495237 795097 947098 852469 645342
4799F45342N4046L28525K52417M9140K41487K40505M31927K69298K52189K39347
$$ 645342 699388 1027913 1280330 1329470 1570957 1811462 2243389 2512687 2764876 3004223
4789C004223n9116k65106o09633n50765l62854k35603j38013k7235k9967o9751
$$ 3004223 2945107 2680001 2070368 1519603 1156749 921146 783133 755898 725931 656180
4779F56180m4380j23426q3394J628o5330p5294R9859q9885J1810K33083p2096
$$ 656180 611800 488374 404980 406608 341278 265984 365843 275958 287768 520851 448755
4768D48755j31288r3279j7338J90068Q9371J894j0141M56P4619J89524J35179
$$ 448755 317467 224188 206850 396918 486289 488183 478042 478498 553117 742641 877820
4757H77820l612q5058j77202k76384J23038J84177j97989j11102K2564J37850
$$ 877820 874208 789150 611948 335564 458602 642779 444790 333688 356252 494102
4747D94102O787k9966o1079l4040K0358j44559p1605N5628M769L6482M2883K1717
$$ 494102 500889 470923 409844 375804 396162 251603 179998 235626 240395 276877 319760 341477
4735C41477q060r6606j3013K1503q2747l5617R8136J88386J71005J81071O8959
$$ 341477 333417 236811 223798 245301 162554 126937 225073 413459 584464 765535 834494
4724H34494l18274j33419q4928j32000O4170K02420J84088Q2360r7856o2580m4556
$$ 834494 516220 382801 297873 165873 230043 432463 616551 698911 601055 538475 493919
4713D93919r5115j23146o3406J60900K07334J79137j17882j95053j45793J2299
$$ 493919 398804 275658 212252 373152 580486 759623 641741 446688 300895 313194
4703C13194R8168J14903j85307q9665K06259L64937r096j32924p3908M680J78572
$$ 313194 411362 526265 340958 251293 457552 822489 813393 680469 606561 611241 789813
4692G89813R5426r040q5614j9860O41K0658N3551J01777j14520p3813L9203K0859
$$ 789813 885239 876199 790585 770725 771366 792024 845575 947352 832832 759019 798222 819081
4680H19081p4694r8439J34700Q1255J32952M7452j5826j1389n9037m5630J84024
$$ 819081 744387 645948 780648 861903 994855 1042307 1026481 1015092 956055 910425 1094449
4669A094449K52128P4582k04112j12806J16687j9676j7327R6294J42672r8992
$$ 1094449 1346577 1421159 1217047 1104241 1220928 1201252 1183925 1280219 1422891 1323899
4659A323899k4129J61857J51818M2212r4514L6237J10101M0335j31391j30531
$$ 1323899 1299770 1461627 1613445 1655657 1561143 1597380 1707481 1747816 1616425 1485894
4649A485894J07234K36632K56207N8933m112j3430j8153J5846J25697Q0512J24406
$$ 1485894 1593128 1829760 2085967 2144900 2140788 2127358 2109205 2125051 2250748 2331260 2455666
4638B455666L36901K62818K09379K24532K08664K99270N69828O36228P58640J399177
$$ 2455666 2792567 3055385 3264764 3489296 3697960 3997230 4567058 5203286 5961926 7361103
4628G361103K324384L433592M280537L061185O12063j122038k557391l170097
$$ 7361103 9685487 13119079 17399616 20460801 21072864 19950826 17393435 14223338
4620A4223338k574043j766425j095646n63093m01167n1642L10197L47050M32264
$$ 14223338 11649295 9882870 8787224 8224131 7822964 7771322 8081519 8428569 8860833
4611H860833Q26600J200573J541935K016208K022188J577908J091698P20318R17399
$$ 8860833 9687433 10888006 12429941 14446149 16468337 18046245 19137943 19858261 20775660
4602B0775660J334618K007269K477169K975971K845511J742884N17083j55341
$$ 20775660 22110278 24117547 26594716 29570687 32416198 34159082 34676165 34520824
4594C4520824j18211O68193J834052K598049K390058J119972l72076j645777k210576
$$ 34520824 34402613 35070806 36904858 39502907 41892965 43012937 42640861 40995084 38784508
4585C8784508k265194j507297n02265j14832l57972j243497k182017k584063k539588
$$ 38784508 36519314 35012017 34509752 34394920 34036948 32793451 30611434 28027371 25487783
4576B5487783k301045j912379j441668j284699j264377j398311j759633j910258
$$ 25487783 23186738 21274359 19832691 18547992 17283615 15885304 14125671 12215413
4568A2215413j765954j622589j335401j053740r40830q03787m05091j19213j51538
$$ 12215413 10449459 8826870 7491469 6437729 5496899 4693112 4288021 4168808 4017270
4559D017270k53327l17239l98909k72830p1619k9795O9286j98187l13843k89034
$$ 4017270 3763943 3446704 3047795 2774965 2703346 2673551 2742837 2544650 2230807 1941773
4549A941773k05156J25870L65813R7701k34801l14960k12791q8731p7178j98613
$$ 1941773 1736617 1862487 2228300 2326001 2091200 1776240 1563449 1474718 1397540 1198927
4539A198927j40399K45251K27572n3497r1560j16521k12761m8495J96227K3653
$$ 1198927 1058528 1303779 1531351 1477854 1386294 1269773 1057012 1008517 1204744 1228397
4529A228397p6265j38065j21711J33533K01266j24633j34277m5716J8307J17408
$$ 1228397 1152132 1014067 892356 1025889 1227155 1102522 968245 922529 940836 1058244
4519A058244L1213j06561j5494j21074k07929p3981Q083O8541J02027J71558p51
$$ 1058244 1089457 982896 967402 846328 638399 564418 572501 641042 743069 914627 913876
4508I13876j51050j72100m1609q0924q1509N899N4588k754j99850j72079J61300
$$ 913876 762826 590726 549117 468193 386684 392583 447171 444417 244567 72488 233788
4497B33788L77502N0936j46632p499n0800j7460q8904o1784M9820J33984l4964
$$ 233788 611290 662226 515594 508095 457295 439835 350931 289147 338967 472951 437987
4486D37987p7187k7674q4718p6027Q8626J25866O4833N8055j54701L3627J39399
$$ 437987 360800 333126 248408 172381 261007 386873 451706 509761 355060 388687 528086
4475E28086j26974j74789j02868j5154J63058K53444o853k24089j07221J6842
$$ 528086 401112 226323 123455 108301 271359 524803 517950 293861 186640 203482
4465B03482J4659J76055m1803r5931L5433N304k7996N2072j17681j17218k5645
$$ 203482 218141 394196 352393 256462 291895 297199 269203 321275 203594 86376 60731
4454F0731J01152J01133M4378p4325l4975J90719k1476j74575q8045O5389N0661
$$ 60731 161883 263016 307394 233069 198094 388813 367337 192762 104717 170106 220767
4443B20767m1902n4436o1440L4925J45419M6404J37669m6462l37111j97852O4461
$$ 220767 178865 124429 62989 97914 243333 289737 427406 380944 43833 -154019 -89558
4432h9558J71336K51870K31977m1786j95960L3230j42987j69998O1978l4892J8420
$$ -89558 81778 333648 565625 523839 327879 361109 218122 48124 110102 75210 93630
4421I3630K3896l0270J29509N217k85351j38333L6898J19288M2763J12292q2342
$$ 93630 117526 87256 216765 221982 -63369 -201702 -164804 -45516 -2753 109539 27197
4410B7197k58983K8997m1191J41777K34347R9174N5321q7145j50464j53838l381
$$ 27197 -231786 -202789 -243980 -102203 132144 231318 286639 199494 49030 -104808 -108189
4399a08189J47616P244K043k9291J2342J74852J11735P4448j47548l31880j86279
$$ -108189 39427 46671 48714 19423 31765 206617 318352 392800 245252 -86628 -272907
4388b72907J49427J75535j36047j19705J19979J01724J51943q703r1543N8802
$$ -272907 -123480 52055 -83992 -203697 -83718 18006 169949 161246 69703 128505
4378A28505q9041j87417Q3071K27862r655p6387j31286j37648K4208J5202j03250
$$ 128505 39464 -147953 -64882 162980 153325 76938 -54348 -191996 -167788 -152586 -255836
4367b55836J38062R1852j22189M7470J30394O7458j3555r6803k5668q9186L0921
$$ -255836 -117774 -25922 -148111 -100641 29753 97211 83656 -13147 -38815 -128001 -97080
4356i7080j15320R6148J38840j70659j13973O2581R0338J84957J31441J1327j28872
$$ -97080 -212400 -116252 22588 -148071 -262044 -199463 -109125 75832 207273 218600 89728
4345H9728q6124j6376M1329J04778j14827q5554P2870J54700J84786R732j35934
$$ 89728 3604 -12772 28557 133335 18508 -67046 5824 160524 345310 355042 219108
4334B19108r4079p8750q6754j8602J78464J05571m6602q033K2628m8555j67474
$$ 219108 125029 46279 -40475 -59077 119387 224958 178356 170323 192951 144396 -23078
4323b3078j74322O359P7511L6776p792L9526J33540R426K8708K6747r3076k8139
$$ -23078 -197400 -191041 -113530 -76754 -84546 -45020 88520 97946 126654 153401 60325 32186
4311C2186r8872m164J27428J94569P1630j42920j86167m3527Q4864M3871n5629
$$ 32186 -66686 -70850 56578 251147 322777 179857 -6310 -49837 35027 78898 23269
4300B3269J36704J16406k8069j06720o5028R8121J23333n433M7508j04663J8125
$$ 23269 159973 276379 248310 141590 76562 174683 298016 292583 340091 235428 253553
4289B53553J4590J18969J29342k10444k39647j87019J29198J73848k2224N3802
$$ 253553 268143 387112 516454 306010 66363 -120656 8542 182390 160166 213968
4279B13968J35512J08337k2521k09389j16595P216j10439j00406J40308K62513
$$ 213968 349480 457817 435296 225907 109312 116528 6089 -94317 45991 308504
4269C08504O7750k30377k66385o8950K16677J31939K4067n7676j09875q1547Q1510
$$ 308504 376254 145877 -120508 -189458 27219 159158 183225 125549 15674 -65873 15637
4258A5637P9645O273j68060p9583J26666J29965J2052j04077j379K5567R6272
$$ 15637 95282 101555 -66505 -146088 -19422 110543 122595 18518 17139 42706 138978
4247A38978Q1064n9421j18459o80R2551K8482l1598n1119m0883J23694J4622k44999
$$ 138978 220042 160621 42162 41482 134033 162515 130917 79798 38915 162609 177231 -67768
4235f7768k11399J57962J24195R1165K7601j79811j17478J02394n1568J4031K39852
$$ -67768 -279167 -121205 2990 94155 121756 -58055 -175533 -73139 -124707 -110676 129176
4224A29176K62980J07560p1824l22247k28672j1955J34422J57154N8542O1482
$$ 129176 392156 499716 427892 105645 -123027 -134982 -560 156594 215136 276618
4214B76618J0619J44180J6360n3680Q8129J68934J80400J08467r4293p0898l1132
$$ 276618 287237 431417 447777 394097 482226 651160 831560 940027 845734 774836 743704
4203G43704M2624n3760l19862k49323P8124K51480n2283k79587j55502j47941
$$ 743704 786328 732568 412706 163383 241507 492987 440704 161117 5615 -142326
4193a42326k9274J20988J15393J14948J39997l0091p6793j21490r7230p7000J10462
$$ -142326 -171600 -50612 64781 179729 319726 289635 212842 91352 -5878 -82878 27584
4182B7584J24872K37l0516r626K2100J48162o9298j24180J2236l292k2214j92387
$$ 27584 152456 152693 122177 112551 134651 282813 213515 89335 101571 98279 76065 -116322
4170a16322k1455j218J91874K62141N4676m1443l1062o065R345j65782j07014
$$ -116322 -137777 -138995 52879 315020 369696 328253 297191 291126 300471 134689 27675
4159B7675J92010K77141N0584k70155j83833M0574K33047k0950l35678j52102
$$ 27675 219685 496826 547410 277255 93422 133996 367043 346093 10415 -141687
4149a41687J08355J68818J42675Q4935n8899j67552o0049j1085l6208p2793n804
$$ -141687 -33332 135486 278161 363096 304197 136645 76596 65511 29303 -43490 -49294
4138d9294P6901J32841J14565k3622m8128l385m6561j74886r9771J18005J44595
$$ -49294 27607 160448 275013 251391 203263 199878 153317 -21569 -121340 -3335 141260
4127A41260R3624j9498l7300j49532j7605l4761j04697m4384K4912J72915J47010
$$ 141260 234884 215386 178086 28554 10949 -23812 -128509 -172893 -147981 24934 171944
4116A71944R5512j03870m0276J71847K3178j92979j13039L0252L1638M6814p0201
$$ 171944 267456 163586 123310 295157 318335 125356 12317 42569 74207 121021 50820
4105E0820n9894L4943L3445O7130M5156j05234o3613O0848P1821N9674m7900q1225
$$ 50820 -9074 25869 59314 126444 171600 66366 2753 63601 135422 195096 147196 65971
4093F5971J6310J01584l360N047j36199j53745J22410J48221R1437J1631M9181
$$ 65971 82281 183865 180505 185552 49353 -104392 18018 166239 257676 269307 318488
4082C18488L9273j07458r2425m9979M4751R8775N1253R2671K3199J15978J18015
$$ 318488 357761 250303 157878 107899 152650 251425 302678 395349 418548 534526 652541
4071F52541q0529j2347M7316J16979k22M7277J70791P3056j2101J14809J63035
$$ 652541 572012 559665 606981 723960 723738 771015 941806 1014862 1002761 1117570 1280605
4060A280605L25264K01570J11491J72880M47761O79261J189976K041756K605029
$$ 1280605 1605869 1807439 1918930 2091810 2539571 3218832 4408808 6450564 9055593
4051I055593K003827M13137n77420j229680j928477j929060j368224r42712o24392
$$ 9055593 11059420 11472557 10895137 9665457 7736980 5807920 4439696 3496984 2872592
4042B872592m23078j01039N9221j55561l25784k98808j83437j15268j47809o5329
$$ 2872592 2449514 2348475 2407696 2252135 1926351 1627543 1444106 1328838 1181029 1115700
4032A115700J45749J42211O1306n1574R056m4079p8228j23994k53754j89846j92809
$$ 1115700 1261449 1403660 1464966 1413392 1422448 1378369 1300141 1176147 922393 732547 539738
4021E39738J9074J19019K20431M5503k72673l78635k34529R214J21338P2260L1576
$$ 539738 558812 677831 898262 943765 671092 292457 57928 67142 188480 260740 292316
4010B92316J16533k8274O9343J15075K3082k56434l08873k15547J23138M34829
$$ 292316 408849 380575 449918 564993 588075 331641 22768 -192779 -69641 365188
4000C65188K35710o3035j39018k24990p2583P3451J16621m9506j77818o499k1087
$$ 365188 600898 537863 398845 173855 101272 174723 291344 241838 64020 57521 36434
3989C6434J06796N4331N4511P2773J83102N9481k00455k24863o5658J0779K20053
$$ 36434 143230 197561 252072 324845 507947 567428 366973 142110 76452 87231 307284
3978C07284J35253j12170j60837q7531K4900J04817j49924j96922N1898J34793
$$ 307284 442537 330367 169530 81999 106899 211716 61792 -135130 -83232 51561
3968E1561J25405j06292j23672r6486q2192J9734J28528K85371J38211r9130j19089
$$ 51561 176966 70674 -52998 -149484 -231676 -211942 -83414 201957 340168 241038 121949
3957A21949M752o6310m4566L1962r4748q276P2045o4970N7380J02101j5834k7467
$$ 121949 126701 60391 15825 47787 -46961 -55237 16808 -48162 9218 111319 95485 68018
3945F8018J7016o9601n2366n2009k0444P4975J69233j3410r2696p3478k5565K40059
$$ 68018 85034 15433 -36933 -88942 -109386 -34411 134822 121412 28716 -44762 -70327 169732
3933A69732P065l46694j97768J31073L58615J42262r5893o9917N0146l4273k58841
$$ 169732 176797 -169897 -367665 -236592 122023 264285 168392 98475 148621 114348 -144493
3922a44493j16441J56675K17081J39621M9392p4712o4269j54554j28613n760K29778
$$ -144493 -260934 -104259 112822 252443 301835 227123 162854 8300 -120313 -126073 103705
3911A03705P2293o1460Q456l6638j02813K0675J31386P0617n0926k14280k29976
$$ 103705 175998 114538 122994 86356 -16457 4218 135604 206221 155295 -58985 -288961
3900b88961j32327J31444K04926J63896M5373j09283m5835r7360k7544k1607m8773
$$ -288961 -421288 -289844 -84918 78978 124351 15068 -30767 -128127 -155671 -177278 -226051
3889b26051J45591J54569j13400n8198K36936J19204k89698j85050J65493K00224
$$ -226051 -80460 74109 -39291 -97489 139447 258651 -31047 -216097 -50604 149620
3879A49620Q2065p8519p4953Q7668J01215j02386n2053J2473j3995j15143K1320
$$ 149620 231685 153166 78213 165881 267096 164710 112657 125130 111135 -4008 17312
3868A7312N1480j96329j52223M0538J90712J36751j27894k10761l0714O7131J25921
$$ 17312 68792 -127537 -279760 -239222 -48510 88241 -39653 -250414 -281128 -213997 -88076
3857h8076J95007n5901k39841j8273O1374J19533J91372l0747j03142Q0803m0220
$$ -88076 106931 51030 -188811 -207084 -145710 -26177 165195 134448 31306 112109 71889
3846G1889j56697J15670J79543n1674q2531N6255K7960P0393n203k60414j87379
$$ 71889 -84808 30862 210405 158731 76200 132455 160415 230808 225605 -34809 -222188
3835b22188R6294J54194o8323m7515l4467R4495K49880L5126j66427k21194j79031
$$ -222188 -125894 28300 -40023 -87538 -122005 -27510 222370 257496 91069 -130125 -309156
3824c09156J04819K15464N0077K281J27458K5803n6789q6745j96183j27310K30761
$$ -309156 -204337 11127 61204 63485 190943 216746 159957 73212 -122971 -250281 -19520
3813a9520K4350q43J36122q162j26754j086j18948j19376J18236J49479o4878
$$ -19520 4830 3987 140109 131947 5193 4107 -114841 -234217 -115981 33498 -31380
3802c1380j7466K4647n9097L0323N5455L9825o1708L2383k1095J9803l7268J8943
$$ -31380 -48846 -24199 -83296 -52973 2482 42307 -19401 12982 -8113 11690 -25578 -6635
3790f635J58341j6224j50035m9933q9079m1755J26026J70333j81069M2624J93349
$$ -6635 151706 135482 -14553 -64486 -153565 -195320 -69294 101039 -80030 -37406 155943
3779A55943R4145O5483j21569m49540j34408K70187R9216K6501m6085o9022J03875
$$ 155943 250088 315571 194002 -255538 -389946 -119759 -20543 5958 -40127 -109149 -5274
3768e274J52015m0920j23572r8193r638J10631j07324r5339J53860J80887J51781
$$ -5274 146741 105821 -17751 -115944 -125582 -14951 -122275 -217614 -63754 117133 268914
3757B68914J09076k09569j97593J33828r230k67077k3368K24919m1761q5995O4272
$$ 268914 377990 168421 -29172 104656 95426 -171651 -195019 29900 -11861 -97856 -33584
3746c3584k3297K8818J83641M9847Q8697Q8481j88786k51247L390Q3771m5393
$$ -33584 -56881 -28063 155578 205425 294122 382603 193817 -57430 -54040 29731 -15662
3735a5662J4456O6340J25730m8740k63222k9811K07276J0162k46691j34820L0454
$$ -15662 -1206 65134 190864 142124 -121098 -150909 56367 66529 -180162 -314982 -284528
3724b84528L04069K95330j694k43656j4030p9208l9718R1643j13143r4071J63385
$$ -284528 19541 314871 313177 69521 55491 -23717 -63435 28208 -84935 -179006 -15621
3713a5621J81499P440l3970r5468n8252K0572J05746K8956N247l358L0675j1814
$$ -15621 165878 173318 139348 43880 -14372 6200 111946 140902 146149 142791 173466 161652
3701A61652q061K462o9070q247L7091J1870j16752m6150J20198N8352l3844l5344
$$ 161652 153591 156053 86983 78736 115827 127697 10945 -35205 84993 143345 109501 74157
3689G4157m0539r6294k8161q4239j06817J75298K11697k5332k03340j61019J32433
$$ 74157 33618 -62676 -90837 -175076 -281893 -106595 105102 79770 -123570 -284589 -152156
3678a52156K17778J12754j65608r1511O3770p6046m8543N2518J21430J30709J5068
$$ -152156 65622 178376 12768 -78743 -14973 -91019 -139562 -87044 34386 165095 180163
3667A80163j13279J7101j25508q8844P3460L8689O184N3099J9147m3263n9470
$$ 180163 66884 83985 -41523 -130367 -56907 -18218 -12034 41065 60212 16949 -42521
3656d2521m5650k708J07841J03021j6548p8038J0820J50952K9643K6232j17684
$$ -42521 -88171 -90879 16962 119983 103435 25397 36217 187169 216812 243044 125360
3645A25360j70301j47966R0302L30327J50493l0034q7298j37614J1507j33381
$$ 125360 -44941 -192907 -102605 227722 378215 348181 260883 123269 134776 1395
3635A395k51681L0375K15706N5139j6912r778N5681k9401q5194L0754J8474k8550
$$ 1395 -250286 -219911 -4205 50934 34022 24244 79925 50524 -34670 -3916 14558 -13992
3623a3992k16477M4748J63434P1377J4683O2152O743r735k1296p1311M7010J59469
$$ -13992 -230469 -185721 -22287 49090 63773 125925 132668 122933 101637 30326 77336 236805
3611B36805m4371m8227J03212M56q9564j1695j02713l0014P023j04148J406P2765
$$ 236805 192434 144207 247419 247875 158311 146616 43903 13889 20912 -83236 -81830 -9065
3599i065j3551j23712k943J4134p0772N029J95759J10956J07693o9495j67226
$$ -9065 -22616 -146328 -149271 -135137 -205909 -200880 -5121 105835 213528 144033 -23193
3588b3193k10924j30097O3389J94263J46205r8479o0204R4580N1268J0301J5883
$$ -23193 -234117 -364214 -300825 -106562 39643 -58836 -119040 -24460 26808 37109 52992
3577E2992m3989P3821K5466K0485K7297J10133R9431j31545j81769k06122j22518
$$ 52992 9003 82824 108290 128775 156072 266205 365636 234091 52322 -153800 -276318
3566b76318P1175J55533P3295K67115j8279j62083j16140j89069o6485J73683
$$ -276318 -205143 -49610 23685 290800 272521 110438 -5702 -194771 -261256 -87573
3556h7573J65558J006L6297n5834j8475Q4598N4644j96355j70880l0372k9214
$$ -87573 77985 78991 115288 59454 40979 125577 180221 -16134 -187014 -217386 -246600
3545b46600P6123N6731K2165J34421R0169k0111j18658j38870j8254J51075N3581
$$ -246600 -170477 -113746 -91581 42840 133009 112898 -5760 -144630 -162884 -11809 41772
3534D1772m1640k51J79271j8009j23051q5786l8904K6246P1910J25028L06833
$$ 41772 132 -119 179152 161143 38092 -47694 -86598 -60352 11558 136586 443419
3523D43419k8873l14259j99058R5071J99809l1728p7961r9231N7158Q4105m1860
$$ 443419 414546 100287 -98771 -3700 196109 164381 86420 -12811 44347 128452 86592
3512H6592l8127J6774j88343O5689J99327N8517j16724k07695j38482k0511J71565
$$ 86592 48465 65239 -123104 -57415 141912 200429 83705 -123990 -262472 -282983 -111418
3501a11418J52677J44270L5952k00208k07886J27763o398j25748k018J35703K65101
$$ -111418 41259 185529 221481 21273 -186613 -58850 -65248 -190996 -193014 -57311 207790
3490B07790Q1337j36280j88593K0652M3937M6336k6995j22987j22005J05114K12109
$$ 207790 289127 152847 -35746 -15094 28843 75179 48184 -74803 -196808 -91694 120415
3479A20415J56783Q6289j40906j37666O4366m3738o0699L4219o5063n4423J38719
$$ 120415 277198 363487 222581 84915 149281 105543 44844 79063 14000 -40423 98296
3468I8296M2583j11572P7569l5672p4881N2019P7760P9101J14451R3717n5520
$$ 98296 140879 29307 106876 71204 -3677 48342 126102 205203 319654 413371 357851
3457C57851j26130q8042j04184j37236M082o487J62717J11229k4339p8254p5477
$$ 357851 231721 143679 39495 -97741 -93659 -100146 62571 173800 149461 71207 -4270
3446d270n9545Q4084J59421J0602o503j33261j5923Q5152L2610J9923J69146J77033
$$ -4270 -63815 20269 179690 190292 183789 50528 34605 119757 152367 172290 341436 518469
3434E18469j2816l1329j9764j15446o5437R5076P8472N4851j1711o2055j5775
$$ 518469 505653 474324 454560 339114 273677 368753 447225 502076 490365 428310 412535
3423D12535j6000j37376K5966J08478q7326j88729r1044J82464K60160k0614k91001
$$ 412535 396535 259159 285125 393603 306277 117548 26504 208968 469128 448514 157513
3412A57513p9126J37291J40974R203j94969j51064K7162J20805O1666J8610k05549
$$ 157513 78387 215678 356652 365855 170886 19822 46984 167789 229455 248065 42516
3401D2516j77513J278J88656P8791Q202M3112n8303K3352k1302p0200j71167P873
$$ 42516 -134997 -133719 54937 133728 141930 185042 126739 150091 128789 58589 -112578 -104705
3389a04705J22928J77000P3701j83650j32964R0181P5922j2847j01712O818Q5332
$$ -104705 18223 195223 268924 85274 -47690 42491 118413 105566 3854 10672 96004
3378I6004Q660K083N7324J26743J6195q5454j51364o5060M9679R2982m4340L3962
$$ 96004 104664 106747 164071 290814 307009 221555 70191 5131 54810 147792 103452 137414
3366A37414O7782O2958P6858j47520k48235j11198R1930K45370J50378N6783M3170
$$ 137414 205196 268154 345012 197492 -50743 -161941 -70011 175359 325737 382520 425690
3355D25690j36115j06290r8204J16658J62905Q6628n680m6007r2671j33024j2187
$$ 425690 289575 183285 85081 201739 364644 451272 445592 399585 306914 173890 161703
3344A61703K5341Q2177n536j34502K5496L4108k03454j36721O9132Q4096J79932
$$ 161703 187044 269221 263685 129183 154679 188787 -14667 -151388 -82256 1840 181772
3333A81772M5415p2374j53629P36L0914n3746K4937p5763r7638J75827J27218
$$ 181772 227187 154813 1184 1920 32834 -20912 4025 -71738 -169376 6451 133669
3322A33669q3453o8585r141J02118Q1058r1665j30252Q1268L8489K1473J10353
$$ 133669 50216 -18369 -27510 74608 155666 64001 -66251 15017 53506 74979 185332
3311A85332r216q5601K9952o6682l7244J24492j6140P527M0799J07403N9085N4421
$$ 185332 176116 90515 120467 53785 16541 141033 124893 132420 173219 280622 339707 394128
3299C94128n7959k26744j03149m194J65961K33266L2177k00723k31295j80737
$$ 394128 336169 109425 6276 2082 168043 401309 433486 232763 1468 -179269
3289a79269L5871L9607P9269j1292N0955M0232o8854N839j55966j56586M8254
$$ -179269 -143398 -103791 -24522 -35814 15141 55373 -13481 -7642 -163608 -320194 -271940
3278b71940J47376M8443M1080N9311J2372k6216O7915j37229l1474J60185k8353
$$ -271940 -124564 -76121 -35041 24270 36642 10426 78341 -58888 -90362 69823 41470
3267D1470N834J3938J02884J794m437r3854m0211L0246R6746J65885J63782n5807
$$ 41470 47304 61242 164126 165920 161483 67629 27418 57664 154410 320295 484077 428270
3255D28270j21427L9777p6599p4594j90667j66678J27233L00331o592j98713n1207
$$ 428270 306843 346620 270021 195427 4760 -161918 -34685 265646 259054 60341 9134
3244I134K1974q9816O984M4828R5096J13850o6779j29611j42652o13o8947J71725
$$ 9134 31108 -58708 -51724 -6896 88200 202050 135271 5660 -136992 -137605 -206552 -34827
3232c4827N7533k2560m5677p0435M0440J36954r17q9759R2605n4067o4644L0677
$$ -34827 22706 146 -45531 -115966 -75526 61428 60511 -29248 63357 9290 -55354 -24677
3220b4677N0456P7025K10300P3752r5139L8028m9655j83557n9567l5591l8280
$$ -24677 25779 102804 313104 386856 291717 329745 280090 96533 36966 1375 -36905
3209c6905O3577J1248o8519k3683J31063N4960j05798k09886p7651K17496J21943
$$ -36905 26672 37920 -30599 -54282 76781 131741 25943 -183943 -261594 -44098 77845
3198G7845M0493j11038j57723j9029J54519J74562m2631j12649p9891k5959K65228
$$ 77845 118338 7300 -150423 -169452 -14933 159629 116998 4349 -75542 -101501 163727
3187A63727K88850k09545m40202m2437K76455K12346O0198j13909j56804P3543
$$ 163727 452577 243032 -197170 -239607 36848 249194 309392 195483 38679 112222
3177A12222K02105j25095p2100m8273M7940M2871j3691l8893L4609J64602J9336
$$ 112222 314327 189232 117132 68859 116799 159670 145979 107086 141695 306297 325633
3166C25633j22560j87371k6876r3702k84528L5546L32891O3992n8537j30934o379
$$ 325633 203073 15702 -11174 -104876 -389404 -353858 -20967 43025 -15512 -146446 -152825
3155a52825O2476J04598l609p7703J78166J27631j95797p5172m2269r6626L7495
$$ -152825 -90349 14249 10640 -67063 111103 238734 42937 -32235 -74504 -171130 -133635
3144a33635K00869O9418J40378P7475j11693j12017M0835j02674k22446Q254K21479
$$ -133635 67234 136652 277030 354505 242812 130795 171630 68956 -153490 -145236 76243
3133G6243K51259N2468k79075k02318Q503J8184J58320Q3067p9777j25532M8995
$$ 76243 327502 379970 100895 -101423 -92920 -74736 83584 166651 86874 -38658 10337
3122A0337L9142J52985J5733j39134p2084J42933J04994j71105j11432r3449O3662
$$ 10337 49479 202464 218197 79063 6979 149912 254906 83801 -27631 -121080 -57418
3111e7418J98996J01883j00604L4403k6138k3564j870j18889q0297P2681N4927
$$ -57418 141578 243461 142857 177260 151122 127558 125688 6799 -73498 -817 54110
3100E4110J6234P6716K3174l4818l3992k2526K3712J44170j83176k34555J4625
$$ 54110 70344 147060 170234 135416 101424 78898 102610 246780 63604 -170951 -156326
3089a56326J75730K48087J74563j06497j50985q6979k3236n5622l6251L0147m8001
$$ -156326 19404 267491 442054 335557 184572 97593 74357 18735 -17516 12631 -35370
3078c5370J48704J63342P0647n1449j75292j97554l1811j2172l4609K32734J52604
$$ -35370 113334 276676 347323 295874 120582 -76972 -108783 -120955 -155564 77170 229774
3067B29774J10349l4083j56399k20357m7705J15087P9872L6078j66741q0322R9916
$$ 229774 340123 306040 149641 -70716 -118421 -3334 76538 112616 -54125 -134447 -34531
3056c4531K65159J46625m4929j31528j77924L0807L3722o3487k2434j04121O490
$$ -34531 230628 377253 332324 200796 22872 53679 87401 23914 1480 -102641 -96151
3045i6151J11586L7347j14970j7209K12356p1182n3926K4943M5995k1444J7199
$$ -96151 15435 52782 -62188 -79397 132959 61777 7851 32794 78789 57345 74544
3034G4544K3987O4270J58485o4242k47648j13702J07109N9008J58920J7677j34295
$$ 74544 98531 162801 321286 257044 9396 -104306 2803 61811 220731 238408 104113
3023A04113j57275q2035O4052M0443K1200J12617Q7929O6621K0654m7077j73618
$$ 104113 -53162 -135197 -71145 -30702 -9502 103115 191044 257665 278319 231242 57624
3012E7624k07580M2274R158Q4692J09327M4448K710l317j35322k33171q6363J63053
$$ 57624 -149956 -107682 -98524 -13832 95495 139943 142653 139336 4014 -229157 -315520 -152467
3000a52467J87520l2157p8398j17360j29457R2702K98800J61764p5022k14180
$$ -152467 35053 2896 -75502 -192862 -322319 -229617 69183 230947 155925 -58255
2990e8255k17519O4199K52474K30008n2526k8893J4877n7403j56680K3458J53920
$$ -58255 -275774 -211575 40899 270907 218381 189488 204365 146962 -9718 13740 167660
2979A67660J07797n1150j06612o4685q7088p7978J1688K03107J52403J02754k21003
$$ 167660 275457 224307 117695 53010 -34078 -112056 -100368 102739 255142 357896 136893
2968A36893k12828r23J2909r6335J5580k311J04492N8425n8666j21016j13274
$$ 136893 -75935 -76858 -63949 -160284 -144704 -147015 -42523 15902 -42764 -163780 -277054
2957b77054j2205l9900J53905K17272J46648r1082j33051L0031R4629N4685r9466
$$ -277054 -289259 -329159 -175254 42018 188666 97584 -35467 -5436 89193 143878 44412
2946D4412j20453p4148J96789K95154N9130k01441j30217n4843K26O0543l2870
$$ 44412 -76041 -150189 46600 341754 400884 199443 69226 14383 14609 75152 42282
2935D2282J233J37778L1303k01106j35124q7431m4365l0344M4839J50735J45604
$$ 42282 43515 181293 212596 11490 -123634 -211065 -255430 -285774 -240935 -90200 55404
2924E5404L5154o3813q3590j15950q5146Q613J35904J33068R5463k17472j56814
$$ 55404 90558 26745 -56845 -172795 -257941 -249328 -113424 19644 115107 -102365 -259179
2913b59179N0596J41290n2462j53458J36563L02066K94455M6189r1691j10847
$$ -259179 -208583 -67293 -119755 -273213 -136650 165416 459871 506060 414369 303522
2903C03522o9681k11207j45067J10629L00478N9482j26129r4821l0672J5587j18984
$$ 303522 233841 22634 -122433 -11804 288674 348156 222027 127206 96534 112121 -6863
2892f863j38909p5498J08878J39906J79074j7332j98913k36187p920L7338m4552
$$ -6863 -145772 -221270 -112392 27514 206588 189256 -9657 -245844 -253764 -216426 -260978
2881b60978j3336M8284J32601N55j36795m7853Q6344M7416J57313K67104J09419
$$ -260978 -274314 -226030 -93429 -92874 -229669 -277522 -191178 -143762 13551 280655 390074
2870C90074k52286k73837r2941J44872J18835n6090P5437J70993P0878j13581
$$ 390074 137788 -136049 -228990 -84118 34717 -21373 54064 225057 295935 182354
2860A82354m7513K531o443n8467o3935m5202J51250J28294N2094o0046j60937
$$ 182354 134841 137372 130929 72462 8527 -36675 114575 242869 294963 234917 73980
2849G3980p9527l2375M0330j33484l4159L2976j6931k9704l7693R6813J35742
$$ 73980 -5547 -37922 2408 -131076 -165235 -132259 -149190 -178894 -216587 -119774 15968
2838A5968j03920j24320P8200J40923o0238L4593K00359n0341j81098k04458k8085
$$ 15968 -87952 -212272 -134072 6851 -53387 -18794 181565 131224 -49874 -254332 -282417
2827b82417L00567Q0028q0455J09679J37147j67441l54546q6687J51109K22680
$$ -282417 18150 98178 17723 127402 264549 97108 -257438 -344125 -193016 29664
2817B9664J06805j75294J0237M3496q2435j925j9354n2080q9128K18533K10927
$$ 29664 136469 -38825 -28588 14908 -67527 -69452 -88806 -140886 -230014 -11481 199446
2806A99446M0438j98090j59379Q2244J28419n3386M8210J01959j38464q2554o4290
$$ 199446 239884 41794 -117585 -35341 93078 39692 87902 189861 51397 -31157 -95447
2795i5447N3102J32840J03802p5274P6601O2773m6069j93994j9006o9734j29425
$$ -95447 -42345 90495 194297 119023 195624 258397 212328 18334 -672 -70406 -199831
2784a99831J47566K47294Q883o4744j65120j05221m652p2879j5770L5624J34110
$$ -199831 -52265 195029 203912 139168 -25952 -131173 -135825 -208704 -224474 -188850 -54740
2773e4740M7774M8667J0606M1560k7508j30721J41524J55465j06189k48585O1142
$$ -54740 -6966 41701 52307 93867 66359 -64362 77162 232627 126438 -122147 -61005
2762f1005J07370j2402j6695P437L3908M9297r1415j20506m8962n5215l6580L9208
$$ -61005 46365 33963 17268 24705 58613 107910 16495 -104011 -152973 -208188 -244768 -205560
2750b05560P9608M521l573Q3524J72966J427j76294r9741p3178k19458O6918L84720
$$ -205560 -125952 -121431 -125004 -41480 131486 132913 -43381 -143122 -216300 -435758 -368840 15880
2738A5880J98989p926l3724n8727P0978J4013k82383k32350L890J81505J60161
$$ 15880 214869 206943 173219 114492 185470 199483 -82900 -315250 -311360 -129855 30306
2727C0306O9052J09811j3878L7031M4977N3429l24596j45265r60Q2245J49257
$$ 30306 99358 209169 195291 232322 277299 330728 6132 -139133 -140093 -57848 91409
2716I1409J48755j01984o8365n5590j14170j02388J958J22104L4503J7607j6453
$$ 91409 240164 138180 69815 14225 -99945 -202333 -200375 -78271 -43768 -26161 -42614
2705d2614R365n595K2594J2904j13778m0073J34772O9099n5138r4463k9676M3388
$$ -42614 -33249 -38844 -16250 -3346 -117124 -157197 -22425 46674 -8464 -102927 -132603 -89215
2693h9215J23659J07581n5272J03721P97j36932j95638l9654O2089R3751K39195
$$ -89215 34444 142025 86753 190474 191271 54339 -141299 -180953 -118864 -25113 214082
2682B14082M0595j64452k48160l9414J06301O4739O4372J41060K8459O439q5225
$$ 214082 254677 90225 -157935 -197349 -91048 -26309 38063 179123 207582 214021 128796
2671A28796j62549J5177M3208P873j26174o1920n8105r955K01050J76984M3549
$$ 128796 -33753 -18576 24632 32505 -93669 -155589 -213694 -223649 -22599 154385 197934
2660A97934k62691j34057M6224K003J03194Q4028N3755K33526O1837k71880l22156
$$ 197934 -64757 -198814 -152590 -150587 -47393 36635 90390 323916 385753 113873 -208283
2649b08283p0896n1645Q1617K10469J24195K3001q3775o1936O3578o06M920k2215
$$ -208283 -279179 -330824 -249207 -38738 85457 108458 24683 -37253 26325 25719 30639 8424
2637H424j13824j24149N8311J26245J39342Q5702m8181j06908J36880J67615j17818
$$ 8424 -105400 -229549 -171238 -44993 94349 180051 131870 24962 161842 329457 211639
2626B11639k21969M7336j0808J37304R2634m4785l7680r1444r6299j9088K4318
$$ 211639 -10330 37006 26198 163502 256136 211351 173671 82227 -14072 -33160 -8842
2615h842j33776j8787j09975m9833J38443J76300O1706O0026o7316j17909o6015
$$ -8842 -142618 -161405 -271380 -321213 -182770 -6470 55236 115262 47946 -69963 -135978
2604a35978l1298k3942R2749R1562o8133j0016R0845N7220j15896j68453J3386
$$ -135978 -167276 -191218 -98469 -6907 -75040 -85056 5789 63009 -52887 -221340 -207954
2593b07954J88102J21685O6919K6633L6953j08239q9001l4750Q2050J36640j32107
$$ -207954 -19852 101833 168752 195385 232338 124099 35098 348 82398 219038 86931
2582H6931k09487j01765j0501j14674O7771J11300j2191J13167J55752M7202j9201
$$ 86931 -122556 -224321 -234822 -349496 -281725 -170425 -182616 -69449 86303 133505 114304
2571A14304r1052j54595P2319M9137P9965J0354m2241L5779P6442J16294q0120
$$ 114304 23252 -131343 -59024 -9887 70078 80432 38191 73970 150412 266706 186586
2560A86586p8016j33656j04106J3280J11732J09427J24782r853r5616j53727j56619
$$ 186586 108570 -25086 -129192 -115912 -4180 105247 230029 220176 124560 -29167 -185786
2549a85786m8417J70804K0883j62717m9503N3506J16173p848J18929P6481o4555
$$ -185786 -234203 -63399 -42516 -205233 -254736 -201230 -85057 -92905 26024 102505 37950
2538C7950p6083p9392j45226R7170J67426M3832J7865m0104Q7569o1397N778l9078
$$ 37950 -38133 -117525 -262751 -165581 1845 45677 63542 23438 111007 49610 55388 16310
2526A6310J3907k8656l0018J42480J46452q2797p8738m2320j49611J25113J5651
$$ 16310 30217 1561 -28457 114023 260475 177678 98940 56620 -92991 32122 47773
2515D7773j94291n7754P6209n6218j19671K5455K53135J20127j22426j11103k1772
$$ 47773 -146518 -204272 -128063 -184281 -303952 -278497 -25362 94765 -27661 -138764 -160536
2504a60536P2284l6772J0018J14035N8556J58476j20664k26711M9886J0941M5870
$$ -160536 -88252 -125024 -115006 -971 57585 216061 95397 -131314 -81428 -70487 -24617
2493b4617K67105J39416o1906l2441j46681j69182r286k1591j21939Q7927J55098
$$ -24617 242488 381904 319998 287557 140876 -28306 -37592 -59183 -181122 -93195 61903
2482F1903j21472k07620j73580P9532K71254K25493J21512q6249j88775j82809
$$ 61903 -59569 -267189 -440769 -361237 -89983 135510 257022 170773 -18002 -200811
2472b00811j157j35144N0120Q6168L9346O3861J38160K0262j31490Q384n4531
$$ -200811 -201968 -337112 -286992 -200824 -161478 -97617 40543 60805 -70685 -62301 -116832
2461a16832p6370J49848L00546J05120j2407J3684J42585O9989n7927k15552l16894
$$ -116832 -193202 -43354 257192 362312 349905 363589 506174 576163 518236 302684 -14210
2450a4210j93407J25127J98978M7180P2657M6673j76777j14152k8658k40292j85383
$$ -14210 -207617 -82490 116488 163668 236325 282998 106221 -7931 -36589 -276881 -462264
2439d62264n5489J39320K73292O6282j27931k03497k1856P318N9358Q6195J79948
$$ -462264 -517753 -378433 -105141 -38859 -166790 -370287 -392143 -384825 -325467 -239272 -59324
2428e9324Q4052j07647L4458J46498O7058K2606j11973r9374j0857K14551J72751
$$ -59324 24728 -82919 -48461 98037 165095 187701 75728 -23646 -34503 180048 352799
2417C52799o5845j25459p4275N3816J01362J695j98395j26852k5529M3831K7237
$$ 352799 286954 161495 87220 141036 242398 244093 45698 -81154 -106683 -62852 -35615
2406c5615J04457J37731q6583j03897K4422n9207k32706j15612O3436O5762J0689
$$ -35615 68842 206573 119990 16093 40515 -18692 -251398 -367010 -303574 -237812 -227123
2395b27123j2043J26168J92096J21366o1384j13953o739J43342n413j06183o3116
$$ -227123 -239166 -112998 79098 200464 139080 25127 18388 161730 156317 50134 -12982
2384a2982N8425M3868K5109Q4260q3511l1105n4946j54232p8326J789o0760O5281
$$ -12982 45443 89311 114420 198680 115169 84064 29118 -125114 -203440 -201651 -262411 -197130
2372a97130J35174k176j3220L1226n4791k89j67P228l2161O982p797L5474J82332
$$ -197130 -61956 -64132 -77352 -46126 -100917 -101206 -101373 -94145 -126306 -119324 -127121 -91647 90685
2359I0685O4644J11924j1762j77125j87716L9991q292O2252J18860j51313L3516
$$ 90685 155329 267253 255491 78366 -109350 -69359 -77651 -15399 103461 -47852 -14336
2348a4336K29853R292j37302o5437l3022J26854P0225j86736j92001J04977Q1077
$$ -14336 215517 224809 87507 22070 -10952 115902 186127 -609 -192610 -87633 -6556
2337f556k4088k6208P451j9431o3753j60972j68191N7770J28197J56450K25443
$$ -6556 -30644 -56852 -49401 -68832 -132585 -293557 -461748 -403978 -275781 -119331 106112
2326A06112J9938j17931m3458J1752M7977J83359P5249j55245j01889p095L1905
$$ 106112 126050 8119 -35339 -23587 24390 207749 282998 127753 25864 18769 50674
2315E0674Q8896M9050r9224j2737p1933J8294M3928Q3063j52347p5970L6783J94357
$$ 50674 139570 188620 89396 76659 4726 23020 66948 150011 -2336 -78306 -41523 152834
2303A52834J31042m6658k69866j75910J70444Q8003q4670p8746j07957K5738K40001
$$ 152834 283876 237218 -32648 -208558 -38114 49889 -34781 -113527 -221484 -195746 44255
2292D4255J54317m5771k35399j83066L1258K60129J2119j34197p9138k5047O0310
$$ 44255 198572 152801 -82598 -265664 -234406 25723 37842 -96355 -175493 -200540 -140230
2281a40230Q8469p3812R1700K20652j05992j16295Q2882L5889j10287J158O6337
$$ -140230 -51761 -125573 -33873 186779 80787 -35508 47374 83263 -27024 -25866 40471
2270D0471N2189J7888j13158k6112R3342J458p1248l732K1623j38263r6244J76562
$$ 40471 92660 110548 -2610 -28722 64620 66078 -5170 -8902 12721 -125542 -221786 -45224
2258d5224J39175m293r7348O0400K01087J09899j11406j32526j64692k6111J18270
$$ -45224 93951 89658 -7690 52710 253797 363696 252290 119764 -44928 -71039 47231
2247D7231L0321j34231o8731J3769K0116J12363j9552k61251k3584J31615J81942
$$ 47231 77552 -56679 -125410 -111641 -91525 20838 1286 -259965 -283549 -151934 30008
$$ [...]
##END NTUPLES=NMR SPECTRUM
##END=
