##TITLE=1H_DE-80H_X3
 200.13MHz, d2o
 8 sc
 
 19ns.26.2.2025
##JCAMPDX= 6.0         $$ Bruker NMR JCAMP-DX V2.0
##DATA TYPE= NMR SPECTRUM
##DATA CLASS= NTUPLES
##ORIGIN= UXNMR, Bruker Analytische Messtechnik GmbH
##OWNER= pz
$$ XWIN-NMR		Version 3.5
$$ Wed Jan 28 13:30:36 2026 Russian Standard Time (UT+4h)  Yarkov@DPX200
##.OBSERVE FREQUENCY= 200.1313
##.OBSERVE NUCLEUS= ^1H
##.ACQUISITION MODE= SIMULTANEOUS
##.ACQUISITION SCHEME= undefined
##.AVERAGES= 8
##.DIGITISER RES= 18
##SPECTROMETER/DATA SYSTEM= spect
##.PULSE SEQUENCE= zg30
##.SOLVENT NAME= CDCl3
##.SHIFT REFERENCE= (INTERNAL, CDCl3, 0, 15.4747)
##AUDIT TRAIL= $$ (NUMBER, WHEN, WHO, WHERE, WHAT)
$$ ##TITLE= Audit trail, XWIN-NMR		Version 3.5
$$ ##JCAMPDX= 5.01
$$ ##ORIGIN= Bruker BioSpin GmbH
$$ ##OWNER= Yarkov
$$ C:/Bruker/XWIN-NMR/data/yarkov2/nmr/H-C/1/pdata/1/auditp.txt
$$ ##AUDIT TRAIL=  $$ (NUMBER, WHEN, WHO, WHERE, WHAT)
(   1,<2026-01-28 13:28:30.43 +0400>,<Yarkov>,<DPX200>,
      <created by zg, POWCHK disabled, PULCHK disabled
       configuration hash MD5:
       00 E9 B6 7A A2 85 ED C7 34 08 36 98 17 FE 4E 26
       data hash MD5: 16K
       E9 8E FE FF F4 BF 7F 92 C8 EB 75 54 12 73 D8 74>)
(   2,<2026-01-28 13:29:31.07 +0400>,<Yarkov>,<DPX200>,
      <Start of raw data processing
       efp BC_mod = 2 LB = 0.25 FT_mod = 6 PKNL = 1 PHC0 = -5294.697 PHC1 = 7.62193 SI = 16K 
       data hash MD5: 16K
       A9 BF 34 F6 FE 56 11 C8 0D C9 D9 88 8B BA 46 91>)
$$ ##END=
$$ 
$$ hash MD5
$$ F2 6D C3 36 8F 3D 96 FE BD DA 17 FC AB 42 9E 3F
##$RELAX= 
##$RELAX= 
##$RELAX= 
##$RELAX= 
##$RELAX= 
##$RELAX= 
$$ Bruker specific parameters
$$ --------------------------
##$DU= <C:/Bruker/XWIN-NMR>
##$EXPNO= 1
##$NAME= <H-C>
##$PROCNO= 1
##$TYPE= <nmr>
##$USER= <yarkov2>
##$AMP= (0..31)
100 100 100 100 100 100 100 100 100 100 100 100 100 100 100 100 100 100 
100 100 100 100 100 100 100 100 100 100 100 100 100 100 
##$AQSEQ= 0
##$AQ_mod= 1
##$AUNM= <au_zg>
##$AUTOPOS= <>
##$BF1= 200.13
##$BF2= 200.13
##$BF3= 200.13
##$BF4= 200.13
##$BF5= 200.13
##$BF6= 200.13
##$BF7= 200.13
##$BF8= 200.13
##$BYTORDA= 1
##$CFDGTYP= 0
##$CFRGTYP= 5
##$CHEMSTR= <none>
##$CNST= (0..31)
1 1 145 1 1 1 1 1 1 1 1 1 1 1 1 1 1 1 1 1 1 1 1 1 1 1 1 1 1 1 1 1 
##$CPDPRG= <>
##$CPDPRG1= <>
##$CPDPRG2= <>
##$CPDPRG3= <>
##$CPDPRG4= <mlev>
##$CPDPRG5= <mlev>
##$CPDPRG6= <mlev>
##$CPDPRG7= <mlev>
##$CPDPRG8= <mlev>
##$CPDPRGB= <>
##$CPDPRGT= <>
##$D= (0..31)
0 0.7 0 0 0 0 0 0 0 0 0 0.03 0 0 0 0 0 0 0 0 0 0 0 0 0 0 0 0 0 0 0 0 
##$DATE= 1769592509
##$DBL= (0..7)
120 120 120 120 120 120 120 120 
##$DBP= (0..7)
150 150 150 150 150 150 150 150 
##$DBP07= 0
##$DBPNAM0= <>
##$DBPNAM1= <>
##$DBPNAM2= <>
##$DBPNAM3= <>
##$DBPNAM4= <>
##$DBPNAM5= <>
##$DBPNAM6= <>
##$DBPNAM7= <>
##$DBPOAL= (0..7)
0.5 0.5 0.5 0.5 0.5 0.5 0.5 0.5 
##$DBPOFFS= (0..7)
0 0 0 0 0 0 0 0 
##$DE= 6
##$DECBNUC= <off>
##$DECIM= 32
##$DECNUC= <off>
##$DECSTAT= 4
##$DIGMOD= 1
##$DIGTYP= 9
##$DL= (0..7)
0 120 120 120 120 120 120 120 
##$DP= (0..7)
$$ [...]
##$SUBNAM2= <"">
##$SUBNAM3= <"">
##$SUBNAM4= <"">
##$SUBNAM5= <"">
##$SUBNAM6= <"">
##$SUBNAM7= <"">
##$SUBNAM8= <"">
##$SUBNAM9= <"">
##$SW= 18.0517328524113
##$SWIBOX= (0..15)
0 0 2 0 0 0 0 0 0 0 0 0 0 0 0 0 
##$SW_h= 3612.71676300578
##$TD= 16384
##$TD0= 1
##$TE= 0
##$TE2= 300
##$TE3= 300
##$TEG= 300
##$TL= (0..7)
0 120 120 120 120 120 120 120 
##$TP= (0..7)
150 150 150 150 150 150 150 150 
##$TP07= 0
##$TPNAME0= <>
##$TPNAME1= <>
##$TPNAME2= <>
##$TPNAME3= <>
##$TPNAME4= <>
##$TPNAME5= <>
##$TPNAME6= <>
##$TPNAME7= <>
##$TPOAL= (0..7)
0.5 0.5 0.5 0.5 0.5 0.5 0.5 0.5 
##$TPOFFS= (0..7)
0 0 0 0 0 0 0 0 
##$TUNHIN= 0
##$TUNHOUT= 0
##$TUNXOUT= 0
##$USERA1= <user>
##$USERA2= <user>
##$USERA3= <user>
##$USERA4= <user>
##$USERA5= <user>
##$V9= 5
##$VALIST= <valist>
##$VCLIST= <CCCCCCCCCCCCCCC>
##$VD= 0
##$VDLIST= <DDDDDDDDDDDDDDD>
##$VPLIST= <PPPPPPPPPPPPPPP>
##$VTLIST= <TTTTTTTTTTTTTTT>
##$WBST= 1024
##$WBSW= 4
##$XGAIN= (0..3)
0 0 0 0 
##$XL= 0
##$YL= 0
##$YMAX_a= 41612
##$YMIN_a= -38496
##$ZGOPTNS= <>
##$ZL1= 120
##$ZL2= 120
##$ZL3= 120
##$ZL4= 120
##$ABSF1= 0
##$ABSF2= 0
##$ABSG= 0
##$ABSL= 0
##$ALPHA= 0
##$AQORDER= 0
##$ASSFAC= 0
##$ASSFACI= 0
##$ASSFACX= 0
##$ASSWID= 0
##$AUNMP= <proc_1d>
##$AZFE= 0.1
##$AZFW= 0.1
##$BCFW= 0
##$BC_mod= 2
##$BYTORDP= 0
##$COROFFS= 0
##$CY= -3
##$DATMOD= 1
##$DC= 0
##$DFILT= <>
##$DTYPP= 0
##$F1P= 0
##$F2P= 0
##$FCOR= 1
##$FTSIZE= 16384
##$FT_mod= 6
##$GAMMA= 0
##$GB= 0
##$INTBC= 1
##$INTSCL= 3.241238e-09
##$ISEN= 128
##$LB= 0.25
##$LEV0= 0
##$LPBIN= 0
##$MAXI= 10000
##$MC2= 0
##$MEAN= 0
##$ME_mod= 0
##$MI= 1.114404
##$NCOEF= 0
##$NC_proc= -8
##$NLEV= 6
##$NOISF1= 3.799351
##$NOISF2= 2.8
##$NSP= 0
##$NTH_PI= 0
##$NZP= 0
##$OFFSET= 15.47474
##$PC= 1
##$PHC0= -5294.697
##$PHC1= 7.62193
##$PH_mod= 1
##$PKNL= yes
##$PPARMOD= 0
##$PSCAL= 0
##$PSIGN= 0
##$REVERSE= no
##$SF= 200.130009397034
##$SI= 16384
##$SIGF1= 3
##$SIGF2= 2
##$SINO= 0.751879
##$SIOLD= 32768
##$SREGLST= <19F.Aceton>
##$SSB= 0
##$STSI= 16384
##$STSR= 0
##$SW_p= 3612.71676300578
##$SYMM= 0
##$S_DEV= 0
##$TDeff= 16384
##$TDoff= 0
##$TI= <>
##$TILT= no
##$TM1= 0
##$TM2= 0
##$TOPLEV= 0
##$USERP1= <user>
##$USERP2= <user>
##$USERP3= <user>
##$USERP4= <user>
##$USERP5= <user>
##$WDW= 1
##$XDIM= 16384
##$YMAX_p= 489601656
##$YMIN_p= -3938875
$$ End of Bruker specific parameters
$$ ---------------------------------
##NTUPLES= NMR SPECTRUM
##VAR_NAME=  FREQUENCY,     SPECTRUM/REAL,   SPECTRUM/IMAG
##SYMBOL=    X,             R,               I
##VAR_TYPE=  INDEPENDENT,   DEPENDENT,       DEPENDENT
##VAR_FORM=  AFFN,          ASDF,            ASDF
##VAR_DIM=   16384,         16384,           16384
##UNITS=     HZ,            ARBITRARY UNITS, ARBITRARY UNITS
##FACTOR=    0.220516191357247, 1,           1
##FIRST=     3096.95986729662, 0,            0
##LAST=      -515.756895709163, 0,           0
##MIN=       -515.756895709163, -3938875,    0
##MAX=       3096.95986729662, 489601656,    0
$$ Real data points
##PAGE= N=1
##DATA TABLE= (X++(R..R)), XYDATA
$$ [...]
5209g27936R01690j052143Q2531L39500P34837M92632L12694K31466j187891P58092
5199H85472k35449l88162J07224K09578K09806m46526j535848m58241Q43565L28790
5189d79791Q0122P00091J0167o55981L9283K22692p16241K76737n92960O23158
5179d92723J070167j8404j108209R63391J87446L12217o12199M11024p0668n62435
5169G9607m33352r85147J237503p51641j05706Q93325J024284N37671j303188
5160A93356K23525q5186k280585J583923L3089J66557N19730M58068J019780K25028
5150B057285M58485r85552o04982Q6451j056132m13251k70725O08483J11146j19290
5140a28082k96458J42724k05008r50830J372612L27695q95228P66028l33581r96551
$$ y = [-727936, 173754, -878389, -795858, -456358, 278479, 771111, 1083805, 1315271, 127380, 885472, 650023, 261861, 369085, 578663, 788469, 341943, -1193905, -1652146, -808581, -479791, -399669, 300422, 310589, -345392, -306109, -83417, -799658, -522921, -1115881, -492723, 577444, 559040, -549169, 414222, 601668, 913885, 301686, 712710, 642042, 79607, -353745, -1338892, -101389, -853030, -958736, -65411, 958873, 1496544, 193356, 416881, 331695, -1948890, -364967, -331878, -165321, 354409, 812477, 1832257, 2057285, 2515770, 1530218, 925236, 1011687, -44445, -457696, -728421, -119938, -8792, -128082, -424540, -281816, -486824, -1437654, -65042, 262653, -632575, 133453, -200128, -1196679]
5130a196679J616511p95580n49398R94903k068892J310650J410675J951154j449026
5121A224318J47613P28287M88065j322070K22550P76557k289402n21168Q68904
5112C23654q2050j633008k37577m78558L88779J701299O68641j080433K83401
5103a45852J442256j599570k94819J249497R43553k25266j131624P98233j587455
5094e51047J49853J117071k02952j353760P25908J205133J391196j582156j360464
5085d61218o89261n1358R09997M12254R07500P1679j276619m13461r88104O47016
5075i31575J417799Q98140J20632j203474M87882j09586O82791j22472l06643
5066I33494P82085q63373q53454m15124n32333j051451q92990J067180j34041
$$ y = [-1196679, 419832, -375748, -925146, 69757, -1999135, -688485, 722190, 2673344, 1224318, 1371931, 2100218, 2588283, 1266213, 1488763, 2265320, -24082, -545250, 323654, 241604, -1391404, -1628981, -2107539, -1718760, -17461, 651180, -429253, -145852, 1296404, -303166, -597985, 651512, 1595065, 1369799, 238175, 1036408, -551047, -401194, 715877, 512925, -840835, -114927, 1090206, 2481402, 899246, -461218, -1150479, -1201837, -291840, 120414, 1027914, 1099593, -177026, -590487, -1578591, -931575, 486224, 1384364, 1504996, 301522, 789404, 679818, 1362609, 1240137, 933494, 1715579, 852206, -1248, -416372, -948705, -2000156, -2893146, -1825966, -1960007]
5057a960007J754177J040142m52179l12305M82863j313523J68575R99565N01068
5048I08376k00799N08600j733127j044393J66730j53146J476449K12202L64089
5039E04981n77307J87875J365573k45965j783649J397692J96252q37318l88146
5030a80012J531861j87441k44878M34110o90436q2293J614978l70343R47321j851916
5020I20951Q23172m43202r35003N43971L6018n72537l43297J215364k61816j099924
5010a16303k417812J707534Q93155k32841J385466O4414j245901j689610L38857
5001a313041K069714J31626m7569Q70742o42391j038122N29654J266305r86728
4992H40190K4081p99039K10954K74710o18370l3077p22244R83770l77642L53047
$$ y = [-1960007, -205830, 834312, 382133, 69828, 552691, -760832, -592257, 407308, 908376, 707577, 1216177, -516950, -1561343, -1394613, -1547759, -71310, 140892, 504981, -72326, 115549, 1481122, 1235157, -548492, 849200, 1045452, 208134, -180012, 1351849, 1164408, 919530, 1353640, 663204, 580911, 2195889, 1825546, 2772867, 920951, 1744123, 1300921, 365918, 909889, 945907, 373370, 30073, 1245437, 983621, -116303, -2534115, -826581, 66574, -166267, 1219199, 1283613, 37712, -1651898, -1313041, 756673, 888299, 840730, 1711472, 1069081, 30959, 560613, 1826918, 840190, 864271, 65232, 276186, 550896, -67474, -100551, -822795, 160975, -216667, 136380]
4982A36380M53068K09179n9559J810737j308897n76408N49406l12525m7253k23015
4972F31113J017525l79510M5328q55635n07392M20672J14936q46876p51513J34303
4962i77049L70274P86903m08021J439881j240135K838064j380770M20424J558391
4953C407962m67191n70417p11061R53226j839333L9373L53571J149150K02240
4944B517520o45879k0671j539360j270431N31454m5071j599075J416452n21541
4935a176602N16661P95262n65266J9447R19270J571229l45542r64668n95174J545246
4925A719863r47636R74340J493338q34889p80551K7229k287440J102629L70639
4916H37522N69654Q8293j50153J117616p95191K94986n03815m07377n19582J60814
$$ y = [136380, 589448, 798627, 739068, 2549805, 1240908, 664500, 1213906, 901381, 854128, 631113, 1648638, 1269128, 1314456, 458821, -48571, 372101, 487037, -359839, -1111352, -977049, -606775, 180128, -227893, 1211988, -28147, 2809917, 1429147, 1849571, 3407962, 2940771, 2370354, 1659293, 2612519, 773186, 812559, 1166130, 2315280, 2517520, 1871641, 1850970, 311610, -958821, -427367, -472438, -2071513, -655061, -1176602, -659941, 135321, -429945, -410498, 508772, 2080001, 1734459, 769791, 174617, 1719863, 772227, 1746567, 3239905, 2405016, 1624465, 1651694, -635746, 466883, 837522, 1407176, 1495469, 1345316, 2462932, 1667741, 1962727, 1458912, 1051535, 531953, 692767]
4906F92767j254453L74486L63346r7799L14412L00964O78714j96102o6971J474936
4896B584300m11568j364632r96393l75679R42036j44072N69892l34530J9653P57193
4886A246200N8243N05367p33773J028314q94455o22362N75856r10204j764723
4877a511537M29794J354483p67351J859709M11439m50126L38996j269400R04518
4868A300525K25549q3482j456833K01486R09179r44900j5191L47396k87718k49845
4858e3834L45075p56239J88520K23588J50674p11886J364203j72364p797l65883
4848B04057q4849k185784K065821N10063Q37725O06716J115221j810086p29326
4839E29558p15101M70787N03737k0714L07234j033848m70595O95237J5404O41436
$$ y = [692767, -561686, -187200, 176146, 78347, 392759, 693723, 1372437, 1176335, 1109364, 2584300, 2172732, 808100, -188293, -563972, 378064, 233992, 803884, 469354, 489007, 1246200, 1304443, 1809810, 1076037, 2104351, 1209896, 587534, 1163390, 253186, -1511537, -1081743, 272740, -494611, 1365098, 1776537, 1326411, 1665407, 396007, 1300525, 1526074, 1442592, -14241, 187245, 1096424, 151524, 136333, 483729, 196011, -53834, 291241, -464998, -276478, -52890, 97784, -614102, 750101, 577737, 569940, 204057, 119208, -2066576, -755, 509308, 1347033, 1953749, 3068970, 1258884, 529558, -185543, 285244, 788981, 768267, 1075501, 41653, -428942, 266295, 281699, 923135]
4829I23135r6619r09583N04193j9389l08598r18920J512924n30893r30741J183613
4819D09122j15700j63094J432171j933479Q47928j102248J018804j6174l21356
4810E5974n24328n65750Q25735m54713k62149P12344L54893M67515k0092r08470
4800c19041J992990j776313k98418l71489l49944O61086K70046K373214m62386
4791A719745j700472j563051J123035j99756p31863J293672J645937p43855l27117
4782E16275J4011N50250q50553m53984j68278L52769j543856N09033J366102p40930
4772d49161P89209n13275J482577q36645n68406l63498K59065m3245q7206Q44839
4762E14254j411606J136035n98826L1094K109047k511837k32125N45886o89867
$$ y = [923135, 826516, -83067, 421126, 401737, 93139, -825781, 687143, 156250, -774491, 409122, 293422, 130328, 1562499, -370980, 476948, -625300, 393504, 377330, 55974, -468354, -1034104, -208369, -663082, -925231, -212887, 142006, 609521, 589429, -319041, 1673949, -102364, -400782, -772271, -1122215, -461129, -191083, 2182131, 1719745, 19273, -1543778, -420743, -620499, -1352362, -58690, 1587247, 843392, 516275, 530286, 1080536, 229983, -224001, -392279, -39510, -1583366, -1074333, 291769, -449161, 340048, -173227, 1309350, 472705, -95701, -459199, -200134, -243379, -330585, 514254, -897352, 238683, -360143, -329049, 1779998, -731839, -963964, -418078, -1107945]
4753a107945J234933J07845k38877q38004K46676J78585J403515R27737k95595
4744A618870j23260N5852j221436q4519p00740o34624O77064O07635J009748o37042
4734E67548J246594j280910p1087P54154p23265n18664k93782L96589p38627J473380
4724H11930K42200L96031j598532l61182K50189J431012J240519K04875m34027
4715B183015j120424j032731N82732M01004l66986J057498j41873j551018n61922
4706e50705J464035Q72257j201225K47747l21422j9165L63250J256966J94296
4697B306034p35180j374260o10041O5612O83672M09938L86978j75126j801970
4688h44343K81854J263868L36312q68489J521389q36252j06003M55441K10367
$$ y = [-1107945, 126988, 234833, -4044, -842048, -595372, -416787, 986728, 1914465, 1618870, 1495610, 1551462, 330026, 245507, -455233, -1089857, -412793, 194842, 1204590, 567548, 1814142, 533232, 462145, 1216299, 493034, -25630, -319412, 77177, -661450, 811930, 1054130, 1450161, -148371, -509553, -259364, 1171648, 2412167, 2617042, 2183015, 1062591, 29860, 612592, 1013596, 646610, 1704108, 1562235, 11217, -550705, 913330, 1785587, 584362, 832109, 510687, 491522, 854772, 2111738, 2306034, 1570854, 196594, -413447, -347835, 335837, 745775, 1132753, 957627, -844343, -562489, 701379, 1037691, 169202, 1690591, 854339, 748336, 1203777, 1414144]
4679A414144j862812k62333K9242P50869j17074m2504J25953k9579p75995P11303
4669e8786J185210j402854q16371P77669R28076N30216L47033J38500k688715
4660a060022L8955q83469M02221J577854M90789K46550q0518O73586l65977M88105
4650A528074p6119j164951O11165l67874j165561J71389M33649O99492n24806
4641A44458k19690J933107j303366m81959K71656L1727p43387l86562K65924J344355
4631H56263J13782r15749K96952j339733m89855J614523J039091q31535M05902
4622G49641o78482J422886L10568k76023l27096J192856j360091k7290l18064
4613F88905j318945J181833j578612J592321J10695J2098J46729r44699n35081
$$ y = [1414144, -448668, -711001, -681759, 69110, -47964, -90468, 35485, 5906, -770089, -58786, 1126424, -276430, -1092801, -315132, 612944, 1143160, 1490193, 1628693, -1060022, -1021067, -1904536, -1502315, 75539, 566328, 812878, 732360, 1405946, 1039969, 1528074, 1451955, 287004, 898169, 530295, -635266, -463877, -30228, 669264, 144458, -75232, 1857875, 554509, 72550, 344206, 375933, -367454, -754016, -488092, 856263, 970045, 54296, 351248, -988485, -1478340, 136183, 1175274, 343739, 749641, 71159, 1494045, 1804613, 1528590, 1201494, 2394350, 1034259, 1006969, 688905, -630040, 551793, -1026819, 565502, 676197, 688295, 835024, -109675, -644756]
4604f44756p8048O81078O64442n91781N17706p00520J66491m75379p55613R58851
4594b57529L3854J177592O45206j621766j71601K68291L89419J087873n27317
4585A024022K00616J56668m03750M6459o59419j306432Q25021k36037N67067N2249
4575B66464Q01809o68266O75406K77224j563330O65983J165031j030630j208609
4566f18918p40728O26145J023326O74573K38184N88534m12997j229056k22181
4557g3118O76588P79429o95662k30483K64611j000274k1559n00009Q29561j657100
4547a628016n08389K045476N30788q08713J693882P41358r17570J025984n05184
4538A669616R15483p21585j661153j283262m43622K27499J841341j75446m70393
$$ y = [-644756, -722804, -41726, 622716, 30935, 548641, -151879, 14612, -460767, -1216380, -257529, -223675, 953917, 1599123, -22643, -194244, 74047, 463466, 1551339, 1024022, 1224638, 1381306, 977556, 1024015, 364596, -941836, -116815, -352852, 214215, 266464, 1068273, 400007, 1075413, 1352637, -210693, 455290, 1620321, 589691, -618918, -1359646, -733501, 289825, 964398, 1202582, 1791116, 1378119, 149063, -73118, 603470, 1382899, 687237, 456754, 721365, -278909, -300468, -800477, 29084, -1628016, -2136405, -90929, 439859, -368854, 1325028, 2066386, 1148816, 2174800, 1669616, 2585099, 1863514, 202361, -1080901, -1524523, -1297024, 544317, 368871, -101522]
4529a01522J680577l68312L10888J167069k81829j058729M16591j30782m52205
4520A181746p07000j714266j178957j17457J025537K075255o94472l7561o84990
4511h52165j50142K72149P31297P65787P17657m43362q53397k08699n70534O58559
4501F7150o73049k220516K072950K84910k49495k53106J052101K41665n5109M29245
4491F96746R63444m79142l08632l59600j390986K85613n89226J244582n65696
4482e02897r131Q00661O32334k482578K012376M5726m62197P5083P75626j416675
4472e31672N14607P91334l20889k36299k36549k31190Q56016j100156m74851J068478
4462I8829P8694K471098j098911j64306L78881j932196m33770P54406o55874q74386
$$ y = [-101522, 1579055, 1210743, 1521631, 2688700, 2406871, 1348142, 1764733, 1633951, 1181746, 474746, -1239520, -2418477, -2535934, -1510397, 564858, -129614, -167175, -852165, -1002307, -730158, 1139, 766926, 1484583, 1041221, 187824, -20875, -591409, 67150, -605899, -2826415, -753465, -468555, -718050, -971156, 80945, 322610, 267501, 696746, 1660190, 1181048, 872416, 512816, -878170, -592557, -1181783, 62799, -502897, -512028, 288633, 920967, -1561611, 450765, 496491, 34294, 109377, 885003, -531672, -17065, 774269, 453380, 217081, -19468, -250658, 605358, -494798, -969649, 98829, 177523, 2648621, 1549710, 1385404, 1764285, -167911, -601681, 152725, -503149, -1377535]
4452a377535O96440j253999O99622K69115p75150J459262M09926Q47578j74410
4443H00849L69261j501513j843706J038509k3425J096542M14508J43085q78186
4434c84076J83835q50090J627290Q9468M31443q57120K44728J57721J16795J176266
4424A936260q42253r31615k81850O60665n99792n03239r9094o97143N55719J463603
4414F61261j150665J508435m58707J196506j7362j658704k156721R08052P36166
4405d31739J392516J070269j533004J757215r26271l4120n14345j85834o70j84464
4395D09553j409551o20195M75751p30842q02258P18726O88730O27427J080887
4386D38228j35110o16728M40147P96773o54992k69720J24880O5376R4843R04450
$$ y = [-1377535, -681095, -1935094, -1235472, -966357, -1741507, -282245, 127681, 975259, 800849, 1170110, -331403, -2175109, -1136600, -1160025, -63483, 351025, 494110, -384076, -200241, -1050331, 576959, 666427, 1097870, 240750, 485478, 643199, 759994, 1936260, 1094007, 162392, -119458, 541207, -58585, -561824, -660918, -1358061, -802342, 661261, -489404, 1019031, 560324, 1756830, 1739468, 80764, -2075957, -1167905, -431739, 960777, 2031046, 498042, 2255257, 1328986, 1294866, 780521, 594687, 594017, 409553, -999998, -1620193, -1144442, -1875284, -2677542, -1958816, -1270086, -642659, 438228, 303118, -313610, 126537, 923310, 268318, -1402, 123478, 188854, 283697, 1188147]
4376A188147j129602N70734o3104p15485j259341K670752j480150j65785o06080
4367i89914J530210J55642j114820Q05182j587933R00526J47053o95376O06758
4358b42672J148865k92270l48977L63324M67519o41046o17163N44726L39137j45056
4348E76387j430827j082379J109905J318866Q29202J81307J24796p16011k85080
4339F26166J59552j472538n26138M77623J076914J468033k661225j395907R82058
4330a265462R82934o59902J467031J536700k077618k84922L70216K06250q33441
4321e58214J716823J088348k028221P3878r02377O79799n37894J148046Q95086
4312A575274q13274q77847o29641o13543O7905J092739R54889J632422K70101
$$ y = [1188147, 58545, 629279, 566175, -149310, -1408651, 1262101, -218049, -383834, -989914, 540296, 695938, -418882, 386300, -1201633, -301107, -154054, -849430, -242672, 906193, 613923, 264946, 628270, 1095789, 454743, -162420, 382306, 721443, 576387, -854440, -1936819, -826914, 491952, 1321154, 1502461, 1627257, 911246, 626166, 785718, -686820, -1212958, -735335, 341579, 1809612, -851613, -2247520, -1265462, -282528, -942430, 524601, 2061301, -16317, -301239, 68977, 275227, -558214, 1158609, 2246957, 218736, 292614, -609763, 70036, -467858, 680188, 1575274, 762000, -115847, -745488, -1359031, -1291126, -198387, 756502, 2388924, 2659025]
4303B659025m72632j871021j157200q4523J830314O38037l49141l83053N07945
4294A317751j366747j770034M68720J200779j02151j045638p0676J327399J40490
4285I9893K46850M27733J485729l89686j200722J393710k19114j195917j609704
4276i61228N09928L62208J234145M81045o93603j05019j51774j239557O92393
4267A28538L01185j014267K91389M89313j110695q1348J73522j20072Q03926J99556
4257F1047J093610r78437Q06707M51692j582769m8190J620217j029595j023997
4248f29715R53220Q0092o32861r84316J321517J092944j137681k6825O36623j518020
4238h45022o43048N2357m2890Q13486N42709P17113M87902l98951m38368p30200
$$ y = [2659025, 2186393, 315372, -841828, -926351, 903963, 1542000, 1192859, 809806, 1317751, -48996, -1819030, -1350310, -149531, -251682, -1297320, -1367996, -40597, 99893, 346743, 774476, 2260205, 1870519, 669797, 2063507, 1844393, 648476, -961228, -451300, -89092, 1145053, 1626098, 932495, 827476, 675702, -563855, 128538, 429723, -584544, -293155, 196158, -914537, -995885, -822363, -942435, -138509, 61047, 1154657, 176220, 982927, 1434619, -148150, -196340, 1423877, 394282, -629715, 323505, 403597, -229264, -1213580, 107937, 1200881, 63200, 36375, 672998, -845022, -1488070, -1435713, -1478603, -665117, -122408, 594705, 1082607, 683656, 245288, -484912]
4228d84912L05086j226729Q90153J679255J353930r77912k82030M18478j299554
4219C75765J026368R16747j959328j240743J457116O09311r22975l83526J248660
4210A127395r29191q58651O57180j147299K26477J54895L38193P9058J114180
4201G62237L95590q30464J155198N2363n94430O05845r58612J81469o96301L6567
4191A09462L64159q00700l96176o4000o07685J20715Q28556J31279n20426J81629
4181f53187K293240j31175J0416O28948O17575o26065k011522k84808Q8870K12074
4171A44366K17148K35130N80837j469393p09445J08534P31562k05603O35116k17888
4161E0364j206079k82648J03029K193823m62671k99849L38974n52095m44260j05230
$$ y = [-484912, -179826, -1406555, -516402, 1162853, 2516783, 1538871, 1256841, 1675319, 375765, 1402133, 2318880, 359552, -881191, 575925, 1185236, 262261, -121265, 1127395, 198204, -660447, -3267, -1150566, -924089, -769194, -431001, -351943, 762237, 1157827, 327363, 1482561, 1534924, 940494, 1546339, 587727, 769196, 72895, 109462, 473621, -327079, -723255, -787255, -1394940, -1274225, -445669, -314390, -834816, -653187, 1640053, 1508878, 1519294, 2148242, 2765817, 2139752, 128230, -156578, -67708, 144366, 361514, 596644, 1177481, -291912, -1001357, -892823, -161261, -366864, 268252, 50364, -1155715, -1438363, -1335334, 858489, 395818, 95969, 434943, -117152, -561412, -666642]
4151f66642L63640J411212P94115q52017q1666q96554o83068l13158J560246P34616
4141A370724p06953p6418R72516j110851j190680L7647p06683K09639P39481r52972
4131a414550J485880l61780Q86483m73339j81546J85608n91530n6453n39644K10253
4121h50618M45853l00779L95555J102512n12557J10724j166393J187150j159081
4112g47634p33955Q14822J420211O01372p48740n41705k75254k19025q99750j44486
4102a474144J490052r48123L66135K048405p71461J424878k32221q10730q94069
4093A98722R49529q78857K72930O7377L45608K49589n41232k50024R66825n9038
4083A321429J88026r232j154134M9503j185761p4252R05853J97681L23758K94906
$$ y = [-666642, -303002, 1108210, 1902325, 1050308, 968642, 72088, -610980, -924138, 636108, 1370724, 663771, 587353, 1559869, 449018, -741662, -704015, -1410698, -1201059, -461578, -1414550, 71330, -290450, 596033, 122694, -58852, 126756, -464774, -521227, -1060871, -850618, -404765, -705544, -309989, 792523, 279966, 390690, -775703, 411447, -747634, -1481589, -666767, 753444, 1354816, 606076, 64371, -210883, -429908, -1329658, -1474144, 15908, -932215, -566080, 1482325, 710864, 2135742, 1903521, 1092791, 198722, 1148251, 269394, 542324, 609701, 955309, 1204898, 663666, 413642, 1380467, 1321429, 1509455, 1500223, 346089, 395592, -790169, -864421, 41432, 239113, 562871, 857777]
4073H57777j689489Q78367J56653O49547r65995j276925L91863M76146q840J760720
4063A229824n4740n82758m1304k98375R75292k9368Q35777L56309j935940K54144
4053G08861M20309j054407q86806P12096R31390M80816K63503j567622Q9214j564742
4043a467388K93210m01898J127330J549005Q6933o07280r22485j43649j488014
4034a974236J503772R43845J92894M57841p19922L99139k68818M88332K187425
4025C210272k535654j07257k1999J41564j126505K036412o86816j792988R08388
4016B5417J064323K31017k17396O85537j820990j336477P82031M14210O43927
4007D71599j96251l61336J91673j189012K61058Q70644n25900J669955R64791
$$ y = [857777, -831712, 46655, 203308, 852855, -113140, -1390065, -998202, -522056, -530896, 1229824, 1175084, 592326, 551022, 252647, 1227939, 1198571, 2034348, 2390657, 454717, 708861, 1129170, 74763, -812043, -99947, 831443, 1312259, 1575762, 8140, 97354, -1467388, -1174178, -1576076, -448746, 1100259, 1187192, 579912, -342573, -486222, -1974236, -470464, 473381, 666275, 1124116, 404194, 803333, 534515, 1022847, 3210272, 674618, 567361, 545362, 686926, -439579, 1596833, 910017, -882971, 25417, 1089740, 1320757, 1103361, 1788898, -32092, -1368569, -586538, -172328, 471599, 275348, -85988, 105685, -1083327, -822269, 48375, -477525, 1192430, 2157221]
3998B157221j127920p46990J41038L08641L47551K27110j690131K06795k71833
3989d48518L86350q68103J466864R92162j354169p46125P38591O30910j318855
3980e20893L6333k29524M94776J15357J171343P59570l2248k20452o97701J7510
3970H94071J12735o18380m34904M96513O0858k21848j013974j64173k09135K010033
3960I11796p70244J302262j039480q88677m53042k63536R13868k5720N98966l31537
3950d5344l75566j391450Q06342j37313N28115J60307J234308J861663O1944o8754
3940B634252k018622R7136j39299K71148n37367j20881p08399J071636n30624
3931A8980N89747N40319r612K73910j267757K88619j737153P47314J821251k82274
$$ y = [2157221, 1029301, 282311, 423349, 731990, 1079541, 1306651, -383480, -176685, -448518, -62168, -930271, 536593, 1528755, 174586, -571539, 167052, 797962, -520893, -484560, -714084, -219308, -103951, 1067392, 1826962, 1794714, 1574262, 876561, 894071, 1006806, 388426, -46478, 450035, 510893, 289045, -724929, -889102, -1098237, 911796, 141552, 1443814, 404334, -484343, -937385, -1200921, -287053, -312773, 286193, -45344, -420910, -1812360, -1006018, -1143331, -615216, -454909, 779399, 2641062, 2703006, 2634252, 615630, 712766, 573467, 844615, 307248, 186367, -522032, 549604, 18980, 608727, 1149046, 1139434, 1413344, 145587, 434206, -1302947, -555633, 1265618, 983344]
3921I83344O23973q91226l94098M76513p62580R48150k76962q3981n54000M87245
3911E56378j85034J531014j408518P34029j671319J34529R50808j458141J087482
3902B71228Q12641L58011R5066J013329N31108k147245j148956p93919J149464
3893A40727J382715j061492J383606J09627j320646l88281R1811n99077q40640
3884a101650n04820J988624J342637k65141n36073l36950m5137K50612K04637
3875I96739O12102n23895O33798j167479K18843j82742J35444N73867j330741
3866c4064k51779J73471j29791j081158J420750J004655L47961O8637M94338j127599
3856H85421O80870Q55620j87104N40245j78433j900194j107550Q84658L44126
$$ y = [983344, 1607317, 716091, 321993, 798506, 35926, 984076, 707114, 623133, 69133, 556378, 371344, 1902358, 493840, 1227869, -443450, -308921, 641887, -816254, 271228, 1083869, 1441880, 1536946, 2550275, 3081383, 934138, -214818, -1008737, 140727, 1523442, 461950, 1845556, 1955183, 634537, 246256, 338067, -261010, -1101650, -1606470, 382154, 1724791, 1459650, 923577, 586627, 541490, 792102, 996739, 1608841, 1084946, 1718744, 551265, 770108, 587366, 722810, 1296677, -34064, -285843, -112372, -242163, -1323321, 97429, 1102084, 1450045, 1518682, 2013020, 885421, 1566291, 2421911, 2234807, 2775052, 2596619, 696425, -411125, 473533, 817659]
3847H17659p59461J8936J381551q73370j595941J545848m75009m17925N09455
3838A51743M56194J110459j082440Q2044r14775J459801p50867o3169J468733
3829A917723P77587L18924j662827j436599o32495J092557N70959J340701R39046
3820C225576j316117j042527n8353P20708P51408J028311j101391L74308j582779
3811I99144J391356m40619j117876M51627j362768K096686K53040L08722K3474
3802B602786J132361j362049q46530N73133O22470P6231l49449R29825Q948l40422
3792C047304P88144J132294O4221m81201J711577k75096j160875K157418O41816
3783G625602M68220O21308J856427J752700L849735N009961M255572O284937P019459
$$ y = [817659, 58198, 77134, 1458685, 585315, -1010626, 535222, 60213, -357712, 151743, 607937, 1718396, 635956, 718000, -196775, 1263026, 512159, 448990, 1917723, 2695310, 3014234, 1351407, -85192, -717687, 374870, 945829, 2286530, 3225576, 1909459, 866932, 808579, 1529287, 2280695, 3309006, 2207615, 2581923, 999144, 2390500, 1949881, 832005, 1283632, -79136, 2017550, 2270590, 2579312, 2602786, 3735147, 2373098, 1526568, 2099701, 2722171, 2798402, 2448953, 3378778, 3387726, 3047304, 3835448, 4967742, 5031963, 4550762, 6262339, 5987243, 4826368, 6983786, 7625602, 8093822, 8715130, 10571557, 12324257, 16173992, 21183953, 25439525, 31724462, 38743921]
3774C8743921N548366K417263k645442l478091o108577p362423m147052m126077
3766A8841888l872462j719797j777522k466233l9408n66445m8056q22811k016514
3757E512640l42570k06495r2197P34997j806980k89091o38201j10218j53237L42834
3747B951482j04913o14251r75259r13885P26896k5623J24517Q57532M63347l86673
3737B103170r32931J355292m67832j417214J060105R41338o81147k57803P92998
3728B495976j105803p01364j032640R11351L34486L99765J305869p47024j6032
3719A844584n07718j530964R56849j032169J060351m75451K30333J166969p70123
3710I42661P42067j082234K85171m97745K022564J097215j457899j002026p12608
$$ y = [38743921, 44292287, 46709550, 44064108, 40586017, 34477440, 27115017, 22967965, 18841888, 14969426, 13249629, 11472107, 9005874, 8966466, 8400021, 8351965, 7529154, 5512640, 5170070, 4963575, 4871378, 5606375, 3799395, 3510304, 2872103, 2761885, 2608648, 2951482, 2846569, 2232318, 1257059, 343174, 1070070, 1044447, 1168964, 2026496, 2489843, 2103170, 1170239, 2525531, 2057699, 640485, 1700590, 2641928, 1960781, 1702978, 2495976, 1390173, 688809, -343831, 567520, 902006, 1301771, 2607640, 1860616, 1844584, 1336866, -194098, 762751, -269418, 790933, 315482, 545815, 1712784, 942661, 1684728, 602494, 887665, 389920, 2412484, 3509699, 2051800, 1049774, 337166]
3701C37166N750o36989J465146n27074j138565N99084L42369r2134O8607R67412
3691A390772j64823n0034M46985O77859J24603m40513q43303k96076j236440L92325
3681A355l1570J250345N71964j204247q33715N45710J640585r36228p66192P59680
3671I97687N12755j149342j348392j65064j05079J830813o42113N95962P67541
3662A294768k062584L0087j075331J57381N36535K553019m0815m64237P74909
3653A703732q64947L02006P73163l48528j572134l17055R09506j987782R00032
3644e02007N3715J191783J16380j448992k97002q36238J555718J85205m06495
3635c87933J00256J776486O35085L75153r99766n92949n68847k275575k11776
$$ y = [337166, 342916, -294073, 1171073, 643999, -494566, 104518, 446887, 354753, 423360, 1390772, 1225949, 1175915, 1622900, 2300759, 2425362, 1984849, 1141546, 845470, -390970, 1355, -30215, 1220130, 1792094, 587847, -245868, 299842, 1940427, 1004199, 238007, 997687, 1510442, 361100, -987292, -1152356, -1257435, 573378, -68735, 527227, 1294768, -767816, -737729, -1813060, -1655679, -1119144, 1433875, 1393060, 928823, 1703732, 838785, 1140791, 1913954, 1565426, -6708, -323763, 585743, -1402039, -502007, -448292, 743491, 859871, -589121, -886123, -1722361, -166643, 18562, -387933, -287677, 1488809, 2123894, 2499047, 1499281, 906332, 337485, -1938090, -2149866]
3626b149866J557004k36030p45674J170975R45150J272874K05771j504989N24923
3617A040138p14742j039811M91425P19843M15908m10411Q16951j162640j77302
3608b0641K18577K63630N74083J894862p87675J82064k1666o82669j158061R93630
3598A456134J48692k211447P89847q20421j00842P92478M42753k65901n11217
3589b79924J326773P42493j194241J037422J409803j377623K82701J0810n65507
3580A392707k17145q59756M86931j120663j29276J937422M29986K32224R9338
3571B251768p81488j579099N7789M12417R24788J963306j786860K410M1810j511847
3561e006n42338J312866M07391p26084P39341R62142j036520J482657K25998j57744
$$ y = [-2149866, -592862, -828892, -1574566, -403591, 541559, 1814433, 2020204, 515215, 1040138, 325396, -714415, -222990, 496853, 912761, 502350, 1319301, 156661, -20641, 197936, 461566, 1035649, 2930511, 2142836, 2324900, 2303234, 1620565, 462504, 1456134, 1604826, -606621, 183226, -637195, -738037, 54441, 497194, 231293, -279924, 1046849, 1789342, 595101, 1632523, 3042326, 1664703, 1947404, 1958214, 1392707, 1175562, 315806, 802737, -317926, -447202, 1490220, 1920206, 2152430, 2251768, 1470280, -108819, -51030, 361387, 1286175, 3249481, 1462621, 1465031, 1506841, -5006, -547344, 765522, 1172913, 446829, 1186170, 2148312, 1111792, 2594449, 2820447, 2662703]
3551B662703K18269o38280K30430J396597k003702q07351N77362j322177J31015
3542D44866M65650Q19423R67135o38686q59591J834375q84227l07590l44024o69665
3532H27666n61751J488927m36866J471554M03740j393462J00128j401962J78583
3523F76557J07050P71362M50498l19294j154316J70877K83417J331502k362196
3514d4543P69488j025258J313043q27222M24448L91581j11265J636999j281296
3505A245975J22223j11423j92818o81314L7952p42566J234885M58992p5378r86152
3495C10376l93744l09832J60917N24224L8387P85978J466590P1393r41268j049260
3485F63761r80840l45331j15352J54543J248668q3356R12584p93424L92999j212651
$$ y = [2662703, 2880972, 2242692, 2473122, 3869719, 1866017, 1058666, 1636028, 313851, 444866, 910516, 1729939, 2697074, 2058388, 1198797, 3033172, 2148945, 1841355, 1497331, 827666, 265915, 1754842, 1317976, 2789530, 3193270, 1799808, 1899936, 497974, 676557, 783607, 1554969, 2005467, 1686173, 531857, 702734, 986151, 2317653, -44543, 724945, -300313, 1012730, 185508, 609956, 1001537, 890272, 2527271, 1245975, 1368198, 1256775, 1063957, 382643, 420595, -321971, 912914, 1371906, 1296528, 310376, -83368, -393200, -232283, 291941, 330328, 1116306, 2582896, 2654289, 1713021, 663761, -317079, -662410, -777762, -623219, 625449, 542093, 1454677, 661253, 1054252, -158399]
3475a58399J221436j18108j231168j44670P85766L2446r38927Q05369j303325
3466a049580l12224P32761J17804J162080K13982n56659Q71169o18689n76568
3457a5924n90993J083062J030432j131408O18385o0754K67106m42109q23956p30565
3447g96724o17046R98024J280457J5775l06926n50920q88815J281521m47511o01839
3437f34004N27237J049969o74789k36727p75580Q40330N77278N83589j555956
3428b98653L95041K141710K91158j138931n65316k24424J28069P70924k56243
3419A243335j00933q05376m00339o24405J494873P8663K27193j808276L20655
3410c74610M36230p09505M03147O09248L16036l38631M10168q94247J469112l01115
$$ y = [-158399, 1063037, 944929, -286239, -430909, 354857, 387303, -551624, 253745, -1049580, -1361804, -629043, -511239, 650841, 864823, 308164, 1179333, 560644, -15924, -606917, 476145, 1506577, 375169, 993554, 932800, 1199906, 757797, -66159, -796724, -1413770, -415746, 864711, 880486, 573560, 22640, -866175, 415346, -32165, -634004, -106767, 943202, 268413, 31686, -743894, 96436, 673714, 1257303, -298653, 96388, 2238098, 2529256, 1390325, 825009, 600585, 728654, 1499578, 1243335, 1142402, 337026, -63313, -687718, 807155, 885818, 1113011, -695265, -374610, 61620, -647885, -244738, 364510, 680546, 341915, 752083, -142164, 1326948, 1025833]
3400A025833J96962m68264p80007P4389J036847K84838J14019n88745j525630
3391f29758R63502Q41407j31454j987241J042410o13745L41174O21302L58201
3382H05798p63866j322166N40897n88777J015626j904q2496j022266m30508L39628
3372a510034K021743J480485j030237J51161L42572r82190o14160J595666j34423
3363A320583p18724q74620J246233r16832j232484R68472n00930j012533L00911
3354a419924J95797q84849q81986J233306k37321N612J803648J97076q24934J414020
3344F00445j6570r42601O25490J45119j59077K16382K39220M75947L6103q41096
3334C79362K56309j509250r88525K52576J591309l55205j224616O93826Q2412
$$ y = [1025833, 1222795, 754531, -25476, 48913, 1085760, 1370598, 1484617, 895872, -629758, 333744, 1175151, 1043697, -943544, 98866, -514879, -173705, 447597, 805798, 41932, -1280234, -739337, -1328114, -312488, -314392, -396888, -1419154, -1849662, -1510034, 511709, 1992194, 961957, 1113118, 1455690, 473500, -140660, 1455006, 1320583, 601859, -272761, 973472, 56640, -1175844, -207372, -708302, -1720835, -1419924, -1224127, -2108976, -2990962, -1757656, -1994977, -1989365, -185717, 11359, -813575, 600445, 583875, -358726, 266764, 411883, 252806, 469188, 708408, 1184355, 1220458, 379362, 635671, -873579, -1862104, -1609528, -18219, -373424, -1598040, -904214, -821802]
3325h21802R8259n102q8543M5131L71456j97769k61202J372940k976m65096J064724
3314A110020O48215j564945o85944M62047N47752p68919M36756Q38447l81244
3305F42185j199709L25979j315424J060318K15146N24815P15396j404580P31029
3296B95155L01128p48962L28552P63777j48534Q1050J0583q19829J10613l20407
3286a46874k16571P259j57281k24907k66971J374080O70311R3317j47449K30414
3276A215328j262401j214682J380339J616465k89349k88711m47654o46269l69627
3267c06561J76266M05983J085978k41536r82166K70781m41603N87286j381245
3258h26817J096752j396428m68467K308067m0829O92351j474816O22644j028777
$$ y = [-821802, -723543, -728645, -817188, -772057, -400601, -598370, -859572, 513368, 510392, 45296, 1110020, 1758235, 193290, -492654, -30607, 517145, -251774, 184982, 1023429, 642185, -557524, -231545, -1546969, -486651, -271505, 253310, 968706, -435874, 295155, 596283, -152679, 175873, 939650, 791116, 872166, 882749, 62920, 173533, -146874, -363445, -356186, -513467, -738374, -1005345, 368735, 1039046, 1132363, 984914, 1215328, -47073, -1261755, 118584, 1735049, 1445700, 1156989, 709335, 63066, -306561, -130295, 275688, 1361666, 1120130, 137964, 408745, -32858, 554428, -826817, 269935, -1126493, -1594960, 713107, 672278, 1364629, -110187, 512457, -516320]
3249e16320j3017R72184Q2263M43442L85993q55354p35231L11514J004179p10166
3239C69487K09412j41518j105413k64879O82393R39122r45723R11720J24693r67088
3229a87794O88046l24009k09908j351389k86215J187855R73043k14256Q52681
3220A128054N4828O93784q66000p44142p85057O04237j72520m4406J650148j024113
3210D94813J22560M75947K1048o62152m25438K41516O02900q76214J180947j254454
3200g8527j7053P67512j00706n59924Q46018o17603j154243k86731r23769P5019
3190b050007J832942J400873j306696Q54499r7570k122004l2351J722077Q31774
3181A033537n94112P57925J090976j683257j016655J860746J093094n71143m18713
$$ y = [-516320, -529337, 442847, 525110, 968552, 1354545, 499191, -236040, 75474, 1079653, 369487, 578899, 437381, -668032, -932911, -250518, 688604, -257119, 654601, 779294, -187794, 500252, 176243, -33665, -1385054, -1671269, -483414, 489629, 275373, 1128054, 1182882, 1876666, 1010666, 266524, -518533, 85704, -86816, -131222, 1518926, 494813, 617373, 1093320, 1114368, 452216, 26778, 268294, 871194, -5020, 1175927, -78527, -95580, 671932, 571226, 11302, 857320, 239717, -914526, -1201257, -2125026, -2050007, -217065, 1183808, -122888, 731611, 634041, -1487963, -1520314, 201763, 1033537, 439425, 1197350, 2288326, 605069, -411586, 1449160, 2542254, 1971111, 1552398]
3172A552398p02685j920879J043544r1117N67788o02900M93466m583r9731N62770
3162G98071l42303J1916q4269J1895j080516O13045Q04998l66847R93292j41010
3152A218272r28918M49960k4913Q9576m13133J067918L07065l81586n84341k10666
3142E89234n47269r8054J160823m95657q592J09453q7867J075017j349429J079348
3132A427007R52173k043674K37106N61566m92481p52620j88640J442466k53942
3123H88961M21847q53109N99167j048857l30347o88191N59752M46114Q55997k57918
3113E93416K91074k323772J341182J468181m29587N72116k53812k45224j097151
3104h3577L57673K12615k74545o88315N22883n72709K94140l23904O10268j278114
$$ y = [1552398, 849713, -1071166, -27622, -118739, 449049, -153851, 339615, 335032, 235301, 798071, 455768, 467684, 383415, 395310, -685206, -72161, 732837, 365990, 1359282, 1218272, 289354, 739314, 714401, 803977, 390844, 1458762, 1765827, 1384241, 799900, 589234, 41965, -56089, 1104734, 609077, 600485, 709938, 622071, 1697088, 347659, 1427007, 2379180, 335506, 572612, 1134178, 641697, -110923, -299563, 1142903, 888961, 1310808, 457699, 1056866, 8009, -322338, -1010529, -450777, -4663, 851334, 593416, 884490, -1439282, -98100, 1370081, 940494, 1512610, 1258798, 1013574, -83577, 274096, 486711, 212166, -476149, 46734, -525975, -231835, -555739, 54529, -1223585]
3094a223585q4579l8591J230805R33274O7453n66636M0414O4011Q1069j179124
3084f75489R22081p13105J24430P69166n88400O03992j791167P72732l44630M50795
3074d69595o64568J326627m09139k29529J275388r03085j71583j913652k92113
3065b451249M89997k915L14974O16516J165512J006025o05947J168010j083808
3056F17115n85553o83074N68564M08621m47246j32246J068774m68349J69906L4338
3046E50850N93966O33842K36418j284493N15866J162021j745264O8402J738451
3037B470059j949064n74613k19232r15217L50629j75049P11846l21617n93696
3028a215954J28749J98101J495936O99709j417374J60892N7514j93114K97755
$$ y = [-1223585, -1308164, -1346755, -115950, 817324, 884777, 318141, 358555, 422566, 503635, -675489, 246592, -466513, -342083, 427083, -161317, 442675, -1348492, -575760, -920390, -469595, -1134163, 192464, -216675, -446204, 829184, -73901, -245484, -2159136, -2451249, -1961252, -1964167, -1649193, -1032677, 132835, 1138860, 532913, 1700923, 617115, 31562, -651512, -82948, 325673, -121573, -253819, 814955, 346606, 516512, 550850, 1144816, 1778658, 2015076, 730583, 1246449, 2408470, 663206, 731608, 2470059, 520995, -53618, -272850, -1188067, -837438, -1012487, -300641, -622258, -1215954, -1087205, -889104, 606832, 1306541, -110833, 50059, 107573, -85541, 212214]
3019B12214P00983o12920p95845O23193m56452K28380j55321J36015L50009N44583
3009G74839J72482m11059O94382j67080k91266j291219J432536r73203K92760
3000B33172n93198N88426q39107O04715R20728L11416N11946m30576j016805j094583
2990h03866M68857q79459J284782Q21906J6898k119581M25607O78974k59653j053346
2980a418881P92729J844122j627457P87209L36232O81162l59406Q57858l88752
2971A504816j438031j29956J48905n99319M42470M12337o16680N61110L77444
2962F63096q06356p83206l09644J472765M4363L6723j38136m1142j231297P14821
2952c78013l16909O1412R01943M933n5921J04110O95217j43781N31628l55829
$$ y = [212214, 913197, 300277, -495568, 127625, -328827, -100447, -255768, -119753, 230256, 774839, 947321, 536262, 1230644, 1063564, 772298, -518921, 913615, -59588, 233172, -360026, 228400, -610707, -5992, 914736, 1226152, 1738098, 1307522, 290717, -803866, -335009, -1214468, 70314, 892220, 909118, -1210463, -784856, -105882, -365535, -1418881, -626152, 1217970, -409487, 377722, 713954, 1395116, 1035710, 1893568, 1504816, 66785, -63171, 85734, -513585, -71115, 341222, -275458, 285652, 663096, -143260, -926466, -1236110, 236655, 281018, 317741, 179605, 138463, -1092834, -378013, -694922, -633510, 268433, 273366, 217445, 321555, 1016772, 872991, 1404619, 1048790]
2942A048790l04879j004571J246790R8070m22864j258706j216409m0273P88155
2933a065897k44305J965895j347185M52013n25382Q87602J87057o10613P34644
2924D33829k98019O85012k158587K48007J888899Q29397n43538q69691P82764
2915I98073m60397r53808O99740p16387o03121J274032J267672j187214J77866
2906D96456j94461k59990R60463j09603j242542M87441J21668L89053l86527J08147
2896C70105J15677p32175p02738O14260J688021j091692j103334R06757o72107
2887f07226J49670J097481k26328L60098Q96747m4235j085547J708724n36928
2878A712456k375940k94045J490142j72478N04654l06992n40957l08384L37019
$$ y = [1048790, 743911, -260660, 986130, 1084200, 661336, -597370, -1813779, -1854052, -1065897, -1310202, 655693, -691492, -239479, -764861, 122741, 309798, -300815, 433829, 135810, 820822, -1337765, -1089758, 799141, 1628538, 1085000, 215309, 998073, 537676, -416132, 283608, -432779, -1035900, 238132, 1505804, 318590, 496456, 301995, 42005, 1002468, 892865, -349677, 137764, 259432, 648485, 261958, 370105, 485782, -246393, -949131, -334871, 1353150, 261458, -841876, 64881, -607226, -457556, 639925, 413597, 773695, 1670442, 1626207, 540660, 2249384, 1712456, -663484, -957529, 532613, 360135, 864789, 557797, 16840, -291544, 45475]
2869D5475k07133L93588O89094j009378N5697J102561k69594j249646J394738
2860I45402J51008k73498K41949o84434Q75716k86015l06731L78577q61465o34057
2850d53548n87058J387573l24427k97967M09280n32156L74646j438j104846J973844
2840H43903j564568N6962Q18954M97465j066811j65120J481278l87327l48615
2831A66121l52701o65132J69655P56739j18103N66733j31750L21541r87310P96184
2821E21977J294139n92064k635990K005009r8714N4122K65459n98745R26264j317065
2811a75608q33455J368243m64380l17127j332164J124284J144261l71433J9481
2802A62102Q82995p76636j313964P57526J82191j33890K82908L42011r5384Q0644
$$ y = [45475, -161658, 231930, 921024, -88354, -32657, 1069904, 800310, -449336, 945402, 1096410, 822912, 1064861, 380427, 1256143, 970128, 663397, 1041974, 180509, -453548, -1040606, 346967, 22540, -275427, 133853, -398303, -23657, -25095, -1129941, 843903, -720665, -663703, 155251, 652716, -414095, -579215, 902063, 514736, 166121, -186580, -851712, -682057, 74682, -43421, 523312, 391562, 713103, -274207, 521977, 1816116, 1224052, -1411938, 593071, 494357, 548479, 813938, 215193, 1141457, -175608, -1009063, 359180, -105200, -422327, -1754491, -630207, 514054, 142621, 162102, 1045097, 268461, -1045503, -287977, -105786, -239676, 43232, 385243, 289859, 370503]
2792C70503p12590J131292q74403m52008K429894K413657k467814j533647m44508
2783a39624k65135O72172R92273M51544m77183r67942k79866N30625O5094j1053
2773E70905j989584Q83470j133293J506009j33760J011236m29622k05669N61529
2764F41221j318120L74085J739085o17378j808026J694136M59649m15386j375864
2755f26598J479374j177729l73971j98879R82698k59989k55540J16353k4272Q99708
2745E61155K85604O5463J401489j350518r70803R0429O73295R17433M72033j493083
2735F52497r78973O53513n57081K44766J089020j185775q68131R98516Q45580
2726H93932q0547k49612K2520J037356k193849J112024m9924j245229J506090
$$ y = [370503, -342087, 789205, -85198, -537206, 1892688, 4306345, 1838531, 304884, -139624, -404759, 267413, 1259686, 1711230, 1234047, 266105, -13761, 516864, 581958, 570905, -1418679, -535209, -1668502, -162493, -296253, 714983, 285361, 79692, 641221, -676899, -302814, 1436271, 818893, -989133, 705003, 1164652, 749266, -626598, 852776, -324953, -698924, -897803, 84895, -175094, -430634, -314281, -338553, 561155, 846759, 912222, 2313711, 963193, -7610, 82819, 756114, 1673547, 2145580, 652497, -326476, 327037, -230044, 14722, 1103742, -82033, -950164, 48352, 893932, 813385, 563773, 586293, 1623649, -570200, 541824, 491900, -753329, 752761]
2717G52761n01203J291654P11299j641735n92518O62327n34120J93090l0202K14577
2707E25930j531564N88709k84376k87501J636569k24011m41179P7176K89974M62623
2697H12350j528211k67415m73759P75123R17069k16873R54397j50694r12721q17220
2687i07954N9331M89795o1191J946574j055492m80359k93823j110930J49362K582671
2677A317984J22333J20207o92769k15278k97195p19158J184308k21459l60751
2668B38222m32874N40231j845395J918493p56492j059299Q99886M60812M50201
2659D13785J373075m93725p2474k4209m27331j66805O10830L04122J51343k003050
2649c34439l56921P09594r44935J107858J483548R96934n13387j733688L51465
$$ y = [752761, 251558, 1543212, 2254511, 612776, 20258, 682585, 148465, 341555, 311353, 525930, -1005634, -416925, -701301, -988802, 647767, 423756, -17423, 59753, 349727, 812350, -715861, -983276, -1457035, -681912, 235157, 18284, 972681, 821987, -90734, -907954, -848623, -358828, -420019, 1526555, 471063, -9296, -303119, -1414049, -1264687, 1317984, 1440317, 1560524, 867755, 652477, 355282, -363876, 820432, 598973, 238222, -194652, 345579, -1499816, 418677, -337815, -1397114, -497228, -36416, 413785, 1786860, 1293135, 1220661, 1196452, 769121, 602316, 1213146, 1517268, 1668611, -334439, -691360, 18234, -926701, 181157, 1664705, 2661639, 2148252, 414564, 766029]
2640G66029J43473P88486J59199n42701O3433j228063Q8823P69529k18240l79294
2630D10674N25727J157550p13476J6417R68218k007571k8761l50230J029050m30401
2620E77197P87955m30680J161379l8871j340026m65047K12325j444125N10323
2611d69570J894160L25383k12322j3350J57404J373022k46115j124394K7065n7664
2601A653619o19975L87801J91503n61501k74915J22489k19051p58499Q6564J369483
2591A377518l25202j69344J26172j156511J69860j8507M56285J123286j846392
2582b62835o56041J973521o38782P03253r87404N13277o67551N5503J874301P1084
2572A978326j97493j510405j001508M39517q15284R50158q17029P46207p40364
$$ y = [766029, 909502, 1697988, 1857187, 1314486, 1377919, 149856, 238679, 1008208, 789968, 410674, 936401, 2093951, 1380475, 1396892, 2365110, 357539, 328778, -21452, 1007598, 577197, 1365152, 934472, 2095851, 2056980, 716954, 251907, 464232, -979893, -469570, 1424590, 1749973, 1537651, 1524301, 1681705, 3054727, 2808612, 1684218, 1711283, 1653619, 1033644, 1421445, 1612948, 1051447, 776532, 899021, 679970, -78529, 8035, 1377518, 1052316, 882972, 1009144, -147367, 22493, 3986, 460271, 1583557, -262835, -918876, 1054645, 415863, 1119116, 131712, 644989, -22562, 32941, 1907242, 1978326, 1780833, 270428, -731080, -291563, -1106847, -156689, -973718, -227511, -967875]
2563i67875J200509K554891r62143j395403q14944J03510J64195J076594L98166
2554A357500n3068R1527o12594J97827m54506n49713j02138M37088O09172Q97914
2544A819009M22274P18054j391037j172080m23813J440504k65600p19120P21345
2535A149536j64016r98901r99524K175239j94647p63860k32182J224060j313035
2526a17330L53083J151680j992172J8226L3490M99883L41919J662471J202290
2517C153540m91503j081324p75357L86481l54677o38K04976P29938p06459J76934
2507A241911N03238J266347j580228N71395J043219o54883j319057R61525J67427
2498B200894j057631K54817n06841Q80793q71417K53535l67769L79144j80442
$$ y = [-967875, 232634, 2787525, 1825382, 429979, -384965, -281455, -117260, 959334, 1357500, 1304432, 1395959, 783365, 981192, 526686, -23027, -125165, 311923, 921095, 1819009, 2241283, 2959337, 1568300, 396220, -27593, 1412911, 1147311, 428191, 1149536, 985520, -13381, -1012905, 1162334, 967687, 203827, -28355, 1195705, -117330, 235753, 1387433, -604739, -586513, -553023, -53140, 288779, 1951250, 3153540, 2662037, 1580713, 805356, 1191837, 837160, 836522, 1041498, 1771436, 1064977, 1241911, 1745149, 3011496, 1431268, 2002663, 3045882, 2390999, 1071942, 2033467, 2200894, 1143263, 1398080, 891239, 1772032, 900615, 1154150, 786381, 1165525, 985083]
2489I85083q3011k60396R885J969183r10145j555169p03262k8927J598107L28747
2479A350095k64621m00286j245000J403248J204276J662371j000483n46608J06154
2470B269146j075929J484882J36626P26744j308246j182227J156941p14673J094908
2461B588172j269776M99623k73806j433807J162172J125699K5916K10020m28272
2452B205941Q48079j079622m67001R30461j091638K92887k20906N97218p26372
2443A289047J134307J50364M62700l72443K73364J036120J55786l04273l53347
2434C471625k28955j074032P50727J87363j8325l44148m39174q07612P45215J094372
2424C337056j546616J400580J541832L00622o58521J086647j126310n58006N89742
$$ y = [985083, 902072, 641676, 651561, 2620744, 1710599, 155430, -547832, -576759, 1021348, 1350095, 1085474, 685188, -559812, 843436, 2047712, 3710083, 2709600, 2162992, 2269146, 1193217, 2678099, 2814725, 3541469, 2233223, 1050996, 2207937, 1493264, 2588172, 1318396, 1818019, 1544213, 110406, 1272578, 2398277, 2424193, 2634213, 2205941, 3054020, 1974398, 1507397, 2437858, 1346220, 1639107, 1418201, 2015419, 1289047, 2423354, 2573718, 3036418, 2663975, 2937339, 3973459, 4129245, 3824972, 3471625, 3242670, 2168638, 2919365, 3106728, 3088403, 2744255, 2305081, 1497469, 2242684, 3337056, 1790440, 3191020, 4732852, 5033474, 4374953, 5461600, 4335290, 3777284, 4367026]
2415D367026K44020M65613R12618p95704L78307r1136j856284r03200R5017P34241
2405C550518R64738M77029K57954j82088M19432m54341K68597k20612Q56672q00315
2395E137584M90839j050000R24789l44588j042035J134703M63050N39096J46716
2386F400154M94922O74874m42072o17011Q88797P41758J838699j320961m7461
2377H611699J068490k30253q28030O09171n7423J3835k09000M40785J093008J060781
2367A1573063K49036o18034l96960J158016p19295M74049J529201P69800N57349
2358A4576225M047654M863498M056523N039369L750597P2646J750404P0096M003422
2349D2230434J553292M745431O681694Q800314J3513089J9666034K9559395O4048604
$$ y = [4367026, 4611046, 5076659, 5989277, 5193573, 5571880, 5480744, 3624460, 2721260, 2816277, 3550518, 4515256, 4992285, 5250239, 5068151, 5487583, 5033242, 5301839, 5081227, 5937899, 5137584, 5628423, 4578423, 5503212, 5158624, 4116589, 5251292, 5714342, 6253438, 6400154, 6895076, 7569950, 7127878, 6510867, 7399664, 8141422, 9980121, 8659160, 8611699, 9680189, 9449936, 8621906, 9231077, 9173654, 9187489, 8978489, 9419274, 10512282, 11573063, 11822099, 11204065, 10807105, 11965121, 11245826, 11719875, 13249076, 14018876, 14576225, 18623879, 23487377, 27543900, 32583269, 36333866, 36406512, 38156916, 38227012, 42230434, 43783726, 48529157, 55210851, 64011165, 77524254, 97190288, 126749683, 190798287]
2341A90798287J13661912J47829087L7312370m8131181o9982797r9428932p2755104
2334A99303642n2593878l3825678k6571823j9358046j4311581p753381n191861
2327C9697394l082056j221406L160558j325256k197941l837961l995909k483376
2319B4714047q96916k505760p62061j288972k026267o61791M10637k544923Q56389
2310A5294383j616947N99359j573405j176458R31375l264352n73927N72518o70615
2301H521931Q6715K07388Q41410o76136o63341K79833p90496j42584O619r43073
2291F728266m8398r65136j679580J05189J989418l44148q24076J497935Q1453
2282F540923q25499L39903l12440k14678j219307k98586O2498N13196M99887r84944
$$ y = [190798287, 304460199, 452289286, 489601656, 441470475, 371487678, 272058746, 199303642, 146709764, 112884086, 86312263, 66954217, 52642636, 44889255, 39697394, 36615338, 35393932, 38554490, 37229234, 35031293, 31193332, 27197423, 24714047, 23817131, 21311371, 20549310, 19260338, 17234071, 16572280, 16982917, 14437994, 15294383, 13677436, 14276795, 12703390, 11526932, 12458307, 9193955, 8620028, 9192546, 8521931, 8608646, 8816034, 9657444, 8981308, 8317967, 8597800, 7807304, 7664720, 7671339, 6728266, 6679868, 5714732, 4035152, 4140341, 6129759, 5785611, 4961535, 6459470, 6540923, 5715424, 6055327, 5742887, 5528209, 4308902, 4010316, 4072814, 4586010, 5085897, 4100953]
2272D100953L12871J040040p54010j253438j450306q44949J818549J372563L1020
2263D373293P91142k069923q13802m02744j25082m74803J77561J117161j690954
2254H81849J512310o8629J092491l3057n7056M85993q31951j375062j439032R65377
2244A133233J618413j911089K73286N45796L98511J97590L14735R32502j016272
2235B486705k213472P97415r87784Q5576J948385J23789R7121m44992K23192M39522
2225B555457l95421n95560o27795j218913M99537j83082J258652m8729n59330
2216F84816N95578J110882J07414k432372q1814R99216l99636J155872j72162
2207A567794j220371J95214n0316N64781O07120j149017j497545J131940q26760
$$ y = [4100953, 4413824, 5453864, 4699854, 3446416, 1996110, 1151161, 2969710, 4342273, 4373293, 5164435, 3094512, 2280710, 1877966, 1752884, 1278081, 1455642, 2572803, 881849, 2394159, 2325530, 3418021, 3384964, 3327908, 3813901, 2981950, 1606888, 167856, 1133233, 2751646, 840557, 1113843, 1659639, 2058150, 2255740, 2570475, 3502977, 2486705, 273233, 1070648, 82864, 168440, 2116825, 2240614, 2337735, 1892743, 2115935, 2555457, 2160036, 1564476, 936681, -282232, 217305, 34223, 1292875, 1244146, 684816, 1280394, 2391276, 2498690, 66318, -15496, 983720, 584084, 1739956, 1567794, 347423, 542637, 492321, 1057102, 1664222, 515205, -982340, 149600, -677160]
2198f77160j0512N48743J735594J76141q88588L22599N53242O7422L54492J092860
2188C274833j084784N13174K95225q37148k41042o55539J067697j48440j328451
2179H55525K5614N66022r80361j064576p91546M80859N37373L12698J723639l0710
2169A634537o60997J36574j444991M55731N6751p03756j31610J734337J172228
2160B248804j24321K53953k797127O9744L04692M72605J210690o31700j56439
2151H50901N21781q74048o29051J233501p86315K75926J126859n06318L14051
2142A527287m15370L67734j469018j56048M31508o90419r09127J09257N97262
2133f06934j52243o65141K35064R29487j394266Q57040j40331J214372J465573
$$ y = [-677160, -687672, -138929, 1596665, 1772806, 884218, 1206817, 1760059, 1827481, 2181973, 3274833, 2190049, 2703223, 2998448, 2161300, 1920258, 1264719, 2332416, 2183976, 855525, 881139, 1447161, 466800, -597776, -1389322, -908463, -371090, -58392, 1665247, 1634537, 973540, 1110114, -334877, 120854, 177605, -526151, -657761, 1076576, 2248804, 2124483, 2378436, -418691, -348947, -44255, 428350, 1639040, 1007340, 850901, 1372682, 498634, -130417, 1103084, 316769, 592695, 1719554, 1213236, 1527287, 1111917, 1479651, 10633, -145415, 286093, -404326, -1313453, -1204196, -606934, -759177, -1424318, -1189254, -259767, -1654033, -796993, -937324, 277048, 1742621]
2124A742621r95804j74344K20813q49257j522542J007672P89538Q1153Q91495
2115A191345L12097j039454l64480J248464r44767o93345O39915l12276j328447
2106a290948o7115K550652j396861k06588J787224M73976k97653p8833P1441m81298
2096A063997o09273n19325O86862J44305q24165l43450m91621J76215K1452L36268
2086c58735J090820n67912r45691J023357r78902q62512J843159l11911j598833
2077a667160L96834J787085j98268q7737K87752N23707J613566K79597o51148
2068B284228J017580n15061p32894k94636K82871m9190j080960l71650Q86488
2059A426776r98052r63117O39518K98751O98773r73294p09228m38743M16962O93859
$$ y = [1742621, 746817, 572473, 793286, -55971, -1578513, -570841, 218697, 299850, 1191345, 1503442, 463988, 99508, 1347972, 403205, -290140, 349775, 37499, -1290948, -1358063, 1192589, -204272, -410860, 1376364, 1850340, 1552687, 1473854, 1545295, 1063997, 454724, -64601, 622261, 766566, -57599, -401049, -892670, -716455, -695003, -358735, 732085, 164173, -781518, 241839, -737063, -1599575, 243584, -68327, -1667160, -1270326, 516759, 318491, 230754, 518506, 1042213, 2655779, 2935376, 2284228, 3301808, 2786747, 2053853, 1759217, 2042088, 1992898, 911938, 540288, 1426776, 428724, -534393, 105125, 403876, 1102649, 129355, -579873, -1018616, -601654, 92205]
2049I2205J515618j48707Q84706p08130j438873m36641M56502J305523j105057
2040D17146O44700j716565M52845O72808q91564K07582L97124O31335L48289M2974
2030A206674l55156M10607Q66842l77324r67803M04501m34156J93142l64762J60888
2020G43453M64104m26399m60396l61222M53512R23014r52787O20031r96861J39287
2010A45736R125R7493k8294l70817L47012O86148Q83621o38520j260725M45647
2000C16426N93281O71354p2312M82710j160094K94116K48098j787037L4462p93702
1990a172698J356881m18323O45835l99093m05955J64176Q89190Q95868n09155
1981A046726K91898r39823k94475Q17416j529351J53277p2543J372560j576375
$$ y = [92205, 1607823, 1459116, 2343822, 1635692, 196819, -239822, 216680, 1522203, 417146, 1061846, -654719, -201874, 470934, -420630, -213048, 184076, 815411, 1163700, 1206674, 851518, 1262125, 2128967, 1751643, 783840, 1188341, 754185, 947327, 582565, 743453, 1207557, 781158, 320762, -40460, 413052, 1336066, 383279, 1003310, 6449, 145736, 154861, 252354, 224060, -146757, 200255, 886403, 1770024, 1131504, -129221, 316426, 909707, 1581061, 1508749, 1991459, 831365, 1125481, 1373579, -413458, -378996, -1172698, 184183, -234140, 411695, 12602, -393353, -229177, 660013, 1555881, 1046726, 1338624, 398801, 104326, 921742, -607609, -454332, -526875, 845685, -730690]
1972g30690J157187l25949L39505K4851q92038n7441K32409J74860l96936j45270
1962f19512J04417J596573m34297O20319j254575J07657j703881K132472P89019
1953A338192j111808M75234o53103K046816m08145j320487K47232j87095l57561
1944F9275J711758n61361k78260R5544p82551p9364o21026m96353n5415J329958
1934C32205O15064j116013O4035J034867j282695J472298m13705j078089l03702
1925f75735J205387J87257j530188J683501j186421j026707O84604J012752Q95717
1916A250167q55627k18222N6217k37287P47907k68678J004047M60832k461053
1907e21697p4640M58772r73766J574952L74516P77886m5360j66789M72519j393463
$$ y = [-730690, 426497, 100548, 440053, 464904, -427134, -484575, -252166, -77306, -474242, -619512, -515095, 1081478, 647181, 1267500, 12925, 120582, -1583299, 549173, 1338192, 226384, 701618, 48515, 2095331, 1687186, 366699, 613931, 426836, 69275, 1781033, 1219672, 941412, 1036956, 254405, 175041, -445985, -942338, -997753, 332205, 947269, -168744, -104709, 930158, -352537, 1119761, 706056, -372033, -675735, 529652, 716909, -813279, 870222, -316199, -1342906, -658302, 354450, 1250167, 394540, 176318, 232535, -4752, 743155, 474477, 1478524, 1939356, -521697, -596337, -137565, -1111331, 463621, 838137, 1616023, 1570663, 1403874, 1876393, 482930]
1897D82930r63784l40262k89367J109264O88846Q12749r82223j655746Q77324
1888b60269M53531k46634J0375J715755r42527r48775K40605j50964j205657P45845
1878e88715P33985j338940O56326O13903J18140N10746O84683L01406j577919
1869A13615J001091p33275n33529Q65884m87081J36544p3774j85142J42345q58116
1859f11438l12303o60784Q05652J07968J101762n26243j823387M32522q48710
1850b334961J190236L13728o71857N06190M12526n14234K9842N18453J480141
1841I30064j071317l02067K45775m62690J92358m00005n61344J438160K09910
1832B18844j765076R19256O00410j012537J44767J938492j812128o0216J26773
$$ y = [482930, -480854, -821116, -1110483, -1219, 687627, 1500376, 518153, -1137593, -260269, 193262, -53372, -42997, 1672758, 730231, -218544, 22061, -128903, -1334560, -588715, 145270, -1193670, -537344, 76559, 194699, 705445, 1390128, 1691534, 113615, 1114706, 381431, -152098, 713786, 226705, 363249, 289475, 104333, 246678, -611438, -923741, -1584525, -778873, -670905, 430857, -95386, -1918773, -1486251, -2334961, -1144725, -830997, -1502854, -996664, -584138, -1098372, -1068530, -550077, 930064, -141253, -443320, -197545, -660235, -467877, -867882, -1429226, 8934, 218844, -1546232, -626976, -26566, -1039103, -894336, 1044156, -767972, -828188, -701415]
1823g01415Q7995J42922N60481J68896l74477L82414o96576J54371j38906p32186
1813a146481l22098P05645r52649m16907n21312J396133l45007J393419r82635
1804a191892L39335l53415K03209R26881p3514n7440p8394Q12600j242298q8720
1794h03648O45321n49748q39248J419529n23975J789137N64620L96138O34465
1785B732591j45633O5974j799548r18535m17809j285170M55701M18453R74674
1776H0698P67796L52024q33954N74326Q09600p36387j228075K41508J584236r69179
1766F42593q41886j6472K99255m98592K52632J166103K50672l66030N97088r11459
1756E73904j527115O05621O33555O8309J26865J5469L25697p08886p45654n67266
$$ y = [-701415, -613420, -470498, 89983, 258879, -115598, 266816, -429760, -275389, -414295, -1146481, -1468579, -762934, -1715583, -2132490, -2653802, -1257669, -1602676, -209257, -1191892, -852557, -1205972, -1002763, -75882, -149396, -206836, -285230, 527370, -714928, -803648, -158327, -708075, -1547323, -127794, -651769, 1137368, 1701988, 2098126, 2732591, 2586958, 2652932, 853384, -65151, -482960, -1768130, -1312429, -893976, 80698, 848494, 1200518, 366564, 940890, 1750490, 1014103, -213972, 27536, 1611772, 642593, -199293, -215765, 83490, -415102, -162470, 1003633, 1254305, 888275, 1485363, 573904, -953211, -347590, 285965, 354274, 481139, 496608, 822305, 113419, -632235, -1199501]
1746a199501N37875R72582p63738l55780O3531K86550O81855M51275p59874j013560
1736a098785Q65793J17290K76515J406989j212670j326773Q2509j25501Q76950
1727a37683J632679j641809Q95962N13841N650k319859l69407l99499q36913J708361
1717i48677m43404o6136N36067k52051P4753l72027p01212J956541j1879L97655
1707A69630o42665J119680M71407p14032J88527M03536p54930l44048o92029J31932
1697f62992N25115l02855M50241M78638j027584J30258J337456o52738q02926
1688e27387M99244L95177l11593R33237m22212n80478m39152p7107P93967j079291
1678h15595J70590q31403j7654Q16143K633025R49515j552475m23008r38979r77709
$$ y = [-1199501, -661626, 310956, -452782, -808562, -745031, -458481, 223374, 674649, -85225, -1098785, -232992, -115702, 160813, 1567802, 355132, -971641, -889132, -1014633, -137683, 1494996, -146813, 749149, 1262990, 1268640, -1051219, -1420626, -1820125, -2657038, -948677, -1392081, -1458217, -922150, -1174201, -1099448, -1471475, -2172687, -216146, -228025, 169630, -473035, 646645, 1118052, 404020, 592547, 996083, 241153, -102895, -794924, -662992, -137877, -440732, 9509, 488147, -539437, -409179, 928277, 275539, -527387, -28143, 367034, 55441, 988678, 566466, -14012, -453164, -530271, 263696, -815595, -645005, -1476408, -1494062, -677919, 1955106, 2904621, 1352146, 929138, -9841, -987550]
1668i87550m75073j87187K243781R86853j003479n72667j032401L47928N18226
1659a61569l73157J157783J828109j447657o84417n89557k20893K5522J179886
1650G14050n46961K29745j085344m22764n8991Q79370K088201j763467q1167l30533
1640c77861j139360r3454J623243Q11584n93863m29075j644579K58288Q92108
1631f92969J095540J600106l80228k82975p81797J77116j87534J297952P54996
1622B600207r91404j436713l1901J61790N55742P39226j005679M09631j904961
1613i04062R4221K86551k94366L63258J299673N19875R16648q79805p06707K42777
1603I38063n04380q56011Q75202K86417j134264J48202M70293m3190p79891J492948
$$ y = [-987550, -1462623, -1649810, 593971, 1580824, 577345, 4678, -1027723, -679795, -161569, -534726, 623057, 2451166, 1003509, 319092, -270465, -491358, -465836, 714050, 167089, 396834, -688510, -1111274, -1170265, -290895, 1797306, 33839, -47328, -377861, -1517221, -1610675, 12568, 824152, 230289, -198786, -1843365, -1585077, -692969, 402571, 2002677, 1622449, 1339474, 557677, 734793, 547259, 1845211, 2600207, 1608803, 172090, 140189, 301979, 857721, 1596947, 591268, 1000899, -904062, -809841, -523290, -817656, -454398, 845275, 1365150, 2281798, 1401993, 695286, 938063, 433683, -422328, 452874, 739291, -394973, -246771, 223522, 180332, -599559, 893389]
1593H93389J70411R07038N35872r78151j603992o72937J054454O55716k86036
1584F75764O24255j77029r47250m05213o66830J404080K96841N33663m58922m60855
1574D18504j40438j203821L71692j80879Q71941n26538J144981q6309l80141J19558
1564D08550K07328O40786J52786J43335L94049r99006k083190n24923L58965Q81456
1554d19864j88899N98626J73021P28070j801146O89523O19342K54344j83397N56786
1544A026406L68370p35343J5892j338671n80470j17216M73319k86240j57450m69246
1534a800649N15433j48810R16982j141070J107693K20059j821117J860499j065313
1525a356293M92658P6683N49990j50049n22270r5888j152523Q63135O95029o24270
$$ y = [893389, 1063800, 1970838, 2506710, 1528559, -75433, -748370, 306084, 961800, 675764, 1300019, 1122990, 175740, -229473, -896303, 507777, 804618, 1338281, 879359, 418504, 278066, -925755, -554063, -734942, 136999, -389539, 755442, 669133, 288992, 408550, 615878, 1256664, 1409450, 1552785, 1946834, 947828, -1135362, -1660285, -1301320, -419864, -608763, -10137, 162884, 890954, -910192, -220669, 398673, 653017, 469620, 1026406, 1394776, 659433, 675325, -663346, -1243816, -1361032, -887713, -1173953, -1331403, -1800649, -1285216, -1434026, -517044, -1658114, -550421, -330362, -2151479, -290980, -1356293, -863635, -786952, -236962, -387011, -909281, -1005169, -2157692, -1294557, -599528, -1223798]
1515a223798j098055J012528J363768J48379k69074p19700j302672P68954O10158
1506g09512m0985Q72515J43654p13508N73960L93502p58697j17328Q113N61632
1496B13346Q9762p60066L66681o84875n56074J172736J389291m35999J01969n40617
1486C56154k10000q26790m21529P54990P91411o1651l432L66676j018449n62466
1476h35086M50382L83784Q45785l03832n5619l72102Q1316J570539j368815J1731
1466D08083L83622l08703j36085J363371K48062j347214J76599M21163p55707
1457D53191r90819J05931J51779P76995l46580m62037p49885J715490r10609r76223
1447a232767J324715j79769L78964m8209Q39157m41918o04443k56479P86769j000097
$$ y = [-1223798, -2321853, -1309325, 54443, 202822, -66252, -785952, -2088624, -1319670, -709512, -750497, 122018, 265672, -447836, 126124, 519626, -239071, -356399, -348286, 213346, 303108, -456958, -90277, -775152, -1331226, -158490, 1230801, 794802, 896771, 356154, 146154, -680636, -1102165, -347175, 444236, 382585, 379153, 745829, -272620, -835086, -384704, -920, 844865, 541033, 485414, 113312, 194628, 1765167, 396352, 408083, 791705, 483002, 346917, 1710288, 1958350, 611136, 787735, 1208898, 453191, -537628, -431697, -279918, 497077, 150497, -311540, -1061425, 654065, -256544, -1232767, 91948, -87821, 291143, 242934, 1082091, 640173, 35730, -220749, 566020, -434077]
1437d34077K82688L35891Q1134q63717O42484J062302j16365o99607r47377J39425
1427e17219k82890l77198L08166J436156J523617j290520j311920P59311o12715
1418c65212j453416J126776L86675r99290P23514P30633J27510o28465k85838
1409f37113L31668m37173N37501R56557N47567j277763Q17539r98028j12970O58487
1399C86272j966156N73351Q6714l95041j61269O96799P62043r3732O72882L52794
1389I14657k107060J812477J010016m58309J49433r04106j317456j55533P69804
1380b86077N43054M43334J37742j157628k76399q21249O07843L80728j47534j363481
1370a939667J255939O88037j012430J274086m07827J66969M61229l95619L72886
$$ y = [-434077, -151389, 184502, 265636, -598081, 44403, 1106705, 990340, 290733, -656644, -517219, -800109, -1177307, -869141, 567015, 2090632, 800112, -511808, 247503, -365212, -1818628, -691852, -305177, -1304467, -580953, 149680, 277190, -351275, -637113, -305445, -742618, -205117, 751440, 1299007, 21244, 838783, -159245, -272215, 386272, -1579884, -1006533, -919819, -1314860, -1476129, -779330, -17287, -111019, 561863, 914657, -1192403, 620074, 1630090, 1171781, 1321214, 417108, -900348, -1055881, -286077, 256977, 700311, 838053, -319575, -595974, -1417223, -809380, -428652, -576186, -1939667, -683728, 4309, -1008121, 265965, -141862, 25107, 486336, 90717, 463603]
1361D63603l2619m52670J204118j20459K36360m32254m94951L74623k06346m04077
1351A35328j51019l89291o5989R56647j043504K35785N0611J60786J126687k16228
1341G99813j117676j003418N47718n57151J518430J371915k48386j663798P2325
1332b80228J377806p37726Q96311J517935k046025j458236J390304p42503m49171
1323e31533L82988J1888j329597J30812K330113O39583P09011q97892j240180
1314B05193j291073K63143j04162J421951O66179q51671j340934Q36225q07697
1305a002846k83044J173292J548739O97465j356443P74397l77712m63953j064769
1296c54874J977797K8893j182687q76180R74806M06033j322670k71858J991106
$$ y = [463603, 430984, -21686, 1182432, 1061973, 1298333, 866079, 371128, 745751, 539405, 135328, -15691, -404982, -470971, 485676, -557828, -322043, -271432, -110646, 1016041, 799813, -317863, -1321281, -773563, -1330714, 187716, 1559631, 1311245, -352553, -280228, 1097578, 359852, 1256163, 2774098, 728073, -730163, 660141, -82362, -531533, -148545, -136657, -1466254, -1335442, 994671, 1634254, 2343265, 1445373, 205193, -1085880, -822737, -926899, 495052, 1161231, 309560, -1031374, -195149, -1002846, -1285890, -112598, 1436141, 2133606, 777163, 1551560, 1173848, 709895, -354874, 1622923, 1651816, 469129, -407051, 567755, 973788, -348882, -620740, 1370366]
1287A370366j421828K64024L69225p90520J750316R7253P90476p54559j095768
1278E78985j004839p42165J549838Q24520p07392j14277r73300O68605P18409
1269G98384K32032k83212L16948n44641J310177j003159m52214m257j439018l85354
1259a454314Q52117J172395j174306J589345o85347O75909j340982n93677o8457
1250a027317p8901J24325M98339Q38656O85053j016264j582260K313777n81186
1241A74222j126814J27771N20914j12824N76904j08777Q04857p19014l48525J467788
1231A256502J79342j476845N94979K01099j631116J378141K05250K44094j977243
1222a025797Q97071j10032l55528o67826J025799N12170j75937K95442j071749
$$ y = [1370366, -51462, 212562, 581787, -208733, 1541583, 1638836, 2429312, 1674753, 578985, -425854, -1168019, 381819, 1206339, 498947, 384670, -588630, 79975, 798384, 1030416, 747204, 1064152, 519511, 1829688, 826529, 374315, 370058, -1068960, -1454314, -602197, 570198, -604108, 985237, 299890, 975799, -365183, -958860, -1027317, -1106218, -981893, -483554, 355102, 1040155, 23891, -1558369, 755408, 174222, -952592, -824821, -303907, -416731, 160173, 51396, 856253, 137239, -211286, 1256502, 1435844, -41001, 553978, 755077, -876039, 502102, 707352, 951446, -1025797, -128726, -238758, -594286, -1262112, -236313, 275857, 99920, 395362, -676387]
1213f76387J337943l23759M55295l10427N11529n96623j170181K49501J775033
1204A251924j844356Q04504J155781j717987J44246K79858N14016l97221l25545
1195a34780P51776K29877l57280j135533J458242o56782O41937Q16482K48942
1186A862881L01224k17828j200781K50988L85343Q36950J83467j630944l78032
1177C93268j168638L77470k79569P97238o42537J467763m60506j472965K29206
1168g59270j31213l35561N06241J481594J113374j586431L20583k83524n07187
1159a81394J486132j609767J352899j40703l71453K56159j20973J65160k152757
1150a316697R69890N60376n0966p08555J57539N35721q67688m11015k85628J203997
$$ y = [-676387, 661556, 337797, 793092, 482665, 994194, 397571, -772610, -523109, 1251924, -592432, 212072, 1367853, -350134, -205888, 73970, 587986, 190765, -134780, 616996, 846873, 489593, -645940, 812302, 155520, 797457, 1613939, 1862881, 2164105, 1946277, 745496, 996484, 1381827, 2218777, 2402244, 771300, 393268, -775370, -397900, -677469, 119769, -522768, 944995, 484489, -988476, -759270, -890483, -1226044, -719803, 761791, 1875165, 288734, 609317, 325793, -181394, 1304738, -305029, 1047870, 907167, 535714, 791873, 670900, 836060, -1316697, -346807, 213569, 162603, -545952, -388413, 147308, -720380, -1131395, -1417023, -213026]
1140b13026j90723l85100Q91775K34645j077127m80383J583801j96554O2342L91830
1130F21480q90727j300889K291934M59738o03670r49543K28093L72291Q04074
1121A032781k2471j581052r21168L2631l2425O7386J722376L88024q20694L95634
1111B61022N3549j64208j280922r65624N00124N65550Q80988q60513N50112K60028
1101a99894o95194N33957J11604j54263M04636p71134L17255J180611O39108N06595
1091A873281P72984j348663N02350k234855K20571q56090O85535K27882j001366
1082a158371K61615j339700K31086M25541R25956p3664r46473l16692K64071L79135
1072a347496j69756l29178K945040N36317j305722L45105o68163N86310J530253
$$ y = [-213026, -403749, -788849, 102926, 337571, -739556, -1219939, 363862, 167308, 229650, 621480, -269247, -1570136, 721798, 1181536, 577866, -371677, -143584, 228707, 1032781, 1010310, -570742, -1491910, -1459279, -1491704, -1424318, 298058, 686082, -134612, 261022, 314571, 150363, -1130559, -2096183, -1596059, -1030509, -149521, -1010034, -459922, -199894, -895088, -361131, -249527, -403790, 846, -770288, -453033, 727578, 1366686, 1873281, 2646265, 1297602, 1799952, -434903, -214332, -1070422, -384887, -157005, -1158371, -896756, -2236456, -2005370, -1579829, -653873, -727537, -1674010, -1990702, -1726631, -1347496, -1517252, -1846430, 1098610, 1634927, 329205, 674310, 6147, 592457, 2122710]
1063B122710k62458p34718R51704r22919O96259M28120j500750p3479N57644j159386
1053A02727j953018R65894l39677N03047j101578k74379J314287m3928j443235
1044b269860K026685r39360q4609J236102J329390R19670j824797m7415l71556
1035b5750K67501m93585J204909j297311P12112j258323o67152L17284K33326
1026a006989m34693l32662k15558j28490J705987n8652l20240m12169l00333Q05643
1016f98156J569891p90423K77818j544930M62980L86338J431103k05267j791465
1007i02111J052472Q15108o19871R6962l26148L70959J59061l82857J801569k524850
997d59706L54806J36362K66093j042029o23055J381512Q31585L81430k88655K10201
$$ y = [2122710, 1860252, 1125534, 2077238, 1154319, 1850578, 2278698, 777948, 704469, 1262113, 102727, -1850291, -884397, -1224074, -721027, -1822605, -2096984, -782697, -826625, -2269860, -243175, -1182535, -1267144, -31042, 1298348, 2218018, 393221, 345806, -25750, 241751, -251834, 953075, -344236, 367876, -890447, -1557599, -1240315, -1006989, -1441682, -1774344, -1989902, -2118392, -412405, -471057, -791297, -1203466, -1503799, -698156, 871735, 81312, 359130, -1185800, -722820, -336482, 1094621, 889354, -902111, 150361, 965469, 345598, 442560, 116412, 487371, 646432, 263575, 2065144, -459706, -104900, 31462, 297555, -744474, -1367529, 13983, 845568, 1226998, 938343, 1148544]
987A148544j080062j050312r12804J136597J757964P34009j80705j407470m30462
978b84701j151898j106522R26657J466847J521924l81249k350620q8719Q95236
969e53045O76603K017751q52009j668943o26274m36002L45218R05299O97405l47310
959A58693L10306J177204j174027M67671n77297n85336p27134P62662N22685l95816
949f0389L20777j171170K22346O25594m28806j7280J612275o81439j301099J226729
939C47538o59546N16014J751287q20781J084527Q81119j943207j417527n64287
930h24863M25655Q36825L50883n53721k77370K80120l45058j579552M88408R39050
920b59623k5076L84889Q49063j370621J58109P90382p63487J067289R46583k77613
$$ y = [1148544, 68482, -981830, -1894634, -758037, 999927, 1733936, 1553231, 145761, -284701, -1436599, -2543121, -1616464, -149617, 1372307, 991058, -1359562, -1448281, -553045, 123558, 2141309, 1289300, -379643, -1005917, -1441919, -1096701, -191402, 506003, 158693, 468999, 1646203, 472176, 939847, 362550, -222786, -949920, -187258, 335427, -60389, 260388, -910782, -688436, -62842, -491648, -508928, 1103347, 421908, -879191, 347538, -312008, 204006, 1955293, 1134512, 2219039, 3100158, 1156951, -260576, -824863, -399208, 437617, 788500, 234779, -42591, 237529, -107529, -1687081, -1198673, -259623, -284699, 100190, 949253, -421368, -263259, 527123, -236364, 830925, 1777508, 1499895]
910A499895l60156j292148k1873L76525P66467L40572j780341l15201n39976j308133
900b634369P66934J485903j129384K36465J113724K1942J277524P33729n52895
891A319573r51264q05721p15764r3515J396610K064949j069780q99087o58073
882d12072j504892O53198O88328K40216k51317R4067o66237L98719K66466R30854
872D37330N2406o88526n97716O79230Q72185n29695L55258r63183l22225J659052
862I54116R41385j108327j76658o94621o27832O42021m42026J585836k81382k51719
852E40793K42312n13097p20434j18450K43440r94464K19190N85238O33669J907555
842B025752n93795m08324o38203R982r72382J470396Q12402l06568J46414P70155
$$ y = [1499895, 1139739, -152409, -174282, 202243, 968710, 1309282, -471059, -786260, -1326236, -2634369, -1867435, -381532, -1510916, -1274451, -160727, -138785, 1138739, 1872468, 1319573, 368309, -437412, -1153176, -1246691, 149919, 2214868, 1145088, 246001, -412072, -1916964, -1263766, -575438, -335222, -586539, -492472, -1158709, -759990, -493524, 437330, 489736, -198790, -796506, -117276, 754909, 225214, 580472, -382711, -704936, 954116, 1895501, 787174, 610516, -84105, -711937, -69916, -511942, 1073894, 792512, 540793, 783105, 270008, -450426, -568876, -325436, -1319900, -1100710, -515472, 118197, 2025752, 1431957, 1023633, 385430, 395412, -576970, 893426, 1705828, 1399260, 1545674, 2315829]
832B315829j476975j084635L10143m02394j585350J116180O41061J42883P16930
823F93672k49243j251175k4938m21970R56665J139128j011719M17176p05894M70693
813A2395m13963J59256K026033Q39734k614326l54203p4007j90760r82830M82527
803a110144m23033m28727j59220J064727L36880k28004J300670n91659m47472
794f85982P43073p35874R98224L57149l03899q74425J7717j01697q8283J902280
784A228283J77668l45957M43401m46358k31279j230373O4916j84277l12069J123554
774B87509M63808r21157o22133M77167j244344J946105K69471J00443J287178
765B044047l66914j322591N19346J069728j166193j21764p27655L27322J75806
$$ y = [2315829, 838854, -245781, 64362, -338032, -1923382, -807202, -166141, -23258, 693672, 444429, -806746, -831684, -1253654, -296989, 842139, -169580, 247596, -458298, 12395, -401568, -242312, 1783721, 2623455, 9129, -345074, -419081, -609841, -1592671, -1110144, -1533177, -1961904, -2121124, -1056397, -719517, -947521, 353149, -238510, -685982, 57091, -678783, 319441, 676590, 372691, -501734, -484017, -585714, -673997, 1228283, 1405951, 1059994, 1503395, 1057037, 825758, -404615, -339699, -523976, -836045, 287509, 751317, -169840, -791973, -314806, -1559150, 386955, 656426, 756869, 2044047, 1677133, 354542, 873888, 1943616, 777423, 655659, -71996, 255326, 431132]
756D31132r05919q58227J119546n68065J419422J027227M56279m83757k94120
747A343518m67833j542976N82315r37677J551494J89514r26509P16714j413106
738i04546o18281J291108J851859P78662j018848k87486J117626j655191j246400
729f91497M92394J80609l7649o86920J785557K15241p38178J635666r53059j770932
719e68768O88079J390169j249779r88328J889844j296538K09811O47156r62075
710b40429K98404k94986j99908j535257m13056M55863R22259j09532K84849n18224
700a350017J249195M53569M36305j35740o07277J150571l67449O66104R30165
691B425426j81333k18674o30760k62702m30624o84772J083051p22796n0929j272168
$$ y = [431132, -474787, -1333014, -213468, -781533, 637889, 1665116, 2121395, 1637638, 1343518, 875685, -667291, -84976, -1022653, 528841, 718355, -208154, 508560, -904546, -1522827, -231719, 1620140, 2398802, 1379954, 1092468, 2210094, 554903, -691497, -199103, -18494, -56143, -743063, 1042494, 1257735, 519557, 2155223, 1202164, -568768, 119311, 1509480, 259701, -728627, 1161217, -135321, 74490, 721646, -240429, 57975, -237011, -436919, -1972176, -2385232, -1929369, -1007110, -1116642, -831793, -1350017, -100822, 352747, 789052, 653312, 46035, 1196606, 829157, 1495261, 2425426, 2244093, 2025419, 1394659, 1131957, 701333, 16561, 1099612, 376816, 325887, -946281]
681i46281N64685r1120L16899J364165K44446j841181K14327J4137K06879j127467
671a080511J307722J194113M73640m8873j623579n76895N31013l16944K12753
662G2439J138493o21772Q31645j574286p2223N27330o61133P68009j142758J348012
652F13756m93223j174368P40859M48217L753l69724k21129J72736J56104k71087
642c94106J006209k55154q27226J074829O19944k020567M34302M2530N73361j014525
632g60403K01222N91650P90608N71046j506193K388283p19006R67991k03583k103864
622B17751Q99944j813764O0011m5162L35614J025643o15220L96304L36056n85056
612B12121J000463j749081J042800O21535p98622m93356J058188j30644k047743
$$ y = [-946281, -381596, -472716, -155817, 1208348, 1452794, -388387, -174060, -159923, 46956, -1080511, 227211, 1421324, 1894964, 1846091, 222512, -354383, 176630, -140314, 72439, 1210932, 589160, 1420805, -153481, -225704, 301626, -359507, 408502, -734256, 613756, 120533, -1053835, -312976, 135241, 138994, -230730, -451859, -279123, -123019, -394106, 612103, 356949, -470277, 604552, 1224496, -796071, -361769, -319239, 254122, -760403, -559181, 32469, 823077, 1394123, -112070, 2276213, 1557207, 2525198, 2321615, 217751, 1117695, -696069, -636058, -681220, -345606, 680037, 64817, 461121, 797177, 212121, 1212584, -536497, 506303, 1127838, 329216, -164140, 894048, 763404, -1284339]
603a284339O30518Q18685J882322n04571k7359M40457n38304j33859J226021L78382
593B887953k1875j193978m19053P92182j178578k31879N9378j397141q47911M05769
583a145133O40735m55756Q74200J79424j818865P44010O31160l73671K77823J00691
573c45382J570889O33734q9977j45599m51717M45356j100480m42723J113914l06541
563H81474j281039R79409j119332j149388O52471n03419n24529O63863J657844
554B57354r90990L26539k21140n97910Q94867k81781l04417P42325q16522P89990
544b01685r48482m86636J817077N5182P34496p95154m84697q27363O47170n91
534d90683K41900Q05646n72735o04583J674465j175023m26989K17060k89576J224342
$$ y = [-1284339, -653821, 164864, 2047186, 1542615, 1515256, 1955713, 1417409, 1283550, 2509571, 2887953, 2866078, 1672100, 1253047, 2045229, 866651, 634772, 694150, -702991, -1550902, -1145133, -504398, -960154, -85954, 93470, -1725395, -981385, -350225, -723896, -446073, -345382, 1225507, 1859241, 1769264, 1623665, 1171948, 1617304, 516824, 74101, 1188015, 881474, -399565, 579844, -539488, -1688876, -1036405, -1539824, -2064353, -1400490, 257354, -733636, -407097, -628237, -1226147, -331280, -613061, -917478, -175153, -991675, -201685, -1150167, -1636803, 180274, 235456, 969952, 174798, -309899, -1137262, -490092, -490683, -248783, 556863, -15872, -620455, 1054010, -121013, -548002, -330942, -620518, 603824]
524F03824j413754J634494K47184j509210R28144k68934L04239n65514K5752J40846
514A27071j04982j66502P94713L19221j084442m37623j80109J065794j175321
505h42180P9704M47267k74054J359963J42746J57889j417037N22499n26015K51890
495i7328k35533j648855N44476N55890P19749N51924J240884o86263j066929j49618
485b71603L81294l33585k26156J006546k41194r60643l08422m6737o9222l33953
475a403675p21587J86835K5973R97148K056056n1237r75978Q94531l39391p73391
465a04716J544603O42421o95130m42515j008858p11488J682163J1127j676529
456g58922k55763m55125M11714L118263m62325q30426n85492o04977l17458P55643
$$ y = [603824, -809930, 824564, 1071748, -437462, 490682, 221748, 525987, -39527, -13775, 127071, 22089, -144413, 650300, 969521, -114921, -552544, -732653, 333141, -842180, -762476, -315209, -589263, 770700, 913446, 1071335, -345702, 176797, -349218, -97328, -332861, -1981716, -1437240, -881350, -161601, 390323, 1631207, 944944, -121985, -271603, 109691, -223894, -450050, 556496, 315302, -645341, -953763, -1000500, -1069722, -1403675, -2125262, -1938427, -1912454, -915306, 1140750, 1089513, 113535, 1008066, 668675, -104716, 1439887, 2082308, 1387178, 944663, -64195, -775683, 906480, 917607, -758922, -1014685, -1469810, -1058096, 2060167, 1597842, 767416, 181924, -423053, -740511, 15132]
446A5132O08458J66755L94228m80920j00411O39096p03494q7153M26615k54937
436F23369j126894q0562O03869J271127o88424j267975l2879n49324P49068j081945
426a580570M64182P7292j217191J289072N74722J048258m32749O18225M12083
417A253324j906753k23051k38628L50684O31922m52265q66339L35816P08508q61359
407a268141Q18511n74561r3675P92707j446155l88506J520682O52176R33598j015549
397f8913n30283Q47192j680309p27598L95717N41655M52873J081232J155628J30122
387A597316J2633j354748r91859P56577J02187J17321n70422j55023J51405L24836
377i777k55035m50956j086841J885804j086779L84793P88819J122492m13292o63486
$$ y = [15132, 623590, 790345, 1184573, 703653, 603242, 1242338, 538844, 451691, 878306, 623369, -503525, -584087, 19782, 1290909, 602485, -665490, -698369, -1247693, -498625, -1580570, -1116388, -1039096, -2256287, -967215, -392493, 655765, 223016, 841241, 1253324, -653429, -876480, -1115108, -764424, -132502, -584767, -1451106, -1115290, -406782, -1268141, -449630, -1024191, -1117866, -325159, -1771314, -2159820, -639138, 13038, 946636, -68913, -599196, 247996, -1432313, -2159911, -1764194, -1222539, -769666, 311566, 1467194, 1597316, 1609949, 255201, -736658, 19919, 122106, 239427, -330995, -486018, -334613, -9777, -264812, -715768, -1802609, 83195, -1003584, -618791, 170028, 1292520, 879228, 215742]
367B15742J599292o76063j58623m15303K24570J22462r41514L45888M67315M04197
357A187963p90350O12181n05276j160101J113452n49536p6216J149239J310615
348B291971j269138Q52369j623719k066508K58915R98290J391228R47624m25837
339A355195N35920m70098k144740L8925K95486Q51051r020K35006o09024J129919
329A208620N46004n17797K12665j430737j280196k32782J772579o08214M17562
320H7704N93271l73457j165969J136661J091458j217466j011525O36419R42818
311G19914k68750k90270L64393j73953o30196J444779j175096r57892j154981
302b122052L37003R03443J63576K471867j3848l7810J53597k77479q09255j227209
$$ y = [215742, 1815034, 1138971, 980348, 565045, 789615, 912077, -29437, 316451, 783766, 1187963, 397613, 1009794, 504518, -655583, 457869, -91667, -167883, 981356, 2291971, 1022833, 1875202, 251483, -1815025, -1556110, -557820, 833408, 1781032, 1355195, 1891115, 1421017, -723723, -684798, -389312, 461739, 452719, 687725, 78701, 1208620, 1754624, 1236827, 1449492, 18755, -1261441, -1494223, 278356, -329858, 87704, 680975, 307518, -858451, 278210, 1369668, 152202, -859323, -222904, 719914, 451164, 160894, 525287, 351334, -278862, 1165917, -9179, -967071, -2122052, -1785049, -881606, -718030, 1753837, 1739989, 1702179, 1855776, 1578297, 769042, -458167]
292d58167j40426Q01069p08564j598611J002895k6207J169851p19154P07479J86799
282B16964R33056k84651l26883j46640K22532k067796k257K50869p91522R09980
272a086348K89934j155270q33211J004242m9338R37944L78099M32502J009795
263I28349M47808p56453O07790n0976M30220l2413k08741M3090p53541j469359
253h14226j1537J067370j123862j55937N4923j003644Q48885Q99207O04277p12020
243c46564j048291J504094m1034J321093R94140o85410K4493k172878k57698n95589
233a303644J580134R12371J398081p48562p92513q08753j070699L06087J334048
224H06550m60064K00337O66131j903241L53170k52134j69519r55383J393903J232744
$$ y = [-458167, -598593, 202476, -506088, -2104699, -1101804, -1128011, 41840, -677314, 30165, 216964, 1150020, 865369, 538486, 391846, 614378, -1453418, -1455675, -1204806, -1996328, -1086348, -796414, -1951684, -2784895, -1780653, -1829991, -892047, -513948, -81446, 928349, 1376157, 619704, 1227494, 1176518, 1606738, 1574325, 1365584, 1408674, 655133, -814226, -825763, 241607, -882255, -1038192, -983269, -1986913, -1138028, -238821, 365456, -346564, -1394855, 109239, 68205, 1389298, 2383438, 1698028, 1722521, -450357, -708055, -1303644, 276490, 1188861, 2586942, 1838380, 1045867, 237114, -833585, -527498, 806550, 346486, 546823, 1212954, -690287, -337117, -589251, -758770, -1714153, -320250, 912494]
214I12494o4933m64492P16106R31442q93485K90069J45264L51746m68350n15524
204I40337l22134n94835Q37202J72657p4784r84055k49454j308904j76816J775476
194A4690o89987N14527n35988O03638P37382M49381m09855m00615l69811j037745
184a124383n56699J495501M78141O080l92447k65468q39615l0986J717620n04529
174a6785m46934l82555K20199K89806L46314Q62025q78864p77166K81813l88572
164h90719J238984L91226J00629J075658k135632l89455K084300n32568l11282
155F31141L87891j358129j085287N8650O23812J371517j064394p8123J092350
146E79428o03502p44739J06719O68259q8694J58555r94168L93477J83279q20011
$$ y = [912494, 847561, 383069, 1099175, 2030617, 1137132, 1427201, 1572465, 1924211, 1455861, 940337, 618203, 23368, 860570, 1033227, 958443, -25612, -275066, -1583970, -1760786, 14690, -675297, -160770, -696758, -93120, 644262, 1093643, 683788, 283173, -86638, -1124383, -1681082, -185581, 292560, 298640, -93807, -359275, -1198890, -1229876, 487744, -16785, -463719, -846274, -626075, -336269, 10045, 872070, -6794, -783960, -502147, -890719, 348265, 739491, 840120, 1915778, -219854, -609309, 1474991, 942423, 631141, 1019032, -339097, -1424384, -1365734, -741922, 629595, -434799, -512922, 579428, -24074, -768813, -662094, 6165, -82529, 76026, -918142, -524665, -341386, -1161397]
136a161397J411257O19166O17320J06803j27883p08352j795651j8061J026721
127c0077j163092n54878J173037O32817l13613J166347o31910J96716j146898
118f71551L10111M30322m52391j07452J004961o04952j061016N01529J460933
109H10494q51561k44123P7080o39104m06027M75047M95408L28939R13484p47686
99B11951m60943j016600P84033M24682K77364J18955l26619r67956Q81581k94324
89c67876q15025j71854J016898l11041N29280Q69099j505621N52242q36426P57310
79b83014N11189P7755J26861r43300J01027o17484K37500J428873J001687j894515
69b53421n90148K30159l9092R1310M82959k52898Q46971l39350R2263J002416
$$ y = [-1161397, 249860, 869026, 1486346, 1593149, 1465266, 756914, -1038737, -1056798, -30077, -1193169, -1748047, -575010, 57807, -255806, 910541, 278631, 475347, -671551, -361440, 68882, -383509, -490961, 514000, -90952, -1151968, -650439, 810494, -41067, -285190, -208110, -847214, -1253241, -778194, -282786, 46153, 959637, 211951, -248992, -1265592, -481559, -56877, 220487, 339442, 12823, -955133, -73552, -367876, -1182901, -1354755, -337857, -648898, -119618, 749481, -756140, -203898, -1040324, -283014, 228175, 305930, 432791, -510509, -409482, -1026966, -789466, 639407, 1641094, -253421, -843569, -613410, -652502, -561192, -78233, -331131, 515840, 176490, 268753, 1271169]
59A271169o89761l98881O8819j138083O05250n1358M07861J409150n81795r65137
49f2766j93399M5439K88994J641627r55019j025679M89694j07586p06688M69710
39a15673J483Q7212m13046L33282N88628J07977K19353n51557N34455L36361m59756
28F68719R9283q10844o64719n19225J706205L9883q86209M10132K15131m95830
18b37474n85972Q4413L33529m1189m3558O67486k35748L2905M57198j93294l47590
7a09294l01981p0669J272399j49617J98211O5537l1185
0H73401
$$ y = [1271169, 581408, 182527, 251346, -886737, -281487, -332845, 75016, 1484166, 902371, -62766, -256165, -210726, 78268, 1719895, 764876, -260803, 228891, 121305, -585383, -115673, -114190, -26978, -440024, -106742, 481886, 589863, 809216, 257659, 792114, 1128475, 668719, 768002, -42842, -707561, -1226786, 479419, 519302, -366907, 43225, 258356, -237474, -823446, -739033, -405504, -446693, -490251, 177235, -58513, -25608, 431590, 238296, -109294, -411275, -481944, 790455, 640838, 839049, 904586, 873401]
$$ Imaginary data points
##PAGE= N=2
##DATA TABLE= (X++(I..I)), XYDATA
16383a657270Q99897q7249o80177j7248L01886j27585Q44518J174626M42110n29380
16373E64128P3714l04825M93494J49912j01665l72896m89322q6715M04886M42067
16363G72778k43371q5087m29473L30859j179087m1338o63731k89939M27696P00965
16353f99728P21990K58132M51498m84641j091709R76790Q09049k1936J647511
16344B566956j512604k75197j574732K33211K1140J071042n5529m5929O07589
16335A035947r85519J1323J035171m20054J327811O50043p54540j244126M2546
16326F98602K90079o20988j49718J05539O93259k09361Q61662j467548O78253
16317H79779K81507q56372j49192N18798M66291o47350Q8941K70193k52937j839628
$$ y = [-1657270, -757373, -844622, -1524799, -1542047, -1240161, -1367746, -523228, 651398, 1093508, 564128, 637842, 333017, 826511, 976423, 874758, 501862, 12540, -74175, 330711, 772778, 529407, 444320, 14847, 345706, -833381, -874719, -1538450, -1828389, -1400693, -699728, 22262, 280394, 731892, 247251, -844458, 132332, 941381, 919445, 2566956, 1054352, 779155, -795577, -562366, -541226, 529816, 474287, 428358, 1035947, 50428, 61751, 1096922, 676868, 2004679, 2654722, 1900182, 656056, 698602, 988681, 367693, 217975, 323514, 1016773, 807412, 1669074, 201526, 879779, 1161286, 304914, 155722, 674520, 1140811, 493461, 582402, 852595, 599658, -1239970]
16307a239970O5457L18399K09154J116056n6185l1867q86783J108740M75388L5664
16297A114053N1174n73637n08032j129430j89166P49735K64658L98758k36560
16288e8447O35729n87221q1189M24425J56066m80905N29074m24803j85606K2477
16278e0400O69142L66780k64589j64803O84691K65689j271921m63684P00143n51155
16268h0107j2394Q08365N01842q42540O2999L27687o50461J79119N02679l43805
16258D53384o24574O57017j718110J32424K36406K80817Q97734p1797J217750
16249A461051l07982j692720J649029J89495O2532l75432l15855L58210j31826
16240H96502n38516J81653l60840m12586J42499p06531J996571P97910j840098
$$ y = [-1239970, -1174513, -856114, -646960, 469096, 412911, 381044, -505739, 603001, 1078389, 1114053, 1165227, 591590, 83558, -1045872, -1235038, -485303, -220645, 178113, -58447, 577282, -9939, -91128, 333297, 489363, 8458, 537532, 112729, -72877, -50400, 618742, 985522, 720933, 556130, 1240821, 1506510, 234589, -229095, 471048, -80107, -92501, 715864, 1217706, 375166, 438165, 765852, 115391, 294510, 797189, 453384, -171190, 485827, -1232283, -1099859, -863453, -582636, 315098, 243301, 1461051, 1153069, -539651, 1109378, 1298873, 1361405, 985973, 670118, 1028328, 896502, 357986, 539639, 178799, -233787, -91288, -797819, 1198752, 1996662, 156564]
16231A56564n60567J14594K23809R94637J038890n43835J45821Q6495N85792k04751
16221B037449j256392Q17320n923j504509N62902l36701J57969n43181J189952
16212A118886l26061j404503L60297N58209n06226Q40723R33936r08628K59553
16203I26186M46647q53267o22404L96234j09886J504106J311900j310627k763513
16194a074624N24283j61526L21789Q91304N29816k27099n49520l99300Q49262
16185G04385K847n99245j58303O62981J75200L21603N48147l81283J89258l53474
16175A112116R72487M8778k0527K09520o29738j479393k11207k87931M81586Q12303
16165A007994R80132m00969J25512J44540q95178m02700n79844l57990O36365
$$ y = [156564, -404003, -289409, -65600, 929037, 1967927, 1424092, 1569913, 1656408, 2242200, 2037449, 781057, 1598377, 1592454, 87945, 650847, 314146, 472115, -71066, 1118886, 792825, -611678, -251381, 306828, -199398, 641325, 1575261, 666633, 926186, 1372833, 519566, -102838, 293396, 183510, 1687616, 2999516, 1688889, -1074624, -550341, -711867, -390078, 501226, 1031042, 803943, 254423, -144877, 704385, 707232, 107987, -50316, 612665, 787865, 1109468, 1657615, 1276332, 1465590, 1112116, 2084603, 2133381, 2112854, 2322374, 1692636, 213243, 2036, -285895, 195691, 1007994, 1988126, 1587157, 1712669, 1857209, 962031, 559331, -20513, -378503, 257862]
16156B57862L16055n88581q20344L55123J145172k416M53506N18055n45115R4005
16146A183322M57208p93264J113998K33189l22910q07504J10883P58732j334050
16137E99604J878408j151554l87961k58550r28516K228794j586759J337744j389752
16128C41458M52361p96215L86367p99820L01318J23806L98622J006999k40449
16119A174447l38997Q35998k19071j125695J307745r93334j114084Q75260L30578
16110G32847j105252K62166n48663K382995j527717Q2422J176757l66861K80656
16101A369350J290613J67118k122645Q62390M1721j548290K80860J17736m35449
16092B3404J987368l56079l12632J128642J54983j695467m40446J387433j325723
$$ y = [257862, 573917, -14664, -835008, -479885, 665287, 662871, 1116377, 1634432, 1089317, 1183322, 1640530, 847266, 1961264, 2194453, 1871543, 1064039, 1174922, 1933654, 599604, 2478012, 1326458, 938497, 679947, -248569, 1980225, 393466, 1731210, 341458, 793819, -2396, 383971, -415849, -114531, 9275, 407897, 1414896, 1174447, 835450, 1671448, 1452377, 326682, 1634427, 641093, -472991, 402269, 732847, -372405, -110239, -658902, 1724093, 196376, 278798, 1455555, 1088694, 1369350, 2659963, 2827081, 704436, 1566826, 1608547, 60257, 341117, 458853, 23404, 2010772, 1654693, 1342061, 2470703, 2625686, 930219, 489773, 1877206, 551483]
16083E51483l50809J736870M74318n03320M83857l4587j932050J414379N25810
16074B365951r45617o35289j73952p9373M44050O35275L00431l98423j940118
16065d27065P9461j060188J876204J458725J549034n63691r79401n41265k67505
16056A124309m7592Q33775q6505Q27544k45432o05700L5778j3787j66149n14512
16046A141729l66770k12906j09796O70980q4048l05526L89484M31832o056o23488
16036I25435J392377K30356j680098N52352R27216j077066K37842L10045j873163
16027e4704q41219J048820q57766J969056l42699P17108l81601m37420q40363
16018b0788J200559J589238j552411O30206o48317o22354m01076P54191o7493
$$ y = [551483, 200674, 1937544, 2411862, 1908542, 2392399, 2357812, 425762, 1840141, 2365951, 1420334, 785045, 611093, 531720, 975770, 1611045, 1911476, 1513053, -427065, -347604, -1407792, 468412, 1927137, 3476171, 2912480, 1933079, 1391814, 1124309, 1076717, 1910492, 1823987, 2651531, 2406099, 1800399, 1836177, 1822390, 1656241, 1141729, 774959, 562053, 452257, 1123237, 1039189, 733663, 1123147, 1554979, 1548923, 925435, 2317812, 2548168, 868070, 1420422, 2347638, 1270572, 1508414, 1818459, -54704, -895923, 152897, -704869, 1264187, 921488, 1638596, 1256995, 819575, -20788, 1179771, 2769009, 1216598, 1846804, 1198487, 576133, 175057, 929248, 861755]
16009H61755P75751R42104m47939j222716n55066j3830N93847J79003M31504p18701
15999H25712J175947K65637n68071J102186j432373j085161o13376J454487Q99645
15990B024633J04290l42099k3956m30169m58878J688162j589125j456190R41898
15981D58566J260728Q09162j128160K01932l20608o86179J616102r42221j082493
15972A86829J26148J09561L54935J042949L73018k44471M43757J28492r22922
15963A598296K6475N6060K84984n39109l27680J081709j118870L05028J164399
15954B531292k169965m78789J463776m73285k29201O17678j605636J92679O73369
15945E21918L84283o85406Q92931Q82974j178664P62079j010549K83766q14389
$$ y = [861755, 1637506, 2579610, 2131671, 908955, 353889, 340059, 933906, 1112909, 1544413, 825712, 2001659, 2267296, 1699225, 2801411, 1369038, 283877, -329499, 1124988, 2024633, 2128923, 1786824, 1762868, 1332699, 873821, 2561983, 972858, -483332, 458566, 1719294, 2528456, 1400296, 1602228, 1281620, 595441, 2211543, 1269322, 186829, 312977, 422538, 777473, 1820422, 2193440, 1948969, 2392726, 2521218, 1598296, 1624771, 1680831, 1965815, 1426706, 1099026, 2180735, 1061865, 1366893, 2531292, 361327, -117462, 1346314, 873029, 643828, 1261506, -344130, -151451, 521918, 906201, 220795, 1113726, 1996700, 818036, 1580115, 569566, 853332, 38943]
15936C8943J576262l91902R4373J573582l41232r93469K57423k227316N0119M23693
15926F0476K05240O22866p90434K23122l7485M44374l32096M92888p3487j874693
15916a059229N51056P57277o01082N26815J155200J35478p80011K178527L0713
15907B894744k13443l44679j104811j582469O58639L45717n37751L20392q03697
15898c67358R67254q03702R13298K8605j087275J01702J091515j030296M41650
15889B55393N22241k14619j516365J624922k50467j21722J065352J514466m15844
15880B463357j424620J436573q65613P84857J003927K76617j959307l80156k94271
15871A041364Q9178M90660Q46180j120137q12004j89761J812464j632542J065054
$$ y = [38943, 1615205, 1223303, 1317676, 2891258, 2550026, 1556557, 1813980, -413336, -363217, 60476, 265716, 888582, 98148, 321270, 283785, 728159, 396063, 888951, 815464, -1059229, -508173, 249104, -351978, 174837, 1330037, 1465515, 685504, 2864031, 2894744, 2681301, 2336622, 1231811, -350658, 307981, 653698, 115947, 436339, -367358, 599896, -203806, 709492, 738097, -349178, -247476, 844039, -186257, 255393, 777634, 563015, -953350, 671572, 421105, 299383, 1364735, 2879201, 2463357, 1038737, 2475310, 1609697, 2394554, 3398481, 3675098, 1715791, 1335635, 1041364, 1130542, 1621202, 2467382, 1347245, 535241, 345480, 2157944, 525402, 1590456]
15862A590456k15834k164652R68463J27988J928213k8819M13595R44050n75301
$$ y = [1590456, 1374622, -790030, 178433, 306421, 2234634, 2205815, 2619410, 3563460, 2988159]
$$ [...]
##END NTUPLES=NMR SPECTRUM
##END=
