##TITLE=1H_DE-80H_X3
 200.13MHz, d2o
 8 sc
 
 19ns.26.2.2025
##JCAMPDX= 6.0         $$ Bruker NMR JCAMP-DX V2.0
##DATA TYPE= NMR SPECTRUM
##DATA CLASS= NTUPLES
##ORIGIN= UXNMR, Bruker Analytische Messtechnik GmbH
##OWNER= pz
$$ XWIN-NMR		Version 3.5
$$ Mon Dec 15 10:40:52 2025 Russian Standard Time (UT+4h)  Yarkov@DPX200
##.OBSERVE FREQUENCY= 200.1313
##.OBSERVE NUCLEUS= ^1H
##.ACQUISITION MODE= SIMULTANEOUS
##.ACQUISITION SCHEME= undefined
##.AVERAGES= 8
##.DIGITISER RES= 18
##SPECTROMETER/DATA SYSTEM= spect
##.PULSE SEQUENCE= zg30
##.SOLVENT NAME= DMSO
##.SHIFT REFERENCE= (INTERNAL, DMSO, 0, 15.4968)
##AUDIT TRAIL= $$ (NUMBER, WHEN, WHO, WHERE, WHAT)
$$ ##TITLE= Audit trail, XWIN-NMR		Version 3.5
$$ ##JCAMPDX= 5.01
$$ ##ORIGIN= Bruker BioSpin GmbH
$$ ##OWNER= Yarkov
$$ C:/Bruker/XWIN-NMR/data/yarkov2/nmr/H-C/1/pdata/1/auditp.txt
$$ ##AUDIT TRAIL=  $$ (NUMBER, WHEN, WHO, WHERE, WHAT)
(   1,<2025-12-15 10:39:30.98 +0400>,<Yarkov>,<DPX200>,
      <created by zg, POWCHK disabled, PULCHK disabled
       configuration hash MD5:
       00 E9 B6 7A A2 85 ED C7 34 08 36 98 17 FE 4E 26
       data hash MD5: 16K
       69 10 1F FA 88 56 42 E7 18 F6 C3 1D 96 45 5D C2>)
(   2,<2025-12-15 10:39:37.03 +0400>,<Yarkov>,<DPX200>,
      <Start of raw data processing
       efp BC_mod = 2 LB = 0.25 FT_mod = 6 PKNL = 1 PHC0 = -5310.083 PHC1 = 17.82193 SI = 16K 
       data hash MD5: 16K
       45 BD B3 9E E3 38 15 5F 0B B8 4D 4E 8B 04 52 93>)
$$ ##END=
$$ 
$$ hash MD5
$$ F3 EA 58 23 25 BE C5 B4 F3 A2 EE 5E 6B E0 BC 9E
##$RELAX= 
##$RELAX= 
##$RELAX= 
##$RELAX= 
##$RELAX= 
##$RELAX= 
$$ Bruker specific parameters
$$ --------------------------
##$DU= <C:/Bruker/XWIN-NMR>
##$EXPNO= 1
##$NAME= <H-C>
##$PROCNO= 1
##$TYPE= <nmr>
##$USER= <yarkov2>
##$AMP= (0..31)
100 100 100 100 100 100 100 100 100 100 100 100 100 100 100 100 100 100 
100 100 100 100 100 100 100 100 100 100 100 100 100 100 
##$AQSEQ= 0
##$AQ_mod= 1
##$AUNM= <au_zg>
##$AUTOPOS= <>
##$BF1= 200.13
##$BF2= 200.13
##$BF3= 200.13
##$BF4= 200.13
##$BF5= 200.13
##$BF6= 200.13
##$BF7= 200.13
##$BF8= 200.13
##$BYTORDA= 1
##$CFDGTYP= 0
##$CFRGTYP= 5
##$CHEMSTR= <none>
##$CNST= (0..31)
1 1 145 1 1 1 1 1 1 1 1 1 1 1 1 1 1 1 1 1 1 1 1 1 1 1 1 1 1 1 1 1 
##$CPDPRG= <>
##$CPDPRG1= <>
##$CPDPRG2= <>
##$CPDPRG3= <>
##$CPDPRG4= <mlev>
##$CPDPRG5= <mlev>
##$CPDPRG6= <mlev>
##$CPDPRG7= <mlev>
##$CPDPRG8= <mlev>
##$CPDPRGB= <>
##$CPDPRGT= <>
##$D= (0..31)
0 0.7 0 0 0 0 0 0 0 0 0 0.03 0 0 0 0 0 0 0 0 0 0 0 0 0 0 0 0 0 0 0 0 
##$DATE= 1765780770
##$DBL= (0..7)
120 120 120 120 120 120 120 120 
##$DBP= (0..7)
150 150 150 150 150 150 150 150 
##$DBP07= 0
##$DBPNAM0= <>
##$DBPNAM1= <>
##$DBPNAM2= <>
##$DBPNAM3= <>
##$DBPNAM4= <>
##$DBPNAM5= <>
##$DBPNAM6= <>
##$DBPNAM7= <>
##$DBPOAL= (0..7)
0.5 0.5 0.5 0.5 0.5 0.5 0.5 0.5 
##$DBPOFFS= (0..7)
0 0 0 0 0 0 0 0 
##$DE= 6
##$DECBNUC= <off>
##$DECIM= 32
##$DECNUC= <off>
##$DECSTAT= 4
##$DIGMOD= 1
##$DIGTYP= 9
##$DL= (0..7)
0 120 120 120 120 120 120 120 
##$DP= (0..7)
$$ [...]
##$SUBNAM2= <"">
##$SUBNAM3= <"">
##$SUBNAM4= <"">
##$SUBNAM5= <"">
##$SUBNAM6= <"">
##$SUBNAM7= <"">
##$SUBNAM8= <"">
##$SUBNAM9= <"">
##$SW= 18.0517328524113
##$SWIBOX= (0..15)
0 0 2 0 0 0 0 0 0 0 0 0 0 0 0 0 
##$SW_h= 3612.71676300578
##$TD= 16384
##$TD0= 1
##$TE= 0
##$TE2= 300
##$TE3= 300
##$TEG= 300
##$TL= (0..7)
0 120 120 120 120 120 120 120 
##$TP= (0..7)
150 150 150 150 150 150 150 150 
##$TP07= 0
##$TPNAME0= <>
##$TPNAME1= <>
##$TPNAME2= <>
##$TPNAME3= <>
##$TPNAME4= <>
##$TPNAME5= <>
##$TPNAME6= <>
##$TPNAME7= <>
##$TPOAL= (0..7)
0.5 0.5 0.5 0.5 0.5 0.5 0.5 0.5 
##$TPOFFS= (0..7)
0 0 0 0 0 0 0 0 
##$TUNHIN= 0
##$TUNHOUT= 0
##$TUNXOUT= 0
##$USERA1= <user>
##$USERA2= <user>
##$USERA3= <user>
##$USERA4= <user>
##$USERA5= <user>
##$V9= 5
##$VALIST= <valist>
##$VCLIST= <CCCCCCCCCCCCCCC>
##$VD= 0
##$VDLIST= <DDDDDDDDDDDDDDD>
##$VPLIST= <PPPPPPPPPPPPPPP>
##$VTLIST= <TTTTTTTTTTTTTTT>
##$WBST= 1024
##$WBSW= 4
##$XGAIN= (0..3)
0 0 0 0 
##$XL= 0
##$YL= 0
##$YMAX_a= 201133
##$YMIN_a= -154708
##$ZGOPTNS= <>
##$ZL1= 120
##$ZL2= 120
##$ZL3= 120
##$ZL4= 120
##$ABSF1= 0
##$ABSF2= 0
##$ABSG= 0
##$ABSL= 0
##$ALPHA= 0
##$AQORDER= 0
##$ASSFAC= 0
##$ASSFACI= 0
##$ASSFACX= 0
##$ASSWID= 0
##$AUNMP= <proc_1d>
##$AZFE= 0.1
##$AZFW= 0.1
##$BCFW= 0
##$BC_mod= 2
##$BYTORDP= 0
##$COROFFS= 0
##$CY= -3
##$DATMOD= 1
##$DC= 0
##$DFILT= <>
##$DTYPP= 0
##$F1P= 0
##$F2P= 0
##$FCOR= 1
##$FTSIZE= 16384
##$FT_mod= 6
##$GAMMA= 0
##$GB= 0
##$INTBC= 1
##$INTSCL= 3.241238e-09
##$ISEN= 128
##$LB= 0.25
##$LEV0= 0
##$LPBIN= 0
##$MAXI= 10000
##$MC2= 0
##$MEAN= 0
##$ME_mod= 0
##$MI= 1.114404
##$NCOEF= 0
##$NC_proc= -7
##$NLEV= 6
##$NOISF1= 3.799351
##$NOISF2= 2.8
##$NSP= 0
##$NTH_PI= 0
##$NZP= 0
##$OFFSET= 15.4968
##$PC= 1
##$PHC0= -5310.083
##$PHC1= 17.82193
##$PH_mod= 1
##$PKNL= yes
##$PPARMOD= 0
##$PSCAL= 0
##$PSIGN= 0
##$REVERSE= no
##$SF= 200.130004983449
##$SI= 16384
##$SIGF1= 3
##$SIGF2= 2
##$SINO= 0.751879
##$SIOLD= 32768
##$SREGLST= <19F.Aceton>
##$SSB= 0
##$STSI= 16384
##$STSR= 0
##$SW_p= 3612.71676300578
##$SYMM= 0
##$S_DEV= 0
##$TDeff= 16384
##$TDoff= 0
##$TI= <>
##$TILT= no
##$TM1= 0
##$TM2= 0
##$TOPLEV= 0
##$USERP1= <user>
##$USERP2= <user>
##$USERP3= <user>
##$USERP4= <user>
##$USERP5= <user>
##$WDW= 1
##$XDIM= 16384
##$YMAX_p= 416504160
##$YMIN_p= -1076193
$$ End of Bruker specific parameters
$$ ---------------------------------
##NTUPLES= NMR SPECTRUM
##VAR_NAME=  FREQUENCY,     SPECTRUM/REAL,   SPECTRUM/IMAG
##SYMBOL=    X,             R,               I
##VAR_TYPE=  INDEPENDENT,   DEPENDENT,       DEPENDENT
##VAR_FORM=  AFFN,          ASDF,            ASDF
##VAR_DIM=   16384,         16384,           16384
##UNITS=     HZ,            ARBITRARY UNITS, ARBITRARY UNITS
##FACTOR=    0.220516191357247, 1,           1
##FIRST=     3101.37474581615, 0,            0
##LAST=      -511.342017189627, 0,           0
##MIN=       -511.342017189627, -1076193,    0
##MAX=       3101.37474581615, 416504160,    0
$$ Real data points
##PAGE= N=1
##DATA TABLE= (X++(R..R)), XYDATA
$$ [...]
8530H60544p7277k3475O4402p0932k7263o9963O5264m132O5829L3044p5440m9221
8518F91380o8255k0894j1936K5299P2874j10r2826J88422J4947q1226j18293j7745
8506E81637l0425n546N4069K4183K5316j39326J59510L0289p9742j14178P403
8495E13190q8675M4017j3947r7136Q8082q0727q9108J14002Q7085K1674N5773
8484E54230J4615n8228L8936k49M0259q3031q0438O2312P1583j40392j97909N6876
8472B78564K00160M6868j25586O3986L6552l9331J13610P162k02660M9464N8939
8461D87728j14088L5780K9666j1707N3645Q227j04022P9380R6794k674j5175j03570
8449D39984K3989J3289O3394p9586n4128k3348l4488o277P439P6819k0713k9092
$$ y = [860544, 783267, 759792, 824194, 753262, 725999, 656036, 721300, 717168, 782997, 816041, 740601, 691380, 623125, 602231, 590295, 615594, 688468, 688358, 595532, 783954, 798901, 717675, 599382, 581637, 551212, 545666, 599735, 623918, 649234, 509908, 669418, 699707, 619965, 505787, 513190, 424515, 468532, 454585, 357449, 445531, 364804, 275696, 389698, 476783, 498457, 554230, 568845, 510617, 549553, 549304, 589563, 506532, 426094, 488406, 559989, 419597, 221688, 278564, 478724, 525592, 400006, 463992, 500544, 461213, 574823, 581985, 379325, 428789, 487728, 373640, 409420, 439086, 427379, 481024, 489251, 385229, 464609, 561403, 558729, 543554, 439984, 463973, 477262, 540656, 461070, 406942, 383594, 349106, 342829, 350268, 427087, 406374, 377282]
8437C77282J10793j3524n2151O7995r0817K1513l5366j26807K7468j2735R2510
8426C66161K1074p8415q1099R3329m0182J21882J01772m0005O9050m0399o3131
8415D30037L106k9918P9742N570p6025M648l3506Q5723m0478l9847J08236N0233
8403E47521p4475p8649k9324J36580P5846m6363n6376N3554M2057Q098m9219j21135
8391D08115m7924k4881Q7460l2366O7469J6580j38967P8127J9072j45885J01059
8380C87859l4455k6643K2675J686K0353j0163O1946J7102k2557R8275n5533J35555
8368E96100M4858M0951j93535j76318j7104O7212R0486L0378J22353j0609j42186
8357D52586j12378J62282J15013K0811N627J22160r1780j07804j58922N9293J4625
$$ y = [377282, 488075, 474551, 422400, 490395, 399578, 421091, 385725, 258918, 286386, 273651, 366161, 387235, 308820, 227721, 321050, 280868, 402750, 504522, 464517, 533567, 493168, 430037, 433143, 403225, 482967, 488537, 412512, 417160, 383654, 469377, 428899, 389052, 497288, 547521, 473046, 394397, 365073, 501653, 577499, 531136, 474760, 528314, 570371, 578469, 529250, 408115, 360191, 335310, 422770, 390404, 457873, 474453, 335486, 413613, 432685, 286800, 387859, 353404, 326761, 349436, 351122, 371475, 361312, 423258, 440360, 417803, 516078, 460545, 596100, 640958, 681909, 488374, 312056, 294952, 362164, 452650, 483028, 605381, 594772, 452586, 340208, 502490, 617503, 638314, 643941, 766101, 674321, 566517, 407595, 466888, 481513]
8346D81513j17245j3070P6878O0673N8361q3932k5158k7213j94525J26557K28493
8335E71332R286m2390m6629L1479L723P269l2791p8810Q4132j5946J37934L7932
8323F66521k12827J6397j0288m0092l1445J11963q6391P0180J4520M0267M8682
8312E87487k5123j89984n0178M3153L3602l850n790O0363j30756R7434J31228
8301E47586Q393j45492J8438J926m1218j1034N789l019J4222M7810O9155r8863
8289D13693n8191m1272N0484J56175k6761J3738p5721j3720K7433N9040m0987
8278D63911j3593p209M2694P6395P4904k358p4608O1819j41356Q5456L6563r7052
8266E05566j27822j5238J05897K9209j15594m5837j02578J9421J27560L0612k7625
$$ y = [481513, 364268, 351198, 428076, 488749, 547110, 463178, 438020, 410807, 216282, 342839, 571332, 580618, 538228, 491599, 523078, 526801, 534070, 501279, 422469, 506601, 490655, 628589, 666521, 453694, 470091, 459803, 419711, 388266, 500229, 413838, 484018, 498538, 538805, 587487, 562364, 372380, 322202, 365355, 398957, 395107, 389317, 449680, 318924, 416358, 547586, 555979, 410487, 428925, 430851, 389633, 378599, 384388, 381369, 395591, 443401, 512556, 413693, 355502, 314230, 364714, 520889, 494128, 507866, 432145, 418425, 445858, 504898, 463911, 450318, 443109, 485803, 562198, 637102, 634744, 560136, 621955, 480599, 566055, 602618, 505566, 377744, 362506, 468403, 497612, 382018, 336181, 233603, 253024, 380584, 411196, 383571]
8255C83571j5994O3306J3144L992q676m5837m7546J19276q8401O5075N8940m962
8243D95888j28350J1514R3747k9892M9560j30775j9724P6013o7597L3572O3292
8232D47248j15542J11264k877k02038n1259k2011J61762J72205j74791O1988O3495
8221D49444J9880R5524m3289l6647l4536o3348J06414M8586q986m9206k0991j3722
8209D49123J0608P9864K6741o0871p3680o9331J2383R1305P3843P72k26867J01081
8197D14971p457O5074j06791K71075o64558k1266J091375p4118n161j48805O9080
8186H83419k94400J5359l3003j20704Q8619n4879L2882O6018j1331k4201Q4131
8175F31910m7092j71467K0939J07671J7688n2916n4280R3514p1225n4373M4263
$$ y = [383571, 367577, 430883, 444027, 448019, 439343, 393506, 345960, 465236, 376835, 441910, 500850, 495888, 367538, 379052, 472799, 442907, 492467, 361692, 341968, 417981, 350384, 383956, 447248, 331706, 442970, 440093, 238055, 186796, 164785, 326547, 498752, 323961, 385949, 449444, 469324, 564848, 521559, 484912, 450376, 387028, 493442, 542028, 533042, 483836, 462845, 449123, 459731, 539595, 566336, 505465, 431785, 362454, 374837, 466142, 539985, 540757, 313890, 414971, 407514, 472588, 365797, 636872, -27686, -48952, 1042423, 968305, 963144, 814339, 883419, 589019, 604378, 571375, 450671, 539290, 484411, 517293, 583311, 571980, 547779, 631910, 584818, 413351, 434290, 541961, 559649, 506733, 452453, 545967, 474742, 420369, 464632]
8164D64632K7029P4891N190k1071m2456M903m3249Q7327r8399j28513J09772K8278
8152D68334Q2361r5047l4463L8399J66065n5780k5766q2763K4499L0529J35074
8141F51442l5891k3555J16768k12680J0567Q956K5590J06590j21997j44980J25876
8130E06686M7349J2315K7916o1848k9378R9769Q3638m7135q5696m8320J17835
8119F23131J49370k37602m7638j05728O447L2807K7489J44710K1298Q4118j02248
8108E96154r4358M177Q9383O7188N7454O8346p0879n2563M3289J62094l7180j41337
8096F91768J8128j63112l7133L7720P9932L2744j19542j49210K7087J39065q097
8085E49350P6715K57o9041Q99J4562K8591o9437n6645N9835O9256j9990l7537
$$ y = [464632, 491661, 566552, 571742, 550671, 508215, 513118, 469869, 557196, 458797, 330284, 440056, 468334, 550695, 455648, 421185, 459584, 625649, 569869, 544103, 461340, 485839, 516368, 651442, 615551, 591996, 708764, 496084, 506651, 515607, 541197, 647787, 525790, 380810, 506686, 554035, 566350, 594266, 532418, 503040, 602809, 686447, 639312, 553616, 505296, 623131, 772501, 534899, 487261, 381533, 387980, 420787, 448276, 592986, 614284, 698402, 596154, 501796, 505973, 595356, 662544, 719998, 788344, 717465, 664902, 708191, 870285, 833105, 691768, 709896, 546784, 509651, 547371, 627303, 660047, 540505, 391295, 418382, 557447, 549350, 626065, 626322, 557281, 558180, 572742, 601333, 531896, 475251, 535086, 604342, 584352, 546815]
8073E46815j86876M7140R2373K577J2856o7149l3451K09033m9485J3303L4291
8062F21427j33708j06205P4455J11074O8750k2858j11305K5685N5168r001J35235
8051G08717O7171k29953m7371J8444k7094J21985O911n4530p475q6184k9025L6923
8039D78519Q633l5550L9918m9583L1319J04437K7281N4763k6265p6038L029q8037
8027D72426J3449J5032M6103O7811J6945p5829L3506J2439l0162J18763l3069
8016F57414j4954o9601R3555o6010j01126j05279j1424R2687J3005O6713Q1568
8005F36548J39860m763o8887j66103N5795L7943O6897j57136j50754K7905J61077
7994E78382K32964p0706j81785J4915j5614j6034m1649K9700p076q5212R343K69172
$$ y = [546815, 359939, 407079, 499452, 502029, 514885, 447736, 414285, 623318, 573833, 587136, 621427, 487719, 381514, 455969, 567043, 635793, 612935, 501630, 527315, 582483, 573482, 708717, 775888, 545935, 498564, 517008, 489914, 611899, 618810, 564280, 556805, 470621, 441596, 478519, 487152, 451602, 491520, 441937, 473256, 577693, 604974, 659737, 633472, 557434, 560463, 472426, 485875, 500907, 547010, 614821, 631766, 555937, 589443, 601882, 571720, 690483, 657414, 642460, 572859, 666414, 600404, 499278, 393999, 382575, 475262, 488267, 554980, 636548, 776408, 771645, 702758, 536655, 592450, 630393, 697290, 540154, 389400, 417305, 578382, 811346, 740640, 558855, 573770, 558156, 542122, 500473, 530173, 523097, 437885, 447228, 716400]
7982G16400m3080j24200j3306L3588J17464K214N501K2388o8803P2288o093k9658
7970F84703J39032j65407k2608R299p5473M3626q6939n2576J86500P1610j12861
7959F18906Q4701O136r9893m9565L0053J6249Q4500o4931l5700O7021K3132M5645
7947G26254m9292k3833J05171k1481j963Q2098j42717l0163o2209L7263J99677
7936H18805L1806j25382q2499j5230J14627j14317J7136J4818q7683j59342M6882
7925D59621J51282J17726P9425N3022j91341m8102M3286k8959J89219j16369m7409
7914F61401p8209n1360J97592Q4761r1922n5926J06515m096K6956M6141p9938
7903G61915j11028R6212j4460p0836P0258k378q0002J342L139j8720R8589N9120
$$ y = [716400, 673320, 549120, 535814, 569402, 686866, 689080, 694581, 716969, 648166, 720454, 714361, 684703, 823735, 658328, 635720, 645019, 569546, 613172, 526233, 473657, 660157, 731767, 618906, 703607, 709743, 609850, 560285, 590338, 606587, 691087, 626156, 590456, 657477, 680609, 726254, 676962, 653129, 758300, 736819, 734856, 816954, 674237, 644074, 581865, 619128, 818805, 850611, 725229, 642730, 627500, 742127, 627810, 644946, 659764, 572081, 412739, 459621, 610903, 728629, 808054, 861076, 669735, 621633, 664919, 635960, 825179, 708810, 661401, 583192, 531832, 729424, 814185, 722263, 666337, 772852, 768756, 795712, 841853, 761915, 650887, 747099, 732639, 661803, 732061, 729683, 649681, 651023, 654162, 635442, 734031, 793151]
7891G93151L1582r2156l3244P231j5680J00316K471L9627l3852o806j28161j45963
7879E18516J36019J66294P3987N494K5108n7402N5653N6400l2286j8236M3647
7868I73194q3836j44834O8227K480p5773J04825j05542p2557J86692k7058M6811
7857H72629P3059r9145L941N1192p8088J5338l6220J53061O4442j34990j09419
7846G75800n41J08944j0566n2244j6905N3475k572K8242Q079N4938J0962q1206
7834H76406M1604N9276p1423K3160L9265n2979n2371J14276O2149j0381j2773
7823A016209m3157Q407J33501l0583K1573l9545j17190l145P9314n7953j25377
7812H42054J47061J9001o1574J6460p4536K4271O2385k85872J88650M74118K7555
$$ y = [793151, 824733, 732577, 699333, 706564, 690884, 791200, 793671, 833298, 799446, 792640, 664479, 518516, 654535, 820829, 894816, 900310, 925418, 868016, 923669, 980069, 947783, 929547, 973194, 889358, 744524, 812751, 815231, 739458, 844283, 738741, 666184, 852876, 825818, 872629, 945688, 846543, 850484, 901676, 823588, 838926, 802706, 955767, 1020209, 885219, 775800, 775259, 884203, 873637, 821393, 804488, 857963, 855391, 883633, 891712, 946650, 957612, 876406, 918010, 977286, 905863, 929023, 968288, 915309, 862938, 977214, 1039363, 1028982, 1016209, 973052, 981459, 1114960, 1084377, 1105950, 1066405, 949215, 946070, 1025384, 967431, 842054, 989115, 1008116, 946542, 963002, 888466, 912737, 975122, 689250, 877900, 1352018, 1379573]
7801A379573j92647n2703P6172M4967q061m2717L821K0340K6023q0795J04308
7790A278281O7425m2695r7765O8163k8531N489J16014j9150J11138J00567m5782
7779A513154n2379j33955n5986J2846M9265J4518J15806J54891q7231Q2527L2259
7768A645715J5227k5708p7683p0479L4140J06650q8870p7126J09359P9173R1067
7757A741465L5060K0045O4608k3567l1793O4121N6912J7683P6343k1977j93609
7746A805291L5805J77941J45218r187j70560l6878K2492J15514R0914P869j00670
7735B083749J25838J68147j62585M3361K3862Q3495R4197j04902P5108J50367
7725B580637P1366J5496K3444J2874J33048Q5963m478K1046J49356J30343k6037
$$ y = [1379573, 1186926, 1134223, 1210395, 1255362, 1247301, 1204584, 1208405, 1228745, 1254768, 1173973, 1278281, 1345706, 1303011, 1205246, 1273409, 1244878, 1250367, 1366381, 1347231, 1458369, 1558936, 1513154, 1460775, 1326820, 1270834, 1283680, 1332945, 1347463, 1463269, 1618160, 1530929, 1613456, 1645715, 1660942, 1635234, 1557551, 1487072, 1521212, 1627862, 1538992, 1461866, 1571225, 1650398, 1741465, 1776525, 1796570, 1861178, 1837611, 1805818, 1869939, 1926851, 1944534, 2020877, 1998900, 1805291, 1841096, 2019037, 2164255, 2155068, 1984508, 1947630, 1970122, 2085636, 2176550, 2184419, 2083749, 2209587, 2377734, 2215149, 2258510, 2282372, 2365867, 2460064, 2355162, 2430270, 2580637, 2652003, 2667499, 2690943, 2703817, 2836865, 2922828, 2918350, 2939396, 3088752, 3219095, 3193058]
7714C193058L2501J08824m4517K7475K16938R4040p6343J04187J04402J34344
7704C894909K70101N8425Q2893P6706K7340Q7956N0030R1613K17632Q9464J27337
7693E074406Q3933J51854J24994L6654J21250Q3324J95534J68246P999P0162J99734
7682F318090Q9500L05839R5474M6657J35271K16220J99738J19680M2889Q2204
7672G651562M2978K06816L93053J21045J18665M7887J52675J48070q697o5461
7662H808593K59126K64415Q8853K16530J46754Q0978L0637K4506L9304m0107J22044
7651A0041633K8746n3562j9358K16974k8739n4306O2514Q2780M803J038r1234
7640A0191289K5048j9417j09891k0430n8166k40496p2413N1836r2573r8500j2849
$$ y = [3193058, 3225559, 3334383, 3289866, 3317341, 3534279, 3628319, 3551976, 3656163, 3760565, 3894909, 4165010, 4223435, 4306328, 4383034, 4410374, 4498330, 4548360, 4639973, 4857605, 4947069, 5074406, 5158339, 5310193, 5435187, 5471841, 5593091, 5676415, 5871949, 6040195, 6048194, 6118356, 6318090, 6407590, 6713429, 6808903, 6855560, 6990831, 7207051, 7406789, 7526469, 7569358, 7651562, 7694540, 7901356, 8294409, 8415454, 8534119, 8582006, 8734681, 8882751, 8874054, 8808593, 9067719, 9332134, 9420987, 9637517, 9784271, 9865249, 9895886, 9920392, 9959696, 9919589, 10041633, 10070379, 10016817, 9997459, 10214433, 10185694, 10131388, 10193902, 10276682, 10281485, 10282523, 10191289, 10216337, 10196920, 10087029, 10066599, 10008433, 9767937, 9695524, 9747360, 9654787, 9556287, 9543438]
7629I543438l8111k06414n1656k2518k9644m6979j88979j05207K7592j92748j43324
7618H545450j68704J8479j40116k22917j08058J0015k08222j91412j59441k15817
7608G159257j40704j57897p5731j33044r1826j04720n8958l02812j19413l4303
7598E939849j66666k22238j1253J0831k06353j77210n8757k02396k9010L5271
7588D912068j45499p8801k03410k49041j69823r0161q0700L2395n0743k04652
7578C671633p6264M0066j50068m9752L8651j2789k97554l2260k5472j21843J10665
7567C095013q6066K1166K4400j63502j79553r9691j6422N1809o5228j02325P0877
7556B550478m8807M3805P3358J437j45040j5359j9313M4652L7154k5707P6870
$$ y = [9543438, 9505327, 9298913, 9247257, 9224739, 9195095, 9148116, 8959137, 8853930, 8881522, 8688774, 8545450, 8376746, 8395225, 8255109, 8032192, 7924134, 7934149, 7725927, 7534515, 7375074, 7159257, 7018553, 6860656, 6784925, 6651881, 6560055, 6455335, 6396377, 6093565, 5974152, 5939849, 5773183, 5550945, 5539692, 5550523, 5344170, 5166960, 5108203, 4905807, 4876797, 4912068, 4766569, 4687768, 4484358, 4235317, 4065494, 3975333, 3894633, 3927028, 3876285, 3671633, 3595369, 3635435, 3485367, 3435615, 3474266, 3461477, 3163923, 3131663, 3106191, 2984348, 3095013, 3008947, 3030113, 3054513, 2891011, 2711458, 2611767, 2595345, 2647154, 2581926, 2479601, 2550478, 2501671, 2545476, 2618834, 2620271, 2475231, 2459872, 2440559, 2485211, 2522365, 2496658, 2573528]
7545B573528p6651o9290o0391j49876j6211j40662j46139p7557p4711j37659N5798
7534A680179j15602R4011Q0043j37923J7440L9879P938j86243p5767O553M2566
7523A453074o8186k14521O9127O2251j33014j02512J4989P0505q4189J44060l6156
7512A175428O7896m1710q1389J1017L5548l6225n2269P4795Q756j02048j0821
7501A048978O6393n7749j25110O5895O667l3419r4181m3444J04430P2242J7262
7490A027964L9457J0834p688j50152k7308J9053r9609K5548k4363M1045m0424
7479H14357r947M4702k2498q427o1341K8664Q3688O3800N1324j6510k9675n86
7467I37551O7942j07498n1023N837q3835N8121P4353j01582J5439K253l5759l9951
$$ y = [2573528, 2496877, 2427587, 2367196, 2217320, 2201109, 2060447, 1914308, 1836751, 1762040, 1624381, 1680179, 1564577, 1658588, 1738631, 1600708, 1618148, 1658027, 1665965, 1479722, 1403955, 1410508, 1453074, 1384888, 1170367, 1239494, 1301745, 1168731, 1066219, 1081208, 1151713, 1067524, 1211584, 1175428, 1243324, 1201614, 1120225, 1131242, 1166790, 1130565, 1078296, 1153091, 1161847, 1059799, 1048978, 1115371, 1057622, 932512, 998407, 1005074, 971655, 877474, 834030, 938460, 1010702, 1027964, 1067421, 1078255, 1070567, 920415, 893107, 912160, 812551, 838099, 813736, 854781, 814357, 804410, 849112, 826614, 818187, 756846, 785510, 869198, 932998, 984322, 967812, 938137, 937551, 1005493, 897995, 846972, 852809, 768974, 827095, 901448, 799866, 815305, 817558, 781799, 741848]
7455G41848m2465K502J49278n8225j19097M0959J16626j16104M4798K0448q3285
7444F97283O7364n7611P4534J0822O3304m596j7060l3534j21982N727m4002j01116
7432E39133K10709M8232L1182j84135R825J31776j0493q9176o067J06850p4237
7421G13599j9201M1650j2507P2649M3422l7566m7400m3161J8551M2018J16088
7410H88142j8129j38396r725j4082K7712p641J25530o2901p6056O2514M6815p7035
7398G46748j00790R8101N3103L5505j21690l460j5524K4792J01061m7601l6898
7387G33347j23202o2415P9325R4970j13477K3093J10995N0032M8868j15366j06659
7376F19511j65160J32771K01745m4682n5717l393L2101r9337j9123J20284m3708
$$ y = [741848, 699383, 701885, 851163, 792938, 673841, 714800, 831426, 715322, 760120, 780568, 697283, 764647, 707036, 781570, 792392, 855696, 851100, 834040, 800506, 678524, 684251, 640249, 539133, 749842, 798074, 829256, 645121, 654946, 786722, 776229, 687053, 680986, 787836, 713599, 694398, 736048, 723541, 796190, 839612, 802046, 754646, 711485, 730036, 772054, 888142, 870013, 731617, 721892, 707810, 735522, 727881, 853411, 790510, 714454, 776968, 823783, 746748, 645958, 744059, 797162, 832667, 710977, 707517, 691993, 716785, 817846, 770245, 733347, 610145, 547730, 627055, 722025, 608548, 631641, 742636, 792668, 841536, 726170, 619511, 454351, 587122, 788867, 744185, 688468, 685075, 717176, 617839, 598716, 719000, 675292]
7365F75292M7745p0991N1178J38925n410K0920q5271j26218J22217k00971J5974
7354E83390J27373J1639l1357l9266J19731R8412j37791m0115J3887n1835M4489
7343F98557R1395j09991l8709J28444j2424m9740N2622j42395R9035j9378r5267
7332F02149l428P49J37119J63992P2219k8312r0261K2511K4990j40399j16420
7321F44909O1794N2122r8759J43501l8794j8521N4907j03281N7094m2386j23965
7310E88621J84144L0810m2580j13359M0647k6706Q361n0667n7202N0973J20658
7299G33700K9536K9844n0936l0197m2897N168k5789o8981n0023M2350L2505J25174
7287G29454N3813j4024Q0487p0463J0465O6916k4234m7935o6038l4964M2945R40
$$ y = [675292, 723037, 652046, 703224, 842149, 836739, 857659, 772388, 646170, 768387, 567416, 583390, 710763, 722402, 691045, 651779, 771510, 869922, 732131, 692016, 705903, 654068, 698557, 789952, 679961, 641252, 769696, 757272, 707532, 760154, 617759, 716794, 697416, 602149, 598721, 599470, 736589, 900581, 972800, 944488, 854227, 876738, 901728, 761329, 644909, 706703, 758825, 660066, 803567, 764773, 746252, 801159, 697878, 754972, 712586, 588621, 772765, 803575, 760995, 647636, 688283, 661577, 669938, 619271, 562069, 613042, 733700, 763236, 793080, 742144, 711947, 669050, 674218, 648429, 579448, 529425, 571775, 604280, 729454, 783267, 769243, 849730, 779267, 789732, 856648, 832414, 784479, 718441, 683477, 726422, 727362]
7275G27362n4290N0059r5920l6772O1508n7012Q6111l212j1274J28099q571l2590
7263G53498r67m6365O7781Q011k4095j15248K7089K14832J5735L7370p7170j24428
7251G36043Q7569p6031j0984p5211O4744Q1196j55214j12237J4530J21059J5662
7240F91126P1207l8400p9560O550J45593k7478j30613j7736o148O3635L42j0426
7228F68092K0891l2520P3185O8285j5129L123j0932N075p3752m0177l8491o3081
7216E64569k2833J35807Q7030n5095m4840o3420m0592P4768M7459N324m7727N4219
7204F94669P2813j8538l6303P9046m6217q0630J09704q4557p4087K7178j24994
7193E18084J16010J36844J4321l931r216J8070K2877N3470k1251j73348l518K14645
$$ y = [727362, 673072, 723131, 627211, 590439, 651947, 594935, 681046, 677834, 666560, 794659, 786088, 753498, 752531, 706166, 773947, 781958, 757863, 642615, 669704, 884536, 900271, 937641, 860471, 736043, 823612, 747581, 736597, 661386, 726130, 807326, 652112, 539875, 554405, 675464, 691126, 762333, 723933, 644373, 650923, 796516, 769038, 638425, 620689, 614541, 678176, 678518, 668092, 688983, 656463, 729648, 797933, 782804, 785927, 774995, 780070, 706318, 666141, 627650, 564569, 541736, 677543, 764573, 709478, 664638, 601218, 560626, 635394, 682853, 688177, 640450, 694669, 767482, 748944, 712641, 791687, 745470, 664840, 774544, 689987, 615900, 643078, 518084, 634094, 770938, 785259, 781328, 772112, 790182, 813059, 866529, 845278, 671930, 668412, 883057]
7181H83057J6163P769k2200j79902m6260k6805M0239o3279M5845J54258J5028
7170H23913j2697Q4705M9674j42721J0411j0073Q0365j19389J25274K1749r9625
7159H11586R3760r4572l5111q373P0725O96r1368k2488J69005k6950k4018J60100
7147A002992n3965q7673r7169k2056J4180N2933r5767j35302Q8666N5276k5414
7136F96701m0332O2344J22744j20566m4634J66721P524m8773N3698j84404L2121
7125G03144J41383K8960L6087K3965j08840l6202j20156M3047J74021r6132k4024
7114G65253N6229N6812K2422j56207J9924J22563n3729q8244j00326J54245J25815
7103I24757n010j69677r1238J02313J05600P7431p6142j9671R1721j14334n9623
$$ y = [883057, 899220, 906989, 884789, 704887, 658627, 631822, 672061, 608782, 654627, 808885, 823913, 811216, 895921, 945595, 802874, 813285, 803212, 883577, 764188, 889462, 911211, 811586, 905346, 810774, 775663, 767290, 838015, 838711, 747343, 724855, 893860, 866910, 842892, 1002992, 949027, 861354, 764185, 742129, 756309, 809242, 713475, 578173, 666839, 722115, 696701, 656369, 718713, 841457, 720891, 676257, 842978, 850502, 801729, 855427, 671023, 703144, 844527, 873487, 909574, 933539, 824699, 788497, 668341, 711388, 885409, 789277, 765253, 821482, 878294, 900716, 744509, 764433, 886996, 833267, 745023, 644697, 798942, 924757, 919747, 750070, 658832, 761145, 866745, 944176, 868034, 848363, 940084, 825750, 766127]
7092G66127o5894Q6421j4833N2792m9485J6892k1591P66m1941J8501J16781P0640
7080I35176r801j8986K7588j5044M8320M1673p0520j0529k7360j82748l8947Q1690
7068G60512p9088J95779M073j22898Q0112M715J31328N4197M8480j66638o0091
7057H50481J31933k3159j20266N3239k6100J7975R9427J2178o9205r7176l7964
7046G91363M4475R1209N3504r1015j39117M4886J4487L5678J94609o838J24835
7035A158076j30771n0215O2631m4642O9713j02768j41183o1297N0602n6448J51955
7024I05653r8082J5353J17443L970P6154j7609K9735j00211J4715J09352Q700
7013A065173o8564o5055k25537J22722j277p4298J05238J76219p1978o318M4994
$$ y = [766127, 700233, 786654, 771821, 824613, 775128, 792020, 770429, 771195, 729254, 747755, 864536, 935176, 925375, 906389, 933977, 918933, 967253, 1008926, 938406, 927877, 900517, 717769, 678822, 760512, 681424, 877203, 881276, 758378, 838490, 843205, 974533, 1028730, 1077210, 910572, 850481, 982414, 959255, 838989, 892228, 866128, 884103, 983530, 995708, 926503, 829327, 791363, 835838, 927047, 980551, 889536, 750419, 795305, 809792, 845470, 1040079, 1033241, 1158076, 1027305, 977090, 1039721, 995079, 1064792, 962024, 820841, 759544, 810146, 753698, 905653, 807571, 822924, 940367, 944337, 1020491, 1002882, 1032617, 932406, 947121, 1056473, 1065173, 996609, 931554, 706017, 828739, 827462, 753164, 858402, 1034621, 962643, 956325, 1001319]
7002A001319M9586K1725K746j37080j65442k3981J84314j22500j8585J59904j8413
6991I33593L2107R2536O821r9319P0476J2681M085K2647o2746r9803k331k6310
6979H84437J1089J05054j4332k5042k7005m1017Q9854L986J21298l3950j90036
6968H84336N8159K09898j24890o4669j54453N081O0627J0775j0960l442r6724
6957G73738R7458N7231o625p6614O5088J84826N0549p4164r8688q838M6810K8700
6945A039471j97N4211R0427l1783j65293j5460q5578P4663n4951j20372r1418
6934F93720R5697M2593M7055J9887j10062m6713J69898P2523r4550j11643Q8012
6923H66417O7602q0296J43933J2403J8727N2242M7924j56184l8042o9306r695
$$ y = [1001319, 1050905, 1072630, 1075376, 938296, 772854, 748873, 933187, 810687, 792102, 952006, 933593, 965700, 1058236, 1065057, 965738, 1036214, 1048895, 1052980, 1075627, 1012881, 913078, 910747, 884437, 895526, 1000580, 986248, 961206, 934201, 893184, 983038, 987024, 1108322, 1074372, 884336, 942495, 1152393, 1027503, 962834, 808381, 813462, 874089, 884864, 873904, 870462, 773738, 871196, 928427, 921802, 845188, 910276, 1095102, 1145651, 1071487, 972799, 963961, 1010771, 1039471, 1039274, 1093485, 1183912, 1152129, 986836, 971376, 885798, 960461, 905510, 785138, 693720, 789417, 832010, 879065, 898952, 788890, 742177, 912075, 984598, 890048, 778405, 866417, 934019, 853723, 997656, 1010059, 1028786, 1081028, 1128952, 972768, 934726, 865420, 855725]
6912H55725J00270m8082J67034N4089q3316j44406l1057O6260j12338K9156J23867
6901I77202J17371j43761l2970J54879O2405j39393r3199M438J45385P2824o1142
6890A064039K2053J0067o2238q4656p9795M7711O9063R4641N9644J2851P9965
6879A233345n34j25045o2676Q2491N0111O4797o718r0045o3195l8793J03639M0877
6867A188254n0675R394j00026J0470O7826m3451n3550J3639l1682J36529J11971
6856A258699Q776j32681j25291J08012K9693j52069J2322J406P5147J20148J00738
6845A304900L7665k7090k591j62431P0916J23444k0173o2146n3632o5092K0638
6834A164408m7728P530J4870N4815P0660L725M7749j23739J80145p5623j55011
$$ y = [855725, 955995, 907913, 1074947, 1129036, 1045720, 901314, 870257, 936517, 824179, 853335, 977202, 1094573, 950812, 917842, 1072721, 1135126, 995733, 902534, 906972, 1052357, 1125181, 1064039, 1086092, 1096159, 1033921, 949265, 869470, 917181, 986244, 1080885, 1140529, 1153380, 1233345, 1232811, 1107766, 1045090, 1127581, 1177692, 1242489, 1235771, 1145726, 1082531, 1043738, 1147377, 1188254, 1137579, 1146973, 1046947, 1057417, 1125243, 1081792, 1028242, 1041881, 1010199, 1146728, 1258699, 1267475, 1134794, 1009503, 1117515, 1147208, 995139, 1007461, 1008867, 1084014, 1204162, 1304900, 1342565, 1315475, 1312884, 1150453, 1221369, 1344813, 1324640, 1262494, 1208862, 1143770, 1164408, 1116680, 1124210, 1139080, 1193895, 1264555, 1268280, 1316029, 1192290, 1372435, 1296812, 1141801]
6823A141801j04036P2154L2618O0776J86531J9204k22955l4269N1098K9463l7829
6812A194556p1396R28m8130P9444N3516l0428k351n2173R6418n2833l2441N0682
6800A185792n3017m4769K35091n3327j94487M5901o1617q0893K19194m6511j02440
6789A048917P8764N6140M7195q1296K0987l5368J13944K3230O8640j04145n9146
6778A177862P9877M8061L8955K7503o4750m7565l7520k1359m7859j0868J02923
6767A245260J39951o9960N1598j44788j0014J28940o8886R6867R2960o2814k6164
6756A372950n0607k3972J0057J0122P9267K1663j64530j15929R9284P1566r0468
6745A219403J51270P2369K6627j9428n6904j24669J41616J16851j60904q5728
$$ y = [1141801, 1037765, 1109919, 1142537, 1203313, 1389844, 1409048, 1186093, 1151824, 1202922, 1232385, 1194556, 1123160, 1124088, 1075958, 1155402, 1208918, 1178490, 1176139, 1123966, 1220384, 1167551, 1135110, 1185792, 1132775, 1088006, 1323097, 1269770, 1075283, 1121184, 1059567, 978674, 1197868, 1151357, 1048917, 1127681, 1183821, 1231016, 1149720, 1170707, 1135339, 1249283, 1272513, 1341153, 1237008, 1177862, 1257739, 1305800, 1344755, 1372258, 1307508, 1259943, 1222423, 1201064, 1153205, 1142337, 1245260, 1385211, 1315251, 1366849, 1222061, 1212047, 1340987, 1272101, 1368968, 1461928, 1399114, 1372950, 1322343, 1298371, 1308428, 1318550, 1397817, 1419480, 1254950, 1139021, 1238305, 1309871, 1219403, 1370673, 1443042, 1469669, 1450241, 1393337, 1268668, 1410284, 1527135, 1366231, 1280503]
6735A280503K4573N7636J10196j62069l3741M8552j6704M8658m091j69o7312J42671
6723A428703j3801p1835J41732M4732n7286j58076m2877k4158R1221L793j40865
6712A201283J75617R1416j65924P2301J7310l3750K2943J45480N9513k21525L8569
6701A403233q3702J6822J5295m6593R0238L2601j8958P5755R1308p5294m1500
6690A459205o6655l978n2835m5812J53474O8314m2939J1887O5950j6984o3085
6679A466542j40568J06348k6225J07936l3714O2051k9088j796J03015l19j524
6668A612658M0012j17118K7916m1185J28481M8270q2734l6700J15851L5164r6874
6657A633741N7694q1554j9767O0869j7969K4314J3102p7785J95092l7380j08736
$$ y = [1280503, 1305076, 1362712, 1472908, 1310839, 1277098, 1325650, 1308946, 1357604, 1353513, 1353344, 1286032, 1428703, 1414902, 1343067, 1484799, 1529531, 1472245, 1314169, 1271292, 1247134, 1338355, 1342148, 1201283, 1376900, 1468316, 1302392, 1374693, 1392003, 1358253, 1381196, 1526676, 1586189, 1364664, 1403233, 1319531, 1336353, 1351648, 1305055, 1395293, 1427894, 1408936, 1484691, 1575999, 1500705, 1459205, 1392550, 1388572, 1335737, 1289925, 1443399, 1511713, 1468774, 1480661, 1546611, 1529627, 1466542, 1325974, 1432322, 1406097, 1514033, 1480319, 1542370, 1513282, 1511486, 1614501, 1614182, 1612658, 1652670, 1535552, 1563468, 1522283, 1650764, 1699034, 1616300, 1579600, 1695451, 1730615, 1633741, 1691435, 1609881, 1590114, 1650983, 1633014, 1657328, 1670430, 1592645, 1787737, 1750357, 1641621]
6646A641621j6354o3426O4706J32666J09779l8718p4209n3376J06466L9210P7725
6635A926090l2626q8600J0272m3957n4313j8959J4543Q1731R79L3617N4477j1222
6623A872032J22314J54895j00480j16341O2581L4619P50l8764j00939J8693J21759
6612B031119j53112J03587j18662Q4802P0194j21399j47254J52055N2304j20025
6602A833609O3074J56731N6121r1917J6624P9159L5172J26395Q812j94734l3237
6591B055809J11815j4731o5944p698J12928Q2922r8746P5813M9878M2338J0224
6580B354608o41l2316p656J26175K0325m5896r941q1975k0087J36407L4830j0106
6568B463727p7242L5146M5370J10057q775m4135R0712j4854L9431k15j45945r7268
$$ y = [1641621, 1625267, 1561841, 1626547, 1759213, 1868992, 1830274, 1756065, 1702689, 1809155, 1848365, 1926090, 1893464, 1804864, 1815136, 1771179, 1716866, 1697907, 1712450, 1794181, 1795160, 1828777, 1883254, 1872032, 1994346, 2149241, 2048761, 1932420, 1995001, 2029620, 2030370, 1991606, 1890667, 1909360, 2031119, 1878007, 1981594, 1862932, 1947734, 2017928, 1896529, 1749275, 1901330, 1953634, 1833609, 1896683, 2053414, 2109535, 2017618, 2034242, 2113401, 2148573, 2274968, 2283780, 2089046, 2055809, 2167624, 2152893, 2086949, 2079251, 2192179, 2275101, 2176355, 2252168, 2302046, 2344384, 2354608, 2353967, 2321651, 2313995, 2440170, 2460495, 2414599, 2404658, 2322683, 2302596, 2439003, 2473833, 2463727, 2386485, 2421631, 2467001, 2577058, 2568283, 2524148, 2614860, 2600006, 2639437, 2639222, 2493277, 2396009]
6556B396009J32521O6846k4510O18R0293J48933m9510P5644L2613K4249R5079
6545B988785l9987r477M6373n6810Q2616J23611n2646k6314J12217K4652j248
6534C191772l7248N5718J41484l5806m0281Q9285O2900j2805J8265J45702p3359
6523C505627j05546K44112J16793Q4985o0445j10314J32276m2387K6469J06911
6513C898481l347J18606J2436P717K7287P8625J89777O5901j29745J61138O3458
6502D490334p8584J58213K00996R6369r046n2415p368q3792J39169K01109m3620
6491E011365r4295K03259P3407K6117L1580K6176J54542N2993J90780O9553L6451
6480E781928J28316N0730q8447J10615k3221M3996J09579j12702J47451J25316
$$ y = [2396009, 2528530, 2595376, 2570866, 2571484, 2661777, 2810710, 2761200, 2836844, 2869457, 2893706, 2988785, 2948798, 2939321, 2985694, 2928884, 3011500, 3135111, 3082465, 3056151, 3168368, 3193020, 3191772, 3154524, 3210242, 3351726, 3315920, 3275639, 3364924, 3427824, 3415019, 3433284, 3578986, 3505627, 3400081, 3644193, 3760986, 3845971, 3785526, 3675212, 3807488, 3765101, 3791570, 3898481, 3895134, 4013740, 4026176, 4033893, 4061180, 4139805, 4329582, 4395483, 4265738, 4426876, 4490334, 4411750, 4569963, 4770959, 4867328, 4858282, 4805867, 4798499, 4714707, 4853876, 5054985, 5011365, 4917070, 5120329, 5193736, 5219853, 5251433, 5277609, 5432151, 5485144, 5675924, 5745477, 5781928, 5910244, 5960974, 5872527, 5983142, 5959921, 6003917, 6113496, 6000794, 6148245, 6273561]
6470F273561J82881L7783l3893N4129J33545J00n4858R1588J32170N3780M8766
6459F919552J31018P3742P3846m0939O7265O2912m1570N1174J21415J18344j01567
6448G435192K2510L9770j3528P6986J95803n1659P6894q340Q0432J02682K5459
6437G982201J55902P3439l4020P2488N3025m2364J9794J57334K10982J4391J09065
6426H772237k8240K502J28084j825J11803J596o0940J40564R5794K5619R5027
6415I282221N8666L2526j2529M1229R4837J63968j06212p2984Q1023J39194K89223
6404I991162j210o1652L749O3277j64457N4908L4500R3167n495Q5520Q397o5561
6392A0036305j8504J22191m3504j52100o5321N9614Q1958n0344j27016j0257j77510
$$ y = [6273561, 6456442, 6494225, 6460332, 6514461, 6648006, 6648106, 6593248, 6684836, 6817006, 6870786, 6919552, 7050570, 7124312, 7198158, 7157219, 7224484, 7287396, 7245826, 7297000, 7418415, 7536759, 7435192, 7457702, 7497472, 7483944, 7560930, 7756733, 7705074, 7781968, 7773628, 7854060, 7956742, 7982201, 8138103, 8211542, 8177522, 8250010, 8303035, 8260671, 8280465, 8437799, 8648781, 8663172, 8772237, 8743997, 8746499, 8874583, 8872758, 8984561, 8986157, 8925217, 9065781, 9161575, 9187194, 9282221, 9340887, 9373413, 9360884, 9402113, 9496950, 9660918, 9554706, 9481722, 9562745, 9701939, 9991162, 9989952, 9928300, 9932049, 9995326, 9830869, 9885777, 9920277, 10013444, 10007949, 10093469, 10101866, 10036305, 10017801, 10139992, 10096488, 9944388, 9879067, 9938681, 10020639, 9970295, 9843279, 9833022, 9655512]
6381I655512k0296j5467q6984J4733j29537j19441q2707o9789j2860k54992m5255
6370H832917l1953m0730o2489r0919L7521j06263o2941k66349j49382j5164m2635
6359H001613o3282J00833o7504k6650j81132j50194o0213j7638P0476n2020J3691
6348G567980q9253r9758l6040n6836o2414p8564j18412l5900K6949N1123M6000
6337G114875l3232j5521n0441j14281j2167k9748J5212O0255o5192j46380r2671
6326F630709M2361L1352q3950P2385k589j15030R212m1830L3175J90443L607j35556
6314F634289J95976q6332Q4879j83283M266N3595L5988N103Q2194J65010L104
6303F994789j08612j70133K36937j8766m5653M7383j8997J394J05341K1354J88762
$$ y = [9655512, 9635216, 9619749, 9532765, 9547498, 9417961, 9298520, 9215813, 9146024, 9133164, 8878172, 8832917, 8800964, 8760234, 8697745, 8606826, 8644347, 8538084, 8475143, 8208794, 8059412, 8044248, 8001613, 7938331, 8039164, 7971660, 7945010, 7763878, 7613684, 7553471, 7535833, 7606309, 7554289, 7567980, 7478727, 7378969, 7342929, 7286093, 7223679, 7145115, 7026703, 6990803, 7017752, 7068875, 7114875, 7081643, 7066122, 7015681, 6901400, 6889233, 6859485, 6874697, 6934952, 6869760, 6723380, 6630709, 6673070, 6704422, 6620472, 6692857, 6690268, 6575238, 6584450, 6542620, 6575795, 6766238, 6769845, 6634289, 6830265, 6743933, 6828812, 6645529, 6649795, 6703390, 6739378, 6744481, 6826675, 6991685, 6994789, 6886177, 6716044, 6952981, 6934215, 6888562, 6935945, 6916948, 6918342, 7023683, 7045037, 7233799]
6292G233799j11204J10579J1552j0617Q3872J76786J28065L174j00313N850R9600
6281G631143J04655J07663O1842J86075Q6384O5519r6499L23000J58514P520j3141
6270H622675J53706J12839K07638J10664M0887R2523J23765R2534R6042J40388
6260I793661J52299K48597J13009J96901J36135J18614K51639K18849K66448O7412
6250A1563564O2525Q6407K88569K84600J72317K98076J44339J05863K66538J90890
6240A3463688J01262Q9512J47138J18353J99319J61044R6698J30980n1993J06197
6230A4562198L6130o41n2785J75473n753J10990P0226l07766j463J40121k8321
6219A4698409m5628K2181O0164k1604j64473J23006R9486J10587N3411j5300l822
$$ y = [7233799, 7122595, 7233174, 7244726, 7234109, 7317981, 7494767, 7622832, 7626006, 7525693, 7531543, 7631143, 7735798, 7843461, 7905303, 8091378, 8177762, 8243281, 8146782, 8469782, 8628296, 8635816, 8622675, 8776381, 8889220, 9096858, 9207522, 9248409, 9340932, 9464697, 9557231, 9653273, 9793661, 9945960, 10194557, 10307566, 10504467, 10640602, 10759216, 11010855, 11229704, 11496152, 11563564, 11626089, 11712496, 12001065, 12285665, 12457982, 12756058, 12900397, 13006260, 13272798, 13463688, 13564950, 13654462, 13801600, 13919953, 14119272, 14280316, 14377014, 14507994, 14456001, 14562198, 14598328, 14597687, 14544902, 14720375, 14714622, 14825612, 14895838, 14588072, 14586609, 14726730, 14698409, 14652781, 14674962, 14735126, 14713522, 14549049, 14672055, 14771541, 14882128, 14935539, 14920239, 14916417]
6208A4916417J92335P9850O3428J44169J95156K15830J57705K71689J29002K11464
6198A6577045J16547J82277J51905J63685L56825L17455K40035K29483K16192
6189A8551449J59426J88916K82860L91119K90808K45967K50452J82177K93743
6180B0836917L07668J13774L4250J50422L5883J57124J58467N2754m2206J25452
6170B1930505j08805l5951o3371p5321N1260m6940k21032k00545k05367j51746
6160B0872687j47949k70840j47283j89645j39739k15797j82903j44638j93070
6151A9240823k24579j39018k4027j06433j79506j95915j6254j45979k07142p3287
6141A7928683m0690n8659l0875j7072k41728k2106J59545j29511K86J37189o4786
$$ y = [14916417, 15108752, 15188602, 15252030, 15396199, 15591355, 15807185, 15964890, 16236579, 16365581, 16577045, 16693592, 16875869, 17027774, 17191459, 17548284, 17865739, 18105774, 18335257, 18551449, 18710875, 18899791, 19182651, 19573770, 19864578, 20110545, 20360997, 20543174, 20836917, 21144585, 21258359, 21292609, 21443031, 21478914, 21636038, 21794505, 21847259, 21805053, 21930505, 21821700, 21785749, 21722378, 21647057, 21698317, 21651377, 21430345, 21229800, 21024433, 20872687, 20724738, 20453898, 20306615, 20116970, 19977231, 19761434, 19578531, 19433893, 19240823, 19016244, 18877226, 18853199, 18746766, 18567260, 18371345, 18355091, 18209112, 18001970, 17928683, 17887993, 17829334, 17798459, 17781387, 17539659, 17517553, 17677098, 17547587, 17547873, 17685062, 17620276]
6130A7620276o4787O3350K6640m8k0148P3592O732K1708L0742R8851M9167J4739
6118A7920814j5635M0494Q3220J9671j6583O8624M8512L5134P2373j62840Q659
6107A8102443k7153R2237o4273J1667k1549r6639j9295O9574J4116J27943k4685
6096A8164386J12013j46426n112j19365j05504r0419j73293q759N0371P5394J1442
6085A7764728j12566o7926p716k26671L4854l2786j13273j61780n8165J32191
6075A7150890q4246j67383K7176o7409m1938j31976j07156j22283l361L7426l8129
6064A6451611l5358k13667j5634Q1660k220m1287J7785j6548o3240O7027q6330
6053A6143799O2279J25787M874N9912j8040k11152k2976k2257L8995Q9723j0849
$$ y = [17620276, 17555489, 17618839, 17645479, 17645431, 17625283, 17698875, 17705607, 17727315, 17758057, 17856908, 17906075, 17920814, 17905179, 17945673, 18028893, 18048564, 18031981, 18100605, 18149117, 18184251, 18256624, 18093784, 18102443, 18075290, 18167527, 18103254, 18114921, 18093372, 17996733, 17977438, 18047012, 18061128, 18189071, 18164386, 18276399, 18129973, 18124861, 18005496, 17899992, 17809573, 17636280, 17627521, 17677892, 17753286, 17764728, 17652162, 17584236, 17576520, 17349849, 17384703, 17351917, 17238644, 17076864, 17018699, 17150890, 17066644, 16899261, 16926437, 16859028, 16817090, 16685114, 16577958, 16455675, 16452314, 16489740, 16451611, 16416253, 16202586, 16186952, 16268612, 16266392, 16225105, 16242890, 16226342, 16163102, 16230129, 16143799, 16206078, 16331865, 16336739, 16396651, 16378611, 16167459, 16144483, 16122226, 16161221, 16250944, 16240095]
6042A6240095L5298k5533k7563j807j9159l9737r9108j19199k0610j42460j26769
6031A5653448k57926k27983L3900j91572j67585k32757l70374k63377k42720k98223
6021A3434831k69912k87818j98426l56331k93623k1312j92169l36673n8990P755
6011A1427332k30577r1601j64495o1759j02153n9818J2351j10091j19707J11807
6001A0611289m1987j04731J09955l8977q1271j52036J50476r0287k7695M1156
5991A0375892J63947q2371j16064r7304j52233k2512j43562m2916K0352k8699
5981I874530J75456R0449R9963J07793M352L1685r947n5269j11290m22j27676
5970A0079624j27845k9380l7372k73893L873p7826j03066j61686k04155k40704
$$ y = [16240095, 16275393, 16249860, 16222297, 16220490, 16201331, 16161594, 16062486, 15943287, 15922677, 15780217, 15653448, 15395522, 15167539, 15201439, 15009867, 14842282, 14609525, 14239151, 13975774, 13733054, 13434831, 13164919, 12877101, 12678675, 12322344, 12028721, 12007409, 11815240, 11478567, 11419577, 11427332, 11196755, 11105154, 10940659, 10878900, 10776747, 10716929, 10729280, 10619189, 10499482, 10611289, 10569302, 10464571, 10574526, 10535549, 10454278, 10302242, 10452718, 10362431, 10334736, 10375892, 10539839, 10457468, 10341404, 10244100, 10091867, 10069355, 9925793, 9882877, 9903229, 9874530, 10049986, 10140435, 10240398, 10348191, 10352543, 10384228, 10374281, 10319012, 10207722, 10207300, 10079624, 9951779, 9922399, 9885027, 9611134, 9615007, 9537181, 9434115, 9272429, 9068274, 8827570]
5960H827570l84064q3025k1915j61265p0386k21216j11468r5425K2803j31764
5950G569845j258n5346q1318p3718r348L8323N0727K0845j20369K1925j27644
5939G232664J3043Q4262n9946o7819j31858P7653p4274l15070l5778K2429k46899
5928F498407j61553r1384j18556p7298q5351o0990j59528n7612j40771L6038q7275
5917E494127O749j06923k02105j19541R649r7236j90642j8168R0181k7454j22090
5906D716547n629k9371Q381j40540P4112J8572k48038n8704M3241j6506M3257
5895D405322J8680n013J38155m3788j01254j44624k5688L4090Q5955j44658n0498
5884D166679J9126J0154J07896p1281L0896O8442r759n5534l4175n1057P7640
$$ y = [8827570, 8443506, 8360481, 8338566, 8177301, 8106915, 7885699, 7774231, 7678806, 7701609, 7569845, 7568587, 7513241, 7431923, 7358205, 7348857, 7387180, 7437907, 7458752, 7338383, 7360308, 7232664, 7245707, 7329969, 7270023, 7202204, 7070346, 7147999, 7073725, 6758655, 6722877, 6745306, 6498407, 6336854, 6245470, 6126914, 6049616, 5964265, 5903275, 5743747, 5686135, 5545364, 5581402, 5494127, 5500876, 5393953, 5191848, 5072307, 5081956, 4984720, 4794078, 4775910, 4866091, 4838637, 4716547, 4710918, 4681547, 4689928, 4549388, 4623500, 4642072, 4394034, 4335330, 4378571, 4362065, 4405322, 4424002, 4418989, 4557144, 4513356, 4412102, 4267478, 4241790, 4275880, 4361835, 4217177, 4166679, 4185805, 4195959, 4303855, 4232574, 4263470, 4331912, 4322153, 4266619, 4232444, 4181387, 4259027]
5873D259027J52380j9353l1584r3381P3425j19206R1357J0395j97683J58224J37076
5862D420677O985j1886m5434M2711J083l9070j7238P7216k877q2501n3941Q3658
5850D379383K4285J04560Q3723J05429m9703j67067J30482J6051n2277j748J84462
5839D757580j86056m386O1936M5099q8545K7392r9342L2960J29047O1125o6176
5828D670634Q528K3157J0937N4926N5339k8389M3730N3077N8749P3708j2104L2241
5816E044533R9051k7869j1138k3424K2518n2795P68J99996j0157J48016L5968
5805E425467l4536K3306K7622o957J01201K2638K2761o7396M4321J53557J4371
5794E726355l3292o8300P085J04372J9551J5460Q5356N6211L5826K2402O5428
$$ y = [4259027, 4411407, 4392054, 4360470, 4267089, 4340514, 4221308, 4312665, 4323060, 4125377, 4283601, 4420677, 4427662, 4415776, 4370342, 4413053, 4414136, 4375066, 4357828, 4435044, 4432167, 4349666, 4295725, 4379383, 4403668, 4508228, 4591951, 4697380, 4647677, 4480610, 4611092, 4627143, 4574866, 4573118, 4757580, 4571524, 4567138, 4629074, 4674173, 4585628, 4613020, 4513678, 4546638, 4675685, 4736810, 4670634, 4679162, 4702319, 4713256, 4768182, 4823521, 4795132, 4838862, 4891939, 4950688, 5024396, 5012292, 5044533, 5143584, 5115715, 5104577, 5081153, 5103671, 5050876, 5051644, 5251640, 5241483, 5389499, 5425467, 5390931, 5414237, 5441859, 5434902, 5536103, 5558741, 5581502, 5514106, 5558427, 5711984, 5726355, 5693063, 5624763, 5631848, 5736220, 5755771, 5771231, 5856587, 5912798, 5948624, 5971026, 6036454]
5783F036454L4873J7413P7478o3115J50542J44835O4381J08730q8064J41558J2021
5772F637106K0515J56685N6207N7794k207P2564L3274O8516M5531L7198Q3903
5761G267086P2215J36029O7226J93892Q6483J19874l7282p2025J4101J36914R4820
5750H079333L2672R339Q9550J55707M0220J21392N2429J02296Q3797J59010M8911
5739H974656P496K52297J91028p1698R7093l9536l4727J03140J55601Q6768J73884
5728I896002J87104M2549J66964J54992P0770P9619K7507J3647J02216K7646J00282
5717A0869298J17077J0615J85449J29788J39476J9657J16708Q0913J13601J51131
5707A1933713n2367J17948R0424K42419J4694Q4727N4854m0318J38611K09290
$$ y = [6036454, 6071327, 6088740, 6166218, 6103103, 6253645, 6398480, 6462861, 6571591, 6483527, 6625085, 6637106, 6657621, 6814306, 6870513, 6928307, 6926100, 6998664, 7031938, 7100454, 7145985, 7183183, 7267086, 7339301, 7475330, 7542556, 7736448, 7822931, 7942805, 7905523, 7833498, 7847599, 7984513, 8079333, 8112005, 8121344, 8210894, 8366601, 8406821, 8528213, 8580642, 8682938, 8766735, 8925745, 8974656, 8982152, 9234449, 9425477, 9353779, 9450872, 9411336, 9376609, 9479749, 9635350, 9722118, 9896002, 10083106, 10125655, 10292619, 10447611, 10518381, 10598000, 10625507, 10639154, 10741370, 10769016, 10869298, 10986375, 10996990, 11182439, 11312227, 11451703, 11471360, 11588068, 11668981, 11782582, 11933713, 11881346, 11999294, 12089718, 12332137, 12346831, 12431558, 12486412, 12446094, 12584705, 12793995]
5697A2793995J59430M7780k5384J03541K43333J56880M9621P3693J75150j30626
5687A3647413L38465J06805Q4924J43782K4820J19800j7444P7406K2058R4497
5677A4642526J42368Q0978q1767J38770J76808L1582j6356N1389J20225M9801
5667A5336324Q7063J05769N839Q9184P1699J08691J43805m2285J07463K6558k0539
5656A6019571J6967N4246Q8887K9498k8092J24182l46l8822K1159J56381L1811
5645A6475442j2989l2696K2353m2331M7890R7248L0283Q0435K5617R0977o3619
5634A6718610R335K5603J09974J4745o3908N514Q5070K4448J3197J30139j8730
5623A7053997o4717N7171J28144K8639q7222J18127L5903L1791m4081K21496m0532
$$ y = [12793995, 12953425, 13001205, 12975821, 13079362, 13322695, 13479575, 13529196, 13602889, 13778039, 13647413, 13985878, 14092683, 14177607, 14321389, 14346209, 14466009, 14448565, 14525971, 14548029, 14642526, 14784894, 14865872, 14784105, 14922875, 15099683, 15131265, 15114909, 15166298, 15286523, 15336324, 15423387, 15529156, 15534995, 15624179, 15695878, 15804569, 15948374, 15906089, 16013552, 16040110, 16019571, 16036538, 16090784, 16179671, 16209169, 16181077, 16305259, 16304913, 16266091, 16287250, 16443631, 16475442, 16462453, 16429757, 16452110, 16409779, 16457669, 16554917, 16585200, 16665635, 16691252, 16782229, 16718610, 16727945, 16753548, 16863522, 16878267, 16814359, 16819873, 16904943, 16929391, 16942588, 17072727, 17053997, 16989280, 17046451, 17174595, 17203234, 17116012, 17234139, 17270042, 17301833, 17257752, 17479248, 17438716]
5612A7438716J51232K01991L5151Q691J36474R4219N1052j4831p8044J97925J33830
5601A8356406J26053R1858P2125K61802R799J32600J58735P6578K13298Q6014
5591A9585268J88655J79348J34853L16676K03392J51537L29081J07566K96245
5582B1492621K6542J59714N34644J33719O7584K43590K22858K24580K96193K66701
5572B3668746J54342K58172J61334K76711K84236L70709L80329J65839K28191
5563B5948609L53264L47746K16547L37309M43246L95681M23751M58568M60120
5554B9384841L89283K33192K63410N53325M72639N05720M29359M44786M89767
5545C3166322L35620M43265N12265P04186N64226N53736N74941O41884O41752
$$ y = [17438716, 17589948, 17791939, 17827090, 17835781, 17972255, 18066474, 18117526, 18102695, 18024651, 18222576, 18356406, 18482459, 18574317, 18646442, 18908244, 18918043, 19050643, 19209378, 19285956, 19499254, 19585268, 19773923, 19953271, 20088124, 20404800, 20608192, 20759729, 21088810, 21196376, 21492621, 21519163, 21678877, 22213521, 22347240, 22414824, 22658414, 22881272, 23105852, 23402045, 23668746, 23823088, 24081260, 24242594, 24519305, 24803541, 25174250, 25554579, 25720418, 25948609, 26301873, 26649619, 26866166, 27203475, 27646721, 28042402, 28466153, 28924721, 29384841, 29774124, 30007316, 30270726, 30824051, 31296690, 31802410, 32231769, 32676555, 33166322, 33501942, 33945207, 34457472, 35161658, 35725884, 36279620, 36854561, 37496445, 38138197]
5536C8138197O28444N55303M83735N77522Q39866P35120Q03347Q29715P62249
5527D4353498P59773Q87247R09935R85113R33373R92358J063414R73355J150344
5518E3008410J109411J073665J381611J457723J289469J310280J332710J493706
5510F3456985J609447J565047J579753J712211J680095K121376J962200J969936
5502G7657050K061378K098099K253103K510616K611291K555953K693251K858924
5494I7299665L161075L204797L253516L590252L698563M029744M159133M318818
5486A26715563M618161M862727N057943N461360N801659N940990O266823O778127
5478A71503353P045084P291938P729360Q135002Q865491R242433R508015J0348363
$$ y = [38138197, 38766641, 39321944, 39805679, 40383201, 41223067, 41958187, 42761534, 43591249, 44353498, 45113271, 46000518, 46910453, 47895566, 48828939, 49821297, 50884711, 51858066, 53008410, 54117821, 55191486, 56573097, 58030820, 59320289, 60630569, 61963279, 63456985, 65066432, 66631479, 68211232, 69923443, 71603538, 73724914, 75687114, 77657050, 79718428, 81816527, 84069630, 86580246, 89191537, 91747490, 94440741, 97299665, 100460740, 103665537, 106919053, 110509305, 114207868, 118237612, 122396745, 126715563, 131333724, 136196451, 141254394, 146715754, 152517413, 158458403, 164725226, 171503353, 178548437, 185840375, 193569735, 201704737, 210570228, 219812661, 229320676, 239669039]
5470B39669039J0796175J1171563J1904500J2339105J2967173J3287791J3559085
5463C25694431J3602452J3440601J3080831J2291793J1298074R733702P933894
5456D07075778N750517L207451M70414j951369m746601p199527r709655j1971575
5448C80925433j3597840j4823563j5925598j6405792j6600977j6477326j5979505
5441B71114832j5280673j4673992j3811393j2982786j2167161j1179655j0305016
5434A80714156r582721r076944q122564p680259p071089o748549o259683n559709
5426A20612638n305059n101692m712473m338961l963199l949683l696007l417865
5418H6127699l333772l161478k785571k746032k528635k484611k270764k125671
$$ y = [239669039, 250465214, 261636777, 273541277, 285880382, 298847555, 312135346, 325694431, 339296883, 352737484, 365818315, 378110108, 389408182, 399141884, 407075778, 412826295, 416033746, 416504160, 414552791, 409806190, 402606663, 392897008, 380925433, 367327593, 352504030, 336578432, 320172640, 303571663, 287094337, 271114832, 255834159, 241160167, 227348774, 214365988, 202198827, 191019172, 180714156, 171131435, 162054491, 153931927, 146251668, 139180579, 132432030, 126172347, 120612638, 115307579, 110205887, 105493414, 101154453, 97191254, 93241571, 89545564, 86127699, 82793927, 79632449, 76846878, 74100846, 71572211, 69087600, 66816836, 64691165]
5410F4691165k173605k118115j877111j668530j645164j758751j651008j625498
5402E0173383j376928j460727j439474j360514j121214j189868j207833j019492
5394C9997333j069873q33113j092650q76548r07649p55252p93900r06111q82387
5385C1879850o19228n82442p21569m83541o92822n91458n86633m90547o05045
5376B6506565m70886m85254o09241k76101l86160n51747n48830m18803m88605
5367B2270938m45594k77615l65209k11704l89567m64774l42428m26504k74743
5358A9072800k56327l19948l43799k74255k35856k24241k76878k20636k67692
5349A6653168k76014j09044j62789j85959j07165l51473k43766K1038p0460j26140
$$ y = [64691165, 62517560, 60399445, 58522334, 56853804, 55208640, 53449889, 51798881, 50173383, 48796455, 47335728, 45896254, 44535740, 43414526, 42224658, 41016825, 39997333, 38927460, 38094347, 37001697, 36125149, 35217500, 34462248, 33668348, 32762237, 31879850, 31260622, 30678180, 29956611, 29473070, 28780248, 28188790, 27602157, 27111610, 26506565, 26035679, 25550425, 24941184, 24665083, 24278923, 23727176, 23178346, 22759543, 22270938, 21825344, 21547729, 21182520, 20970816, 20581249, 20116475, 19774047, 19347543, 19072800, 18816473, 18496525, 18152726, 17878471, 17642615, 17418374, 17141496, 16920860, 16653168, 16377154, 16268110, 16105321, 15919362, 15812197, 15460724, 15216958, 15237996, 15167536, 15041396]
5339A5041396k91389j45149q9822k79187q4574o5922j78566j10170k2410j79067
5329A3595140j18040N6359J4514j41746m6970k5790q4893j3521j31175m1122K1236
5318A3083992N6246J06054r3164j2578o956m8218M1162K7767l206j7568J3180
5307A3146711n5447L1830L497o1603K4521m7413J96136J75675l7830J9628l8994
5296A3356711J6046J3110q2822j19029J74201J75485q2700K26346K9019J44985
5286A3851352O2304p1781J93389K39056J7071M3759J36819J23154J14249J39045
5276A4848417K6264J22750J90246L8621K59712O4177P0194K22590L03933K76953
5266A6423857J10471J05063J61780K50962K64138R3696L39928L30385j1586K47290
$$ y = [15041396, 14750007, 14604858, 14515036, 14235849, 14151275, 14085353, 13906787, 13796617, 13774207, 13595140, 13477100, 13533459, 13547973, 13406227, 13359257, 13333467, 13248574, 13235053, 13103878, 13062756, 13083992, 13140238, 13246292, 13153128, 13140550, 13133594, 13085376, 13126538, 13154305, 13151099, 13133531, 13146711, 13091264, 13123094, 13126591, 13064988, 13089509, 13042096, 13238232, 13413907, 13376077, 13395705, 13356711, 13372757, 13385867, 13303045, 13184016, 13358217, 13533702, 13451002, 13677348, 13706367, 13851352, 13913656, 13841875, 14035264, 14274320, 14291391, 14335150, 14471969, 14595123, 14709372, 14848417, 14874681, 14997431, 15187677, 15226298, 15486010, 15550187, 15620381, 15842971, 16146904, 16423857, 16534328, 16639391, 16801171, 17052133, 17316271, 17409967, 17749895, 18080280, 18068694, 18315984]
5256A8315984J63943J88495J80394L86017K54874J32006L31321K45628K59481
5247B0458143J39585L16624L49547J85213J91865K88685J55812K45095L36798
5238B2667367J89556M9998J41986J33855K48858L63023R9941L2977J89882K70359
5228B4387802J52249J87993J37490P6146J14805K2781J28920L35139O249O725
5218B5556299J14134j7052m380J45122j0737j9719j1236l6580M3012J25667N6551
5207B5941081j20779r5630j1071J13781L1622r8967l1830k4469j51684J0661j31202
5196B5431513p5819j04325k13656k28469j78861N0207l9111j06147r6459k36718
5186B4202155j37763j58715k22868j95967j43248k20704l45320j75023m5283j65530
$$ y = [18315984, 18479927, 18668422, 18848816, 19234833, 19489707, 19621713, 19953034, 20198662, 20458143, 20597728, 20914352, 21263899, 21449112, 21640977, 21929662, 22085474, 22330569, 22667367, 22856923, 22906921, 23048907, 23182762, 23431620, 23794643, 23894584, 23927561, 24117443, 24387802, 24540051, 24728044, 24865534, 24941680, 25056485, 25079266, 25208186, 25543325, 25549574, 25556299, 25670433, 25653381, 25649001, 25794123, 25783386, 25763667, 25752431, 25715851, 25758863, 25884530, 25941081, 25820302, 25724672, 25713601, 25827382, 25859004, 25760037, 25728207, 25703738, 25552054, 25562715, 25431513, 25355694, 25251369, 25037713, 24809244, 24630383, 24680590, 24641479, 24535332, 24438873, 24202155, 24064392, 23905677, 23682809, 23486842, 23343594, 23122890, 22777570, 22602547, 22557264, 22391734]
5176B2391734j72190k45857j91566m14042j08971l31314j39100j47046l18564
5167B0323084j31790k95237j94985k16301j87758j06364j92845k74422j75728
5158A8547654m44045k57346k25138j83626n2435l47424k25487j23517q5878j22518
5148A6480240j98906k34778j26801k56711k61710m4714k19318j70445J5904k57087
5138A4725674k07746k57091q151j23354k28074l66155j31237Q5132j58858j34749
5128A3195391k30566j392j79696k09870o7066k2645j56021j79520r7626M8464
5118A2099453k50222p8135r8208l9177j80651r4160j71661j74558n4624p9905
5108A0878152m6095j4467n3149k12373K9731j23153j28612q5050o0848p1582r6729
$$ y = [22391734, 22219544, 21973687, 21782121, 21368079, 21259108, 20927794, 20788694, 20641648, 20323084, 20191294, 19896057, 19701072, 19484771, 19297013, 19190649, 18997804, 18723382, 18547654, 18103609, 17846263, 17621125, 17437499, 17385064, 17037640, 16812153, 16688636, 16602758, 16480240, 16281334, 16046556, 15919755, 15663044, 15401334, 15356620, 15137302, 14966857, 14982761, 14725674, 14517928, 14260837, 14252686, 14129332, 13901258, 13535103, 13403866, 13488998, 13330140, 13195391, 12964825, 12963433, 12783737, 12573867, 12506801, 12484156, 12328135, 12148615, 12050989, 12099453, 11849231, 11771096, 11672888, 11633711, 11453060, 11358900, 11187239, 11012681, 10958057, 10878152, 10832057, 10817590, 10764441, 10552068, 10581799, 10458646, 10330034, 10244984, 10184136, 10112554, 10015825]
5097A0015825j28605l9849o1444k34061R1927R0345J40923j2653j39837j42025
5087I580546n0896j25152K825Q8801N4154n3313R9794Q7936L9325J4336n2303
5076I686053j28788o2480l0629K30338J35430n6032L9152m37J12581J37310J7281
5065A0079779j26851J67944J67491J02182K7432J66938J34220R9611N9886Q0892
5055A0959524j6988J76012K44360J63747J78645P8980P7786K70778J19451R8454
5045A2350749J99473R8490K61629K89854L56404K35159K96846L31698J76507K64523
5035A4861332K43181M82869K94003K53798L61483L52006L37255M13496L31082
5026A7930505L73812M32599L13995M35556N83041N02147M48840N39179O42838
$$ y = [10015825, 9887220, 9847371, 9785927, 9551866, 9643793, 9734138, 9875061, 9862408, 9722571, 9580546, 9529650, 9404498, 9407323, 9496124, 9550278, 9496965, 9596759, 9684695, 9724020, 9738356, 9686053, 9557265, 9494785, 9464156, 9694494, 9829924, 9773892, 9813044, 9812607, 9925188, 10062498, 10079779, 9952928, 10120872, 10288363, 10390545, 10417977, 10584915, 10719135, 10818746, 10878632, 10959524, 10942536, 11118548, 11362908, 11526655, 11705300, 11784280, 11862066, 12132844, 12252295, 12350749, 12550222, 12648712, 12910341, 13200195, 13556599, 13791758, 14088604, 14420302, 14596809, 14861332, 15104513, 15587382, 15881385, 16135183, 16496666, 16848672, 17185927, 17599423, 17930505, 18304317, 18736916, 19050911, 19486467, 20069508, 20571655, 21020495, 21559674, 22202512]
5017B2202512O14741O71247O13561P19036N68415O14824Q50711Q31311J016551
5008B8702909Q16165R39235R96468R78236R18946J122784J202720J262545J337657
4999C8277665J293590J356059J356166J556310J691790J705216J679563J577186
4991E0493545J887515J904660J799275J859612J773623J834838J820910J659789
4983F5033767J334714J228701R94168N92982M62076J84394k70487n89271r17456
4974F8053588j058690j462958j818638j956086k037375k029455k059462k104551
4966E3526373k290503k344655k111432j918461j754074j676181j852935j687614
4958C7890518j434235j236301j264710j206464j354944j102987r65083q76141
$$ y = [22202512, 22817253, 23488500, 24102061, 24821097, 25389512, 26004336, 26855047, 27686358, 28702909, 29519074, 30458309, 31454777, 32433013, 33351959, 34474743, 35677463, 36940008, 38277665, 39571255, 40927314, 42283480, 43839790, 45531580, 47236796, 48916359, 50493545, 52381060, 54285720, 56084995, 57944607, 59718230, 61553068, 63373978, 65033767, 66368481, 67597182, 68591350, 69184332, 69646408, 69830802, 69560315, 68971044, 68053588, 66994898, 65531940, 63713302, 61757216, 59719841, 57690386, 55630924, 53526373, 51235870, 48891215, 46779783, 44861322, 43107248, 41431067, 39578132, 37890518, 36456283, 35219982, 33955272, 32748808, 31393864, 30290877, 29325794, 28449653]
4950B8449653r36987r12659p47720p18863n36188o23210o37170o05279m39038
4941B2292539m11559l23902n18113k77705k90634l69252n62021l40775j30175
4932A9068403l82318m85259m81458l97910m11538l80504l82937l82572m84178
4923A5279729m70269k94989l86680k67957l94454l15219k33322l32980j19031
4914A2464828m01090m15880j55550n9925k37282l07272k25253j96037k24369r4712
4904A0147458r5074j99072k48798j20555k83316o6628j31989k95586r863m1594
4894H654983l17288k90314l2809j26364r3427r1329k36252j45428p9884j74663
4884G067225j1024j72997j55383r2545j54233n0742j23159j75535n0422j05657
$$ y = [28449653, 27512666, 26600007, 25852287, 25133424, 24597236, 23974026, 23336856, 22731577, 22292539, 21880980, 21557078, 21038965, 20761260, 20470626, 20101374, 19539353, 19198578, 19068403, 18686085, 18200826, 17719368, 17321458, 16909920, 16529416, 16146479, 15763907, 15279729, 14809460, 14514471, 14127791, 13859834, 13465380, 13150161, 12916839, 12583859, 12464828, 12063738, 11647858, 11492308, 11432383, 11195101, 10887829, 10662576, 10466539, 10242170, 10147458, 10052384, 9853312, 9604514, 9483959, 9200643, 9134015, 9002026, 8706440, 8696577, 8654983, 8337695, 8047381, 8014572, 7888208, 7794781, 7703452, 7467200, 7321772, 7241888, 7067225, 7056201, 6883204, 6727821, 6635276, 6481043, 6430301, 6307142, 6131607, 6081185, 5975528]
4874E975528k40087n4337j55089r6729r6940q42m468j98893n7032P821j35848
4863D943084j04510m8234K650j08483j00661M3476j16566q0493j00063j55494
4853D174706r8878m9938p5288p6332J01172j4587j07462J2432r2750j21817J7092
4842C668350R0720O2580q8196N0918p353k72399n0418N3548q3593j31060P9565
4831C372662J4857K1423N9501n504M894N2354j00256O3213p2785j7010K2780p6800
4819C339329L8812m572J3455j612J20030M3728k3007m0149p9732Q8321N8046N1683
4807C604332J07574j839n4786j82413k0978J78781N6146J23640P6406l0469K4334
4796C880728Q0787J77319l5430J93149n2754P8261J81462O1360R1171Q538n9743
$$ y = [5975528, 5735441, 5681104, 5526015, 5429286, 5332346, 5331504, 5327036, 5128143, 5071111, 5078932, 4943084, 4838574, 4790340, 4792990, 4684507, 4583846, 4627322, 4510756, 4430263, 4330200, 4174706, 4075828, 4025890, 3950602, 3874270, 3975442, 3960855, 3853393, 3865825, 3773075, 3651258, 3668350, 3759070, 3821650, 3733454, 3784372, 3777019, 3504620, 3454202, 3507750, 3424157, 3293097, 3372662, 3387519, 3408942, 3468443, 3462939, 3467833, 3520187, 3419931, 3483144, 3410359, 3393349, 3416129, 3339329, 3378141, 3373569, 3387024, 3385412, 3505442, 3549170, 3526163, 3486014, 3406282, 3494603, 3552649, 3604332, 3711906, 3710067, 3655281, 3472868, 3451890, 3630671, 3686817, 3810457, 3886863, 3856394, 3880728, 3961515, 4138834, 4103404, 4296553, 4243799, 4322060, 4503522, 4564882, 4656053, 4664591, 4604848]
4785D604848j01889p4023j09563j59774j13791m2550r1168j79480m916p077j47043
4774C573574j61851o0463O7493O435j9998P0217j18810k76P5673M3182M2239j02995
4762C414420o7224l4643J32649p0491J8203N7920m1475k0708k4003J68482j9954
4751C513176m0532r229j28491k6424j4305J6314k2034l1914r5873M3417n7300
4740C146805K804n0112k5385j6178O5557R1311P8857J08013j972q8979N3717p1646
4728C292792k5657N5425R0024m7768k418N9122k109L9151R7685k1151r3638N5396
4716C496854L5872J9308j15092L9198J39891P1645O1556q7960O8621J56083o4811
4705C821165n5748Q3101O488J38465K22654p3039K2333m5706N6389P4387l5970
$$ y = [4604848, 4502959, 4428936, 4319373, 4159599, 4045808, 4003258, 3912090, 3732610, 3727694, 3720617, 3573574, 3411723, 3351260, 3418753, 3425188, 3405190, 3475407, 3356597, 3356321, 3431994, 3475176, 3517415, 3414420, 3347196, 3312553, 3445202, 3374711, 3392914, 3450834, 3409359, 3388651, 3364648, 3533130, 3513176, 3472644, 3463415, 3334924, 3308500, 3294195, 3310509, 3288475, 3256561, 3160688, 3204105, 3146805, 3149609, 3099497, 3074112, 3057934, 3123491, 3214802, 3293659, 3401672, 3399700, 3310721, 3364438, 3292792, 3267135, 3322560, 3412584, 3364816, 3362398, 3421520, 3419411, 3458562, 3556247, 3535096, 3441458, 3496854, 3532726, 3552034, 3436942, 3476140, 3616031, 3687676, 3749232, 3661272, 3729893, 3885976, 3821165, 3765417, 3848518, 3855006, 3993471, 4216125, 4143086, 4165419, 4119713, 4176102, 4250489, 4214519]
4694D214519N3623K3892J02324J34092R1369N8676Q8770J22181Q6776m421p5659
4683D896142K48282Q2683P9445N2715j3355J73546M597L9849K31069M0571m9955
4672E785589J82726J50661j85885J35957J11897K08785K19141K04057J48215J79053
4662G140196K18887J08307K30666J77161J20601K69824L24176N8052J94906K62112
4652I104888Q1382K47750L16429K60258K30522J94082L73855K73671L94024L40571
4642A1817432M79050M27086M04662L97467M36604N87540N96629O69599O19969
4633A6436038P68336J007254R00755J010816J073780J095657J087162R47848R01470
4624B5229116O61388N84410M71556L47566L56754M14535J91168J75074K24994
$$ y = [4214519, 4268142, 4292034, 4394358, 4528450, 4619819, 4678495, 4767265, 4889446, 4976222, 4971801, 4896142, 5144424, 5227107, 5306552, 5359267, 5345912, 5519458, 5524055, 5563904, 5794973, 5835544, 5785589, 5968315, 6118976, 5933091, 6069048, 6180945, 6389730, 6608871, 6812928, 6961143, 7140196, 7359083, 7467390, 7698056, 7875217, 7995818, 8265642, 8589818, 8647870, 8842776, 9104888, 9186270, 9434020, 9750449, 10010707, 10241229, 10435311, 10809166, 11082837, 11476861, 11817432, 12296482, 12723568, 13128230, 13525697, 13962301, 14549841, 15146470, 15816069, 16436038, 17204374, 18211628, 19112383, 20123199, 21196979, 22292636, 23379798, 24327646, 25229116, 25890504, 26474914, 26946470, 27294036, 27650790, 28065325, 28256493, 28431567, 28656561]
4615B8656561K75247K96423M22924N65714P68635J049651J049976J004136J081512
4606C5170779J386092J523722J480101J569471J808941J536670J425604J463246
4598D7364626J462059J374602J164145J102334R96583J110247R68018O47542K27298
4589E6417454Q3956n3971k41211l83632n21303q67836j016131j077570j341222
4580E0998534j485700j805584j646224j614648j803295j680218j786552j731482
4572C7444831j881559j879513j619121j887933j646627j688118j440846j388194
4564B4012920j428153j140642j030659r81567q43477p76369p40279p25217p32110
4555A5614447m05453n53061m33322k73708l10418l65793k18477n8561k10440j85505
$$ y = [28656561, 28931808, 29228231, 29651155, 30216869, 30985504, 32035155, 33085131, 34089267, 35170779, 36556871, 38080593, 39560694, 41130165, 42939106, 44475776, 45901380, 47364626, 48826685, 50201287, 51365432, 52467766, 53464349, 54574596, 55542614, 56190156, 56417454, 56501410, 56447439, 56206228, 55822596, 55301293, 54433457, 53417326, 52339756, 50998534, 49512834, 47707250, 46061026, 44446378, 42643083, 40962865, 39176313, 37444831, 35563272, 33683759, 32064638, 30176705, 28530078, 26841960, 25401114, 24012920, 22584767, 21444125, 20413466, 19431899, 18588422, 17812053, 17071774, 16346557, 15614447, 15208994, 14655933, 14222611, 13948903, 13638485, 13272692, 13054215, 12995654, 12785214, 12599709]
4545A2599709k05466q5828J3577j80635k98739J2307o1907J7496J70474j19635
4535A1861353J10904N4488N1956O2106P4359j62237L0521K24241J76810K48015
4525A2732516J39145J28057J15736J31333J71445L74350K83662K87247L19912
4516A4683403J35908L52229K76762M55893N78635J92654L71220M17786L47058
4507A7811548M80795O04260N86781N57311O23363O54675O99368P08481R57174
4498B3683756Q68973Q44313R65513R76734J233416J074278J255248J600229J440338
4489C3942798J403040J673520J756521J770786J965421K088603K386137K352540
4481D9339366K294656K560611K732512K661764K547606K534593K297891K092044
$$ y = [12599709, 12394243, 12308415, 12321992, 12141357, 11842618, 11854925, 11793018, 11810514, 11980988, 11861353, 11972257, 12026745, 12078701, 12140807, 12215166, 12052929, 12083450, 12307691, 12484501, 12732516, 12871661, 12999718, 13115454, 13246787, 13418232, 13792582, 14076244, 14363491, 14683403, 14819311, 15171540, 15448302, 15904195, 16482830, 16675484, 17046704, 17464490, 17811548, 18292343, 18896603, 19483384, 20040695, 20664058, 21318733, 22018101, 22726582, 23683756, 24552729, 25397042, 26362555, 27339289, 28572705, 29646983, 30902231, 32502460, 33942798, 35345838, 37019358, 38775879, 40546665, 42512086, 44600689, 46986826, 49339366, 51634022, 54194633, 56927145, 59588909, 62136515, 64671108, 66968999, 69061043]
4473F9061043J639995J315450N79020N4770n16785q94256j517619j973594k329903
4464F5418121k589397k848092k953394k919024k977265k855847k766561k446669
4456D3061872k239745k202047j979309j801537j822931j569067j581093j430310
4448B8435833j542835j505970j306460j265408j128823j068315r97533j001877
4440A8618612q54210p51720p64109p63063q28956o60412n59490m13815l86161
4431A2636676m73174o50900l80698m57925l06068l92359n03558k12335j69822
4422I089837k02930k50724j50986k61339j93364l08947k33139j64865k31178j30823
4412F961542j53670j36255k14940o5593Q349q5840l00698j26615k5943k04746
$$ y = [69061043, 70701038, 72016488, 72595508, 72650278, 72133493, 71239237, 69721618, 67748024, 65418121, 62828724, 59980632, 57027238, 54108214, 51130949, 48275102, 45508541, 43061872, 40822127, 38620080, 36640771, 34839234, 33016303, 31447236, 29866143, 28435833, 26892998, 25387028, 24080568, 22815160, 21686337, 20618022, 19620489, 18618612, 17764402, 17012682, 16248573, 15485510, 14656554, 13996142, 13436652, 13022837, 12636676, 12163502, 11512602, 11131904, 10673979, 10367911, 9975552, 9471994, 9259659, 9089837, 8886907, 8636183, 8485197, 8223858, 8030494, 7721547, 7488408, 7323543, 7092365, 6961542, 6807872, 6671617, 6456677, 6391084, 6399433, 6313593, 6012895, 5886280, 5860337, 5655591]
4402E655591Q4048j67759o5521k15771l2416K9685k78895L5033j39039N6766j15928
4391D845794P4554j57800j06881j10604j10113P1287n1180K8228p2563Q3397k07817
4380D286302p3242R875k5526N1031J07920o946q8542O7217K2587j51102N0472
4369D250046n8676p6017J7897l1474J43767P3241n748m6673k7012J71061M9434
4358D459846q7564M2025k7950L3056J46966J01910m27J6823K08862P509K01799
4347E102855J13643p3945o6633R7223J02873J26883J36448m4158K05595J26759
4337E827543J13261J04327J80400J90824R6992K6203K01237K40018K44373K10575
4327G435753J71557J94116K94452K67621J99380J52615K33107K61332K24020L30932
$$ y = [5655591, 5739639, 5571880, 5506359, 5290588, 5258172, 5287857, 5008962, 5043995, 4904956, 4961722, 4845794, 4920348, 4762548, 4655667, 4545063, 4434950, 4506237, 4455057, 4483285, 4410722, 4494119, 4286302, 4213060, 4222935, 4197409, 4248440, 4356360, 4349414, 4260872, 4328089, 4350676, 4199574, 4250046, 4191370, 4115353, 4133250, 4101776, 4245543, 4318784, 4313036, 4266363, 4239351, 4410412, 4459846, 4372282, 4414307, 4386357, 4419413, 4566379, 4668289, 4667862, 4684685, 4893547, 4901056, 5102855, 5216498, 5142553, 5075920, 5173143, 5276016, 5402899, 5539347, 5495189, 5700784, 5827543, 5940804, 6045131, 6225531, 6416355, 6513347, 6539550, 6740787, 6980805, 7225178, 7435753, 7607310, 7801426, 8095878, 8363499, 8562879, 8715494, 8948601, 9209933, 9433953, 9764885]
4317I764885K12818K54464L27340M27518L96417K65688L06246L64206N1967L52112
4307A2723661L44612L50768K51810L35055K60706J55512K79258J74005K23614
4298A5099001K73785L76896J41300J85868J77368J17295N0321K3955p9498k4675
4288A6341616M1213L5224o3552m2190j63875q6939j57191k20934j43375j97571
4278A5342426j70107k15074k72094j37818k98866l81486l25298m44707k65411
4269A2831565k88305k72188l40887k96183l61467l60283k98842l10063k89706
4260A0013641l13276l09812l88974l99593k21348k64999m27040k34047r4090j61136
4250G199326k47811k58535l1307j95046m21685j32629j65501k88829j68910j50745
$$ y = [9764885, 9977703, 10232167, 10559507, 10987025, 11383442, 11649130, 11955376, 12319582, 12371549, 12723661, 13068273, 13419041, 13670851, 14005906, 14266612, 14422124, 14701382, 14875387, 15099001, 15372786, 15749682, 15890982, 16076850, 16254218, 16371513, 16421834, 16445789, 16366291, 16341616, 16382829, 16418053, 16354501, 16312311, 16148436, 16061497, 15904306, 15683372, 15539997, 15342426, 15172319, 14957245, 14685151, 14547333, 14248467, 13866981, 13541683, 13096976, 12831565, 12543260, 12271072, 11930185, 11634002, 11272535, 10912252, 10613410, 10303347, 10013641, 9700365, 9390553, 9001579, 8601986, 8380638, 8115639, 7688599, 7454552, 7360462, 7199326, 6951515, 6692980, 6661673, 6466627, 6044942, 5912313, 5746812, 5457983, 5289073, 5138328]
4240E138328j16138o2805o5636q5140k65466k27871j00835k9128j49527j17664
4230C918118k67378n7019N059o0814N3167o7331M920o3233m47j28590q5132K8
4218C251348O9867j2529K6824l0689l7667R6944m2358j2540K5507l675L1943J12615
4206C475590o4395J23595o6914J3693q2898j59685j03382k7031n2205l0460o2471
4195B963437j33667J16684K321p1000r5618o0545l2982L5239j01471p2456J6871
4184B566813r989n2069q5837j0270M648q1116O4180j00423M9517l7543J06063
4173B413974M4098o9594j30085j9762l1274k8319Q4353o6949j55139P5071o3147
4162B053227j09632J55160N1397J2893M4062m0478o9439p704P9406k6772J21678
$$ y = [5138328, 5022190, 4959385, 4893749, 4808609, 4543143, 4315272, 4214437, 4185309, 4035782, 3918118, 3650740, 3593721, 3598780, 3537966, 3591133, 3523802, 3528722, 3465489, 3465042, 3336452, 3251320, 3251348, 3321215, 3308686, 3335510, 3304821, 3267154, 3364098, 3321740, 3309200, 3334707, 3331032, 3362975, 3475590, 3411195, 3534790, 3467876, 3481569, 3398671, 3238986, 3135604, 3108573, 3056368, 3025908, 2963437, 2829770, 2946454, 2948775, 2877775, 2782157, 2721612, 2688630, 2723869, 2622398, 2549942, 2566813, 2556824, 2504755, 2418918, 2408648, 2413296, 2332180, 2396360, 2295937, 2345454, 2307911, 2413974, 2458072, 2388478, 2258393, 2238631, 2207357, 2179038, 2263391, 2196442, 2041303, 2116374, 2053227, 1943595, 2098755, 2150152, 2163045, 2207107, 2166629, 2097190, 2089486, 2168892, 2142120, 2263798]
4151B263798j17397j12713l122j17954J91065k2721n2092L5620n2256j2813p3420
4140A925995l6067R7562r4949L1619K2244J39860m1997M7801n5210L1261P323
4129B075442k9686j2177j3533K3046o5667j06666Q1027N7813O1108O7351J38298
4118B276356l1867p490n7424N977J05687j00525R5646Q0009n3123j25373L1263
4107B219136R5754M2079M7654J10789Q446q5685J55947J62720k28033K01549J27541
4096B857897o2564K6917j6982J3712J40553M4058N150p7620O5312l9603q279J27321
4084C075872j8745J4660J10621J98675r1857J52004K50877O4411J09220J17882
4074C983620M3775J40905P5930P7266J98960J05238N1936P2038J68626K34541
$$ y = [2263798, 2146401, 2033688, 2030566, 1912612, 2103677, 2080956, 2028864, 2064484, 2012228, 1999415, 1925995, 1889928, 1987490, 1892541, 1924160, 1946404, 2086264, 2044267, 2092068, 2036858, 2068119, 2075442, 2045756, 2033579, 2020046, 2043092, 1977425, 1870759, 1951786, 2009599, 2070707, 2138058, 2276356, 2244489, 2236999, 2179575, 2185552, 2291239, 2190714, 2286360, 2366369, 2313246, 2187873, 2219136, 2314890, 2356969, 2404623, 2515412, 2523858, 2438173, 2594120, 2756840, 2528807, 2730356, 2857897, 2795333, 2822250, 2805268, 2818980, 2959533, 3003591, 3008741, 2931121, 2996433, 2956830, 2948551, 3075872, 3057127, 3071787, 3182408, 3381083, 3289226, 3441230, 3692107, 3756518, 3865738, 3983620, 4027395, 4168300, 4244230, 4321496, 4520456, 4625694, 4677630, 4749668, 4918294, 5152835]
4064E152835J97347K29141L06902K45458J95806L61306L92439M16236L82221M42003
4054H321694M36343M15105O59756K67517K37583K90648O0039k9417j58836k79026
4044A0221406l74876k82543n03444l70722m04215n28011l33827j44042k76192
4035G003534j69398j90915j97886p5060q8472n1850k05203q7916j6428r3299k37337
4024E589770j73583L5911r7806j24770J9402Q2612J54725j74372k09124k9277
4014E073488L3758m1647r5265K2170K56921M8341j4297L0955r4517p8999K32145
4003E373053K041l4255Q7684K5029M753m4399J40573J55234Q5860J68254n9523
3992E904304P9011K88508J22243K5704M8922K223j6452J62949J61994K07061J61868
$$ y = [5152835, 5350182, 5579323, 5886225, 6131683, 6327489, 6688795, 7081234, 7497470, 7879691, 8321694, 8758037, 9173142, 9832898, 10100415, 10337998, 10628646, 10688685, 10659268, 10500432, 10221406, 9846530, 9563987, 9060543, 8689821, 8285606, 7757595, 7423768, 7279726, 7003534, 6834136, 6643221, 6445335, 6370275, 6281803, 6229953, 6024750, 5936834, 5920406, 5827107, 5589770, 5416187, 5452098, 5354292, 5229522, 5248924, 5331536, 5486261, 5311889, 5102765, 5073488, 5107246, 5065599, 4970334, 4992504, 5249425, 5297766, 5283469, 5314424, 5219907, 5140908, 5373053, 5375094, 5340839, 5428523, 5453552, 5458305, 5413906, 5554479, 5709713, 5795573, 5963827, 5904304, 5983315, 6271823, 6394066, 6419770, 6468692, 6470915, 6454463, 6617412, 6779406, 6986467, 7148335]
3981G148335J90951J07477R0581J20507J83524J31975J33712k2895J61673J240
3971H247080J87390J88851j461J80482J72157J72171L7212P4802P8863J71035
3961I508582J83897J85824l3824Q8587J42419J61908J14191J18554K09822J14973
3951A0794933J93999Q5102J27243K98630L45079K81457Q9330K94854L02914J84948
3941A2998489L61367L02135K11998J28650K68673L53134M27256N33285M58564
3932A6043551L98308M94585N65259N10720M62527N77451M62494L74288O14481
3923B0503664N07280M36104M34649M37845N63064N52016M53253K88900M31823
3914B4608598L38346K83707L10465K47212L04806K02414K84906J09797P1871J60516
$$ y = [7148335, 7339286, 7446763, 7537344, 7657851, 7841375, 7973350, 8107062, 8084167, 8245840, 8247080, 8434470, 8623321, 8621860, 8802342, 8974499, 9146670, 9183882, 9258684, 9337547, 9508582, 9692479, 9878303, 9844479, 9933066, 10075485, 10237393, 10351584, 10470138, 10679960, 10794933, 10988932, 11074034, 11201277, 11499907, 11844986, 12126443, 12215773, 12510627, 12813541, 12998489, 13359856, 13661991, 13873989, 14002639, 14271312, 14624446, 15051702, 15584987, 16043551, 16441859, 16936444, 17501703, 18012423, 18474950, 19052401, 19514895, 19889183, 20503664, 21010944, 21447048, 21881697, 22319542, 22882606, 23434622, 23887875, 24176775, 24608598, 24946944, 25230651, 25541116, 25788328, 26093134, 26295548, 26580454, 26690251, 26762122, 26922638]
3904B6922638M4047r316k2465j27792k05286j36769j88337j94739k41821k10591
3894B5629569k21732l26375l21392j73115l46245n92446m31894l55989m51259
3885B2409122k55318l35851n54817m51941m35993l85900m30018n66527m73493
3876A8519264m31338n64796m64375l13187m12826m10835m71131l85789l67030
3867A4697957j67290k41118m83181j87455j22369r7496j29262j17691k66568p6733
3857A2808794j1354o579k11482o7028K156p5326k5308J1800j02720j75455R7050
3846A2244548p6838J06360P397k9792M8910J8315j5886P7132k3812j060K5108
3835A2380382N0283N3233k5273J4212k1259l966Q9981K26975j2361J06690k1590
$$ y = [26922638, 26966685, 26957369, 26934904, 26807112, 26601826, 26465057, 26276720, 26081981, 25840160, 25629569, 25407837, 25081462, 24760070, 24586955, 24240710, 23648264, 23216370, 22860381, 22409122, 22153804, 21817953, 21263136, 20811195, 20375202, 19989302, 19559284, 18992757, 18519264, 18087926, 17523130, 17058755, 16745568, 16332742, 15921907, 15450776, 15064987, 14697957, 14530667, 14289549, 13806368, 13618913, 13496544, 13399048, 13269786, 13152095, 12885527, 12808794, 12797440, 12790861, 12579379, 12512351, 12514507, 12439181, 12413873, 12425673, 12322953, 12147498, 12244548, 12167710, 12274070, 12281467, 12251675, 12300585, 12318900, 12303014, 12380146, 12356334, 12355274, 12380382, 12430665, 12483898, 12458625, 12472837, 12451578, 12447612, 12537593, 12764568, 12752207, 12858897, 12837307]
3824A2837307L9190J05809n9501K01477J85805L0068J60287L35557L12842J20135
3814A4268976J07497K53204K02936J87658l9742J65828L72402L8594J23995n901
3804A5675447P0479J99693J25177Q9780R3833M1192J03306Q6469L2390J76698
3794A6694464l3825J5921K31426N1979K03279J81752Q2383K56791J84785L46899
3784A8215854K03625K81963K49861M20466M36530L08181L83909L58543M37642
3775B1296574N61997M30932N18090N29697P04094O87808N51533N92315O22009
3766B6495049Q30759P10198O38546Q17524O15419P72007R28961Q69827P44728
3757C3423018Q42859Q72400P79567Q97713O63883P27999P31541N96809O84814
$$ y = [12837307, 12876497, 12982306, 12922805, 13124282, 13310087, 13340155, 13500442, 13835999, 14148841, 14268976, 14376473, 14629677, 14832613, 15020271, 14980529, 15146357, 15518759, 15557353, 15681348, 15675447, 15745926, 15945619, 16070796, 16160576, 16254409, 16295601, 16398907, 16485376, 16517766, 16694464, 16660639, 16676560, 16907986, 16959965, 17163244, 17344996, 17427379, 17684170, 17868955, 18215854, 18419479, 18701442, 18951303, 19371769, 19808299, 20116480, 20500389, 20858932, 21296574, 21858571, 22289503, 22807593, 23337290, 24041384, 24729192, 25280725, 25873040, 26495049, 27325808, 28036006, 28674552, 29492076, 30107495, 30879502, 31808463, 32678290, 33423018, 34265877, 35138277, 35917844, 36815557, 37479440, 38207439, 38938980, 39535789, 40220603]
3748D0220603P36376O49243P23932N04531P10128N91182P04286N67334N87855
3739D5995470M90162M88196M11883L81669K70317L01786J38226J13339P5640k71138
3729D8395550k61806j65700m65625m78824m04706p47119p11595o55777p48326
3720D3756072p08369q29473r05541p74478o97857n87704q62955j052591q63752
3711C6473352o97555p56249n56038q20261q94812q96407q17328p22795p85828
3702B9526079q66095p75108p01938p30626p36039o44261p32212q53609n07320
3693B2978871n12540p31124o51043o64887o56518n18792l70232l85422l95514
3684A8092799m13729l59310m62108l97066k96768k60454k73024j94369l19601
$$ y = [40220603, 40956979, 41606222, 42330154, 42834685, 43544813, 44135995, 44840281, 45407615, 45995470, 46485632, 46973828, 47385711, 47767380, 48037697, 48339483, 48477709, 48591048, 48666688, 48395550, 48133744, 47968044, 47502419, 47023595, 46618889, 45871770, 45160175, 44504398, 43756072, 43047703, 42218230, 41312689, 40538211, 39840354, 39252650, 38389695, 37337104, 36473352, 35775797, 35019548, 34463510, 33643249, 32748437, 31852030, 31034702, 30311907, 29526079, 28659984, 27884876, 27182938, 26452312, 25716273, 25072012, 24339800, 23486191, 22978871, 22466331, 21735207, 21084164, 20419277, 19762759, 19243967, 18873735, 18488313, 18092799, 17679070, 17319760, 16857652, 16460586, 16163818, 15903364, 15630340, 15435971, 15116370]
3675A5116370k56271k85254k90551j27516o8707q2236j31419j24944m0999j16526
3665A3591947j23020o9919o5452N538k4218k00381p1496J201r6042k55738j4856
3654A2677564n5395p0827j62831k65493j20490j99914k09202k18846n3461l39399
3644A0981706k34182j94530j30223j28412k47022n4374j91410k79937j85266j69414
3634I166936p7928J3549p9558q3936r9713j80584o3683l2325k45393M066J48803
3623H470234r1920m6404q6686p30l8934j24767j0893o0929j42802O9357m9044
3612G886482p5171J6694J5013P7643J24027m0350J9363j21515N0957n1634o9670
3601G831839J6522M2339q7948N6698O6017O3073J81150J44737l1609J12653J16069
$$ y = [15116370, 14860099, 14574845, 14284294, 14156778, 14088071, 14005835, 13874416, 13749472, 13708473, 13591947, 13468927, 13399008, 13333556, 13339094, 13314876, 13114495, 13042999, 13044200, 12948158, 12692420, 12677564, 12622169, 12551342, 12388511, 12123018, 12002528, 11802614, 11593412, 11374566, 11321105, 10981706, 10747524, 10552994, 10422771, 10294359, 10047337, 9992963, 9801553, 9521616, 9336350, 9166936, 9089008, 9102557, 9022999, 8939063, 8839350, 8658766, 8595083, 8562758, 8317365, 8321431, 8470234, 8378314, 8331910, 8245224, 8244494, 8205560, 8080793, 8069900, 8008971, 7866169, 7935526, 7886482, 7811311, 7828005, 7843018, 7920661, 8044688, 8004338, 8023701, 7902186, 7953143, 7901509, 7831839, 7848361, 7890700, 7802752, 7859450, 7925467, 7988540, 8169690, 8314427, 8282818, 8395471, 8511540]
3590H511540P3056K6166l0818J54616J33564k4771J159J99342p9077J40266J06477
3579I211520J75627K9375O5424L2876K34046J95561K62555K03741J9291K30846
3569A0660862O7006J20917J13849J22949J75020L06770K79622K40604K18274K32423
3559A2538296K00370K02562M28044J91297L74193K85384K35834K88891K39110
3550A4983981J48403L64329K62163K48333M68288L42375M91564L28436M56293
3541A8094165N32243N81869M63215M24760N49330M26384M60862N94167P10945
3532B2837940O12708O31379P80940P90680Q56374P63921R93028R73076P65402
3523C0005448R92396J133811J131158J241825J222269J203212J264757J367390
$$ y = [8511540, 8584596, 8610762, 8579944, 8734560, 8868124, 8843353, 8844512, 9043854, 8964777, 9105043, 9211520, 9387147, 9416522, 9481946, 9514822, 9748868, 9944429, 10206984, 10410725, 10430016, 10660862, 10727868, 10848785, 10962634, 11085583, 11260603, 11567373, 11846995, 12087599, 12305873, 12538296, 12738666, 12941228, 13369272, 13560569, 13934762, 14220146, 14455980, 14744871, 14983981, 15132384, 15496713, 15758876, 16007209, 16475497, 16817872, 17309436, 17637872, 18094165, 18626408, 19208277, 19671492, 20096252, 20645582, 21071966, 21532828, 22126995, 22837940, 23450648, 24082027, 24862967, 25653647, 26510021, 27273942, 28266970, 29240046, 30005448, 30997844, 32131655, 33262813, 34504638, 35726907, 36930119, 38194876, 39562266]
3515C9562266J373012J298155J339986J565865J559314J379200J525089J422256
3507E1025143J415143J462419J262740J328831J222954R95194J125775J048918
3499F0887117P50953O14311M40787K97162K35113P3142n8608k21486m33016m70365
3489F2115110o48239o76303r84112r96815j015713j266157j404724j517739j410162
3480E2195146j565723j515452j484200j552724j621490j593073j435309j603675
3472C9823500j484425j396461j337248j333383j265978j127012j201209j022475
3464B9655309j050713j048286j054213p44590p73933r24678o27653o39546o86059
3455B2105638o16425n98426o17991l86073k90738m49313n53635l65913l98909
$$ y = [39562266, 40935278, 42233433, 43573419, 45139284, 46698598, 48077798, 49602887, 51025143, 52440286, 53902705, 55165445, 56494276, 57717230, 58712424, 59838199, 60887117, 61638070, 62252381, 62693168, 62990330, 63225443, 63298585, 63239977, 63018491, 62585475, 62115110, 61466871, 60790568, 59806456, 58809641, 57793928, 56527771, 55123047, 53605308, 52195146, 50629423, 49113971, 47629771, 46077047, 44455557, 42862484, 41427175, 39823500, 38339075, 36942614, 35605366, 34271983, 33006005, 31878993, 30677784, 29655309, 28604596, 27556310, 26502097, 25757507, 24983574, 24058896, 23431243, 22791697, 22105638, 21489213, 20890787, 20272796, 19886723, 19595985, 19146672, 18593037, 18227124, 17828215]
3446A7828215l42445k31824l80026l51941k25010k11791l35158j86425k42612
3437A5320983j56577k46834m27839j26324O0439j34873j91753r9598k10255k41027
3427A3546342p6338j04819j09726j28403J1923j31906j22265j2579K5659k14620
3417A2683268q6058P2600r7755K2002R635J48071J418K8095m7759q4883q9218
3406A2559416Q0819J2421q3712R3634j8448O8529J4452L9686J29186R8764q231
3395A2986516l1097r256l269K15541J01716N5607J47500J07907Q1911L41996L21625
3384A4316697J26143K41160L42776K78090K75508M46715K22635K18282M26610
3375A6894616M01947M85000M30349K84492N43790N93014N71861M95552O72456
$$ y = [17828215, 17485770, 17253946, 16873920, 16521979, 16296969, 16085178, 15750020, 15563595, 15320983, 15164406, 14917572, 14489733, 14363409, 14423848, 14288975, 14097222, 13997624, 13787369, 13546342, 13470004, 13365185, 13255459, 13127056, 13138979, 13007073, 12884808, 12872229, 12897888, 12683268, 12597210, 12669810, 12572055, 12594057, 12603692, 12751763, 12753181, 12781276, 12733517, 12648634, 12559416, 12640235, 12652656, 12568944, 12662578, 12644130, 12712659, 12727111, 12766797, 12895983, 12994747, 12986516, 12955419, 12946163, 12942894, 13158435, 13260151, 13315758, 13463258, 13571165, 13653076, 13995072, 14316697, 14442840, 14684000, 15026776, 15304866, 15580374, 16027089, 16249724, 16468006, 16894616, 17296563, 17781563, 18211912, 18496404, 19040194, 19633208, 20205069, 20700621, 21373077]
3366B1373077O18870N90960O77678O95146O06764O47146Q02940P43391P21733
3357B7477705P21212O99358N44367Q31986O74019M49294N98693M83086M05561
3348C2885281L37979J57481P2066J58894p1934k34534j62830l82956m14251k95158
3338C2050038m35945p87530p99559o32351o18436p46162q08462p45952r31490
3329B5544151r23391p86690q33270p97785r20104q82466o60562o11537q08108
3320A8320238p14872o54782n51752n56807n53075n42271m37066m70609m35334
3311A3403670l41739l34760l83691m02473k97657l20822j78748j92357k75142
3302A0676281p2508k33459l29285k26051j01709k11622J05913j40350k22072j71454
$$ y = [21373077, 21991947, 22582907, 23260585, 23955731, 24562495, 25209641, 26012581, 26755972, 27477705, 28198917, 28898275, 29442642, 30274628, 30948647, 31397941, 31996634, 32479720, 32885281, 33223260, 33380741, 33452807, 33611701, 33539767, 33305233, 33142403, 32759447, 32345196, 32050038, 31614093, 30826563, 30027004, 29394653, 28776217, 28030055, 27221593, 26475641, 25544151, 24620760, 23834070, 23000800, 22203015, 21282911, 20400445, 19739883, 19128346, 18320238, 17605366, 16950584, 16398832, 15842025, 15288950, 14746679, 14309613, 13839004, 13403670, 13061931, 12727171, 12343480, 11941007, 11643350, 11322528, 11143780, 10951423, 10676281, 10603773, 10370314, 10041029, 9814978, 9713269, 9501647, 9607560, 9467210, 9245138, 9073684]
3292I073684k81252N3360o7610o1407j2152o5738p6885k7258j21434p7706q2149
3281H253453j53506r255j27385j23087N95l59717j44293Q9626j20348j87977j57558
3270F960548k40671O1077K6365k3585k6609k98149j83000j4626k4610O0257j84396
3259F112601o9749j57550j25505J08425O8938r961l1918j77767k65370O7100J66495
3248E685739M2999k17961J5961o9414N1432Q106j3456K3764o5484k1401j48686
3237E291599J82186J35885L6243m8824l6615P6854j7665P503R4080j2309K68364
3226E977301j63306j50528J55314m0493R7649O5808J8233K3232P3450P1617J10614
3215F238891Q8099K4866N0837J40529J31573K0096K5789j3213J61336J29895K3534
$$ y = [9073684, 8792432, 8845792, 8778182, 8716775, 8704623, 8638885, 8562000, 8534742, 8413308, 8335602, 8253453, 8099947, 8090692, 7963307, 7840220, 7840815, 7481098, 7336805, 7426431, 7306083, 7118106, 6960548, 6719877, 6780954, 6807319, 6783734, 6757125, 6458976, 6275976, 6261350, 6236740, 6296997, 6112601, 6042852, 5885302, 5759797, 5868222, 5937160, 5927199, 5895281, 5717514, 5452144, 5519244, 5685739, 5728738, 5510777, 5526738, 5457324, 5508756, 5516862, 5503406, 5527170, 5461686, 5440285, 5291599, 5473785, 5609670, 5645913, 5597089, 5560474, 5637328, 5619663, 5627166, 5721246, 5708937, 5977301, 5813995, 5663467, 5818781, 5778288, 5875937, 5941745, 5959978, 5983210, 6056660, 6128277, 6238891, 6326990, 6351856, 6402693, 6543222, 6674795, 6694891, 6720680, 6707467, 6868803, 6998698, 7022232]
3204G022232l1294n8592O1707J14635J61173Q1140J09521J21181O0250R1202J69053
3193G902208J14001P2271k1238N860Q8543K52179J76882J60616O4719n8430J11340
3182H868951K76636J45426R5751K14587J06458J53549J32369P1146K24813K29590
3172A0519276K25813K26461J67141K71479L31777K61035J08221J89391M49723
3163A2750317L06371J2088K70086M39555L44111J90086L57083M27145N28641K32011
3153A5857494L12260M23464L54384M72850M80809M32832N20014M66735N74752
3144A9895594O92605M81862O83940O98653O31446O65205Q35419O98021P28685
3135B6011430R02187Q91461R97955J110076R59736J092301J159759J228571J152410
$$ y = [7022232, 6990938, 6932346, 6994053, 7108688, 7269861, 7351001, 7460522, 7581703, 7641953, 7733155, 7902208, 8016209, 8088480, 8067242, 8073102, 8161645, 8413824, 8590706, 8751322, 8816041, 8757611, 8868951, 9145587, 9291013, 9386764, 9601351, 9707809, 9861358, 9993727, 10064873, 10289686, 10519276, 10745089, 10971550, 11138691, 11410170, 11741947, 12002982, 12111203, 12300594, 12750317, 13056688, 13068776, 13338862, 13778417, 14122528, 14312614, 14669697, 15096842, 15625483, 15857494, 16169754, 16593218, 16947602, 17420452, 17901261, 18334093, 18854107, 19320842, 19895594, 20588199, 21070061, 21754001, 22452654, 23084100, 23749305, 24584724, 25282745, 26011430, 26913617, 27805078, 28803033, 29913109, 30872845, 31965146, 33124905, 34353476, 35505886]
3126C5505886J355163J616979J468689J761648J777890J761983J855370J993950
3118D9097558K244568K133507K377482K492218K820662K792236K891433L255567
3110G0105231L237700L309632L612732L719377M007355L961926M128758M403973
3102A00486684M314737M023220M014379L644092L048592K910997K207934J161633
3094A25812268N90598l76087j051947j773629k721799l233339m009703m435027
3086A08801335m652732n017032m955992m988420m977414m789751m610969m165570
3078G0643455l887199l650812l350974l234929l110994k853731k732736k458546
3070D5363534k090548k002500j984890j734728j643742j543036j480766j480412
$$ y = [35505886, 36861049, 38478028, 39946717, 41708365, 43486255, 45248238, 47103608, 49097558, 51342126, 53475633, 55853115, 58345333, 61165995, 63958231, 66849664, 70105231, 73342931, 76652563, 80265295, 83984672, 87992027, 91953953, 96082711, 100486684, 104801421, 108824641, 112839020, 116483112, 119531704, 122442701, 124650635, 125812268, 126402866, 126026779, 124974832, 123201203, 120479404, 117246065, 113236362, 108801335, 104148603, 99131571, 94175579, 89187159, 84209745, 79419994, 74809025, 70643455, 66756256, 63105444, 59754470, 56519541, 53408547, 50554816, 47822080, 45363534, 43272986, 41270486, 39285596, 37550868, 35907126, 34364090, 32883324, 31402912]
3062C1402912j424352j175778j276349r76368j066749r60745q63536p79489r09468
3053B1970078q68752p99251o76750n80659o43344p26934n85512n93048m49969
3044A6045859n69102o16401l41094n13560n17961k93801k57619m89454k57624
3035A2189243m14664m32414l46107l39679k32097l89099l61781l80959j64922
3026I127521j02645k66240j15101j15688k55805k48517k69843j86227j51617k36780
3016G179058j63135k72459m9952j89937k22811k11607o2729M5724k54761j39614
3006E657777n8188k50238j2834l5944k56084k34003m0725p1444k78640r4527J27477
2995D452627j37920r5875j4525k39821j7534k0412j02067j55316l7792k0488j25327
$$ y = [31402912, 29978560, 28802782, 27526433, 26550065, 25483316, 24522571, 23659035, 22879546, 21970078, 21101326, 20302075, 19625325, 19044666, 18401322, 17674388, 17088876, 16495828, 16045859, 15476757, 14860356, 14519262, 14005702, 13487741, 13193940, 12936321, 12446867, 12189243, 11774579, 11342165, 10996058, 10656379, 10424282, 10035183, 9673402, 9292443, 9127521, 9024876, 8758636, 8643535, 8527847, 8272042, 8023525, 7753682, 7567455, 7415838, 7179058, 7015923, 6743464, 6693512, 6503575, 6280764, 6069157, 6006428, 6052152, 5797391, 5657777, 5599589, 5349351, 5336517, 5300573, 5044489, 4810486, 4769761, 4698317, 4419677, 4325150, 4452627, 4314707, 4218832, 4204307, 3964486, 3946952, 3926540, 3824473, 3669157, 3631365, 3610877, 3485550]
2984C485550j19836j14020K5154L4251j25241o0701K9344j42832q3272k9130q6755
2973B812512K7165p7889J2958j15227l0923j02754r2741j10273m0474P7703Q2613
2962B442670P969N4280m3432j71215q3274k2769m915j16678j8924q6291M6265
2951B003686K4585q4816P0100Q971r3655n1186r7843j0496Q0439j30417q6209
2940A633159K09649m0304j41488q5485J25546j2312r8026q1532P7518r2240j27392
2929A367093N9488J55489o4171k1517j24360O8668J4969j77437Q1484o7016P5863
2918A368553R894o448j22846j51961K8934n9574M7208P1982m2278k0825j29034
2907I93605j4931l0914N3886o7163L7729J5847r347O4614K601n4714o7236L5941
$$ y = [3485550, 3365714, 3251694, 3276848, 3311099, 3185858, 3125157, 3154501, 3011669, 2928397, 2899267, 2812512, 2839677, 2761788, 2774746, 2659519, 2628596, 2525842, 2433101, 2322828, 2282354, 2360057, 2442670, 2450639, 2504919, 2461487, 2290272, 2206998, 2184229, 2179314, 2062636, 2043712, 1957421, 2003686, 2028271, 1943455, 2013555, 2022526, 1928871, 1877685, 1779842, 1769346, 1849785, 1719368, 1633159, 1842808, 1802504, 1661016, 1575531, 1701077, 1688765, 1590739, 1509207, 1586725, 1494485, 1367093, 1426581, 1582070, 1517899, 1496382, 1372022, 1440690, 1455659, 1278222, 1359706, 1292690, 1368553, 1378447, 1371999, 1249153, 1097192, 1126126, 1066552, 1113760, 1185742, 1143464, 1122639, 993605, 978674, 947760, 1001646, 934483, 972212, 988059, 978712, 1043326, 1045927, 991213, 923977, 959918]
2895I59918k6659M7300m0952o9980M8533k2004n9468M3901J5358M6440K5956r1306
2883H77037P4589l0360q3926m7508n1001K7941J8391M1332O262R8407o7503J92
2871H63853l5026l3335M8023l0219l7476N1302j37052P5422m0109L4954k3626
2860G36711j15576O8922r2980l3445R0779K3118j29938J15790J5162n5482j2234
2849F10827j2998L0069j23200N118Q7589J16590n3690Q510l1280k80175K35624
2838E92984m5574r459J52000l9176j67495J42199M1219q3227P4697O957j23156
2827E41969p3664J40274K188J18233R5900j07524q7846L464R3034P1732j17754
2816F80006N878J65745M3809M2546K5837K9135l2049m2300Q8035m8490j64899
$$ y = [959918, 933259, 980559, 939607, 869627, 918160, 896156, 836688, 880589, 895947, 942387, 968343, 877037, 951626, 921266, 837340, 789832, 738831, 766772, 785163, 826495, 832757, 931164, 863661, 863853, 828827, 795492, 843515, 813296, 775820, 827122, 690070, 765492, 725383, 760337, 736711, 621135, 690057, 597077, 563632, 654411, 677529, 547591, 663381, 678543, 623061, 610827, 597829, 627898, 504698, 509816, 597405, 713995, 660305, 668815, 637535, 357360, 592984, 547410, 537951, 689951, 650775, 483280, 625479, 666698, 583471, 658168, 665125, 541969, 468305, 608579, 610767, 729000, 824900, 717376, 629530, 632994, 726028, 797760, 680006, 685884, 851629, 895438, 937984, 963821, 992956, 960907, 918607, 1006642, 958152, 793253]
2805G93253M4898K8018n4245l2891m7271l0765O8789j02517r4580Q8005q4311
2794E76383r3431P5174j43304j543J19934L1346m9003j15738L020N5086j41439
2783C16485N181M3769N3874m7853L6670O2031n0039k7595N3453J3122n2506P5613
2771D82205n2514l2082N2264k0942m158p9337j07585j3941n8565M0736J88457
2760C94538L1757l849p6125k44045N9229J01819K1060k6461K4302r5333o6184
2749A20708n0373M9419K7035J2550o5423J1536r114J38801l1125K1650l9351r4444
2737I1869K7616J03232k7295l8251o8435J37528L3554k1252J06424k05583P512
2726A46919j36330n4152J06132J4989Q9807N2686n591p0537j1374K9216r2780
$$ y = [793253, 838151, 866169, 811924, 779033, 731762, 700997, 769786, 667269, 572689, 660694, 576383, 482952, 558126, 414822, 413279, 533213, 564559, 515556, 399818, 402838, 457924, 316485, 321666, 365435, 419309, 371456, 408126, 470157, 420118, 392523, 445976, 459098, 406592, 482205, 429691, 397609, 449873, 428931, 424773, 345436, 237851, 223910, 165345, 206081, 394538, 426295, 422446, 346321, 102276, 161505, 263324, 284384, 257923, 282225, 186892, 120708, 70335, 119754, 146789, 159339, 93916, 105452, 96338, 235139, 204014, 225664, 186313, 91869, 119485, 222717, 195422, 157171, 88736, 226264, 259818, 238566, 344990, 139407, 146919, 10589, -43563, 62569, 77558, 167365, 220051, 214460, 143923, 132549, 161765, 68985]
2715F8985o228j52419J73122L6427j3410p2303Q9954L8244o195O2751k89538K0054
2703e0556P6988k8467j2675O9643l8988p0260M2580O6008M8679r2754L6376J56827
2691B03401R401L454j93573N9601J18755P562Q0580j9938k26111k28580K12668
2680B7220M9296k600M2893M734K6824j16764m5823J13005q6512M3711L8022K570
2668I6576n0795K686J85413q1210o6282k9827j48622K3310k0458J36243J38451
$$ y = [68985, 62757, -89662, 83460, 119887, 106477, 34174, 124128, 162372, 156177, 218928, -70610, -50556, 26432, -2035, -14710, 54933, 15945, -54315, -11735, 54273, 102952, 10198, 46574, 203401, 212802, 216256, 22683, 82284, 201039, 208601, 289181, 269243, 43132, -185448, 27220, 76516, 73916, 116809, 121543, 148367, 31603, -14220, 98785, 12273, 55984, 94006, 96576, 45781, 48467, 233880, 152670, 86388, 56561, -92061, -68751, -89209, 47034, 185485]
$$ [...]
##END NTUPLES=NMR SPECTRUM
##END=
