##TITLE=1H_DE-80H_X3
 200.13MHz, d2o
 8 sc
 
 19ns.26.2.2025
##JCAMPDX= 6.0         $$ Bruker NMR JCAMP-DX V2.0
##DATA TYPE= NMR SPECTRUM
##DATA CLASS= NTUPLES
##ORIGIN= UXNMR, Bruker Analytische Messtechnik GmbH
##OWNER= pz
$$ XWIN-NMR		Version 3.5
$$ Wed Jan 28 13:38:11 2026 Russian Standard Time (UT+4h)  Yarkov@DPX200
##.OBSERVE FREQUENCY= 200.1313
##.OBSERVE NUCLEUS= ^1H
##.ACQUISITION MODE= SIMULTANEOUS
##.ACQUISITION SCHEME= undefined
##.AVERAGES= 8
##.DIGITISER RES= 18
##SPECTROMETER/DATA SYSTEM= spect
##.PULSE SEQUENCE= zg30
##.SOLVENT NAME= DMSO
##.SHIFT REFERENCE= (INTERNAL, DMSO, 0, 15.4747)
##AUDIT TRAIL= $$ (NUMBER, WHEN, WHO, WHERE, WHAT)
$$ ##TITLE= Audit trail, XWIN-NMR		Version 3.5
$$ ##JCAMPDX= 5.01
$$ ##ORIGIN= Bruker BioSpin GmbH
$$ ##OWNER= Yarkov
$$ C:/Bruker/XWIN-NMR/data/yarkov2/nmr/H-C/1/pdata/1/auditp.txt
$$ ##AUDIT TRAIL=  $$ (NUMBER, WHEN, WHO, WHERE, WHAT)
(   1,<2026-01-28 13:37:09.93 +0400>,<Yarkov>,<DPX200>,
      <created by zg, POWCHK disabled, PULCHK disabled
       configuration hash MD5:
       00 E9 B6 7A A2 85 ED C7 34 08 36 98 17 FE 4E 26
       data hash MD5: 16K
       7A 73 7E 47 18 25 9F 13 9B ED 05 1A 28 12 52 49>)
(   2,<2026-01-28 13:37:32.35 +0400>,<Yarkov>,<DPX200>,
      <Start of raw data processing
       efp BC_mod = 2 LB = 0.25 FT_mod = 6 PKNL = 1 PHC0 = -5294.697 PHC1 = 7.62193 SI = 16K 
       data hash MD5: 16K
       E9 23 C4 E7 E5 34 E5 9E 48 A9 E6 37 5B 11 33 1D>)
$$ ##END=
$$ 
$$ hash MD5
$$ 8F 98 4D E3 70 26 DE E2 91 DE C0 2D CD A0 1C A3
##$RELAX= 
##$RELAX= 
##$RELAX= 
##$RELAX= 
##$RELAX= 
##$RELAX= 
$$ Bruker specific parameters
$$ --------------------------
##$DU= <C:/Bruker/XWIN-NMR>
##$EXPNO= 1
##$NAME= <H-C>
##$PROCNO= 1
##$TYPE= <nmr>
##$USER= <yarkov2>
##$AMP= (0..31)
100 100 100 100 100 100 100 100 100 100 100 100 100 100 100 100 100 100 
100 100 100 100 100 100 100 100 100 100 100 100 100 100 
##$AQSEQ= 0
##$AQ_mod= 1
##$AUNM= <au_zg>
##$AUTOPOS= <>
##$BF1= 200.13
##$BF2= 200.13
##$BF3= 200.13
##$BF4= 200.13
##$BF5= 200.13
##$BF6= 200.13
##$BF7= 200.13
##$BF8= 200.13
##$BYTORDA= 1
##$CFDGTYP= 0
##$CFRGTYP= 5
##$CHEMSTR= <none>
##$CNST= (0..31)
1 1 145 1 1 1 1 1 1 1 1 1 1 1 1 1 1 1 1 1 1 1 1 1 1 1 1 1 1 1 1 1 
##$CPDPRG= <>
##$CPDPRG1= <>
##$CPDPRG2= <>
##$CPDPRG3= <>
##$CPDPRG4= <mlev>
##$CPDPRG5= <mlev>
##$CPDPRG6= <mlev>
##$CPDPRG7= <mlev>
##$CPDPRG8= <mlev>
##$CPDPRGB= <>
##$CPDPRGT= <>
##$D= (0..31)
0 0.7 0 0 0 0 0 0 0 0 0 0.03 0 0 0 0 0 0 0 0 0 0 0 0 0 0 0 0 0 0 0 0 
##$DATE= 1769593029
##$DBL= (0..7)
120 120 120 120 120 120 120 120 
##$DBP= (0..7)
150 150 150 150 150 150 150 150 
##$DBP07= 0
##$DBPNAM0= <>
##$DBPNAM1= <>
##$DBPNAM2= <>
##$DBPNAM3= <>
##$DBPNAM4= <>
##$DBPNAM5= <>
##$DBPNAM6= <>
##$DBPNAM7= <>
##$DBPOAL= (0..7)
0.5 0.5 0.5 0.5 0.5 0.5 0.5 0.5 
##$DBPOFFS= (0..7)
0 0 0 0 0 0 0 0 
##$DE= 6
##$DECBNUC= <off>
##$DECIM= 32
##$DECNUC= <off>
##$DECSTAT= 4
##$DIGMOD= 1
##$DIGTYP= 9
##$DL= (0..7)
0 120 120 120 120 120 120 120 
##$DP= (0..7)
$$ [...]
##$SUBNAM2= <"">
##$SUBNAM3= <"">
##$SUBNAM4= <"">
##$SUBNAM5= <"">
##$SUBNAM6= <"">
##$SUBNAM7= <"">
##$SUBNAM8= <"">
##$SUBNAM9= <"">
##$SW= 18.0517328524113
##$SWIBOX= (0..15)
0 0 2 0 0 0 0 0 0 0 0 0 0 0 0 0 
##$SW_h= 3612.71676300578
##$TD= 16384
##$TD0= 1
##$TE= 0
##$TE2= 300
##$TE3= 300
##$TEG= 300
##$TL= (0..7)
0 120 120 120 120 120 120 120 
##$TP= (0..7)
150 150 150 150 150 150 150 150 
##$TP07= 0
##$TPNAME0= <>
##$TPNAME1= <>
##$TPNAME2= <>
##$TPNAME3= <>
##$TPNAME4= <>
##$TPNAME5= <>
##$TPNAME6= <>
##$TPNAME7= <>
##$TPOAL= (0..7)
0.5 0.5 0.5 0.5 0.5 0.5 0.5 0.5 
##$TPOFFS= (0..7)
0 0 0 0 0 0 0 0 
##$TUNHIN= 0
##$TUNHOUT= 0
##$TUNXOUT= 0
##$USERA1= <user>
##$USERA2= <user>
##$USERA3= <user>
##$USERA4= <user>
##$USERA5= <user>
##$V9= 5
##$VALIST= <valist>
##$VCLIST= <CCCCCCCCCCCCCCC>
##$VD= 0
##$VDLIST= <DDDDDDDDDDDDDDD>
##$VPLIST= <PPPPPPPPPPPPPPP>
##$VTLIST= <TTTTTTTTTTTTTTT>
##$WBST= 1024
##$WBSW= 4
##$XGAIN= (0..3)
0 0 0 0 
##$XL= 0
##$YL= 0
##$YMAX_a= 294254
##$YMIN_a= -226328
##$ZGOPTNS= <>
##$ZL1= 120
##$ZL2= 120
##$ZL3= 120
##$ZL4= 120
##$ABSF1= 0
##$ABSF2= 0
##$ABSG= 0
##$ABSL= 0
##$ALPHA= 0
##$AQORDER= 0
##$ASSFAC= 0
##$ASSFACI= 0
##$ASSFACX= 0
##$ASSWID= 0
##$AUNMP= <proc_1d>
##$AZFE= 0.1
##$AZFW= 0.1
##$BCFW= 0
##$BC_mod= 2
##$BYTORDP= 0
##$COROFFS= 0
##$CY= -3
##$DATMOD= 1
##$DC= 0
##$DFILT= <>
##$DTYPP= 0
##$F1P= 0
##$F2P= 0
##$FCOR= 1
##$FTSIZE= 16384
##$FT_mod= 6
##$GAMMA= 0
##$GB= 0
##$INTBC= 1
##$INTSCL= 3.241238e-09
##$ISEN= 128
##$LB= 0.25
##$LEV0= 0
##$LPBIN= 0
##$MAXI= 10000
##$MC2= 0
##$MEAN= 0
##$ME_mod= 0
##$MI= 1.114404
##$NCOEF= 0
##$NC_proc= -7
##$NLEV= 6
##$NOISF1= 3.799351
##$NOISF2= 2.8
##$NSP= 0
##$NTH_PI= 0
##$NZP= 0
##$OFFSET= 15.47475
##$PC= 1
##$PHC0= -5294.697
##$PHC1= 7.62193
##$PH_mod= 1
##$PKNL= yes
##$PPARMOD= 0
##$PSCAL= 0
##$PSIGN= 0
##$REVERSE= no
##$SF= 200.130009396934
##$SI= 16384
##$SIGF1= 3
##$SIGF2= 2
##$SINO= 0.751879
##$SIOLD= 32768
##$SREGLST= <19F.Aceton>
##$SSB= 0
##$STSI= 16384
##$STSR= 0
##$SW_p= 3612.71676300578
##$SYMM= 0
##$S_DEV= 0
##$TDeff= 16384
##$TDoff= 0
##$TI= <>
##$TILT= no
##$TM1= 0
##$TM2= 0
##$TOPLEV= 0
##$USERP1= <user>
##$USERP2= <user>
##$USERP3= <user>
##$USERP4= <user>
##$USERP5= <user>
##$WDW= 1
##$XDIM= 16384
##$YMAX_p= 484543610
##$YMIN_p= -2739872
$$ End of Bruker specific parameters
$$ ---------------------------------
##NTUPLES= NMR SPECTRUM
##VAR_NAME=  FREQUENCY,     SPECTRUM/REAL,   SPECTRUM/IMAG
##SYMBOL=    X,             R,               I
##VAR_TYPE=  INDEPENDENT,   DEPENDENT,       DEPENDENT
##VAR_FORM=  AFFN,          ASDF,            ASDF
##VAR_DIM=   16384,         16384,           16384
##UNITS=     HZ,            ARBITRARY UNITS, ARBITRARY UNITS
##FACTOR=    0.220516191357247, 1,           1
##FIRST=     3096.96177588357, 0,            0
##LAST=      -515.754987122211, 0,           0
##MIN=       -515.754987122211, -2739872,    0
##MAX=       3096.96177588357, 484543610,    0
$$ Real data points
##PAGE= N=1
##DATA TABLE= (X++(R..R)), XYDATA
$$ [...]
$$ plain form
11832 -1086784 -1601949 -442559 -344951 -519080 71752 85874 -470720 -662253 31455 -293713
11822 -293713 -1220745 -482228 -781251 -914268 -1172635 -812330 -1385237 -1033476 -711088 -904454
11812 -904454 -239361 -195669 -287196 -823707 -341464 287927 -664896 -1063688 -1046640 -908782
11802 -908782 -475062 -120117 -351086 -815769 -977125 -1306243 -1132631 -362195 -345796 -137070
11792 -137070 -293497 -719212 -629407 -1314650 -635471 -1088481 -681077 -830922 -718261 -872110
11782 -872110 -686144 -577374 -162025 138962 704030 581646 1039536 1310603 1307363 971416
11772 971416 431438 -342426 -616969 -382977 -187497 -676865 -158315 -217574 542816 -293357
11762 -293357 -727321 -302555 -862206 -588655 -452440 -649731 -286215 -585558 -40440 339650
$$ packed form
11832a086784n15165J159390R7608j74129N90832J4122n56594j91533O93708l25168
11822b93713r27032P38517k99023j33017k58367L60305n72907L51761L22388j93366
11812i04454O65093M3692r1527n36511M82243O29391r52823l98792J7048J37858
11802i08782M33720L54945k30969m64683j61356l29118J73612P70436J6399K08726
11792a37070j56427m25715Q9805o85243O79179m53010M07404j49845J12661j53849
11782h72110J85966J08770M15349L00987N65068j22384M57890K71067l240l35947
11772I71416n39978p73864k74543K33992J95480m89368N18550n9259P60390q36173
11762b93357m33964M24766n59651K73551J36215j97291L63516k99343N45118L80090
$$ plain form
11752 339650 157350 237564 43129 643255 200664 -252115 -1118076 -656798 -848230 -651407
11742 -651407 -564951 -676736 102593 521546 333019 -425614 -1189623 -1637980 -2134894 -1884111
11732 -1884111 -2288481 -1441127 -995426 -1062387 -1188581 -561405 -474244 -230156 -92905 1023145
11722 1023145 545732 262820 230595 571710 76268 -359847 -185765 -525227 -549293 -340489
11712 -340489 -440811 -823592 -1400466 -1172621 -1165458 -1215149 -575071 -468325 -898396 -869603
11702 -869603 -842780 -1324015 -1707053 -974317 -980430 -1100334 -1075706 -1552756 -930601 -1287551
11692 -1287551 -1233854 -1374719 -1359840 -896606 -505340 -468178 147836 226012 49793 192094
11682 192094 349447 -340311 -390496 -469191 -1297442 -642236 -615677 -777993 -887541 -859857
$$ packed form
11752C39650j82300Q0214j94435O00126m42591m52779q65961M61278j91432J96823
11742f51407Q6456j11785P79329M18953j88527p58633p64009m48357m96914K50783
11732a884111m04370Q47354M45701o6961j26194O27176Q7161K44088J37251J116050
11722A023145m77413k82912l2225L41115m95442m36115J74082l39462k4066K08804
11712c40489j00322l82781n76874K27845P163m9691O40078J06746m30071K8793
11702h69603K6823m81235l83038P32736o113j19904K4628m77050O22155l56950
11692a287551N3697j40865J4879M63234L91266L7162O16014P8176j76219J42301
11682A92094J57353o89758n0185p8695q28251O55206K6559j62316j09548K7684
$$ plain form
11672 -859857 -1190810 -1216441 107570 63066 -475823 -704352 -112867 -517149 -546023 -564015
11662 -564015 -571900 -313773 -4041 -313245 -706287 25393 53213 -947323 -550775 237368
11652 237368 -606426 -106224 652299 770741 420207 -18943 403493 -257958 -491317 -491599
11642 -491599 -1397321 -1579452 -772542 -1070315 -1654013 -645237 -283412 -128813 719475
11633 719475 275135 -454090 -623325 -426590 -682417 -1161745 -713489 -778377 -700177 313532
11623 313532 -134095 7941 358200 821323 908189 483467 697239 749745 -372436 55117
11613 55117 102966 -816797 -784327 -748986 -979430 -1405218 -1221898 -429925 -1070454 -1192720
11603 -1192720 -1098007 -299006 -454014 -1023622 -688156 -135426 -320378 -437557 -505461 -263001
$$ packed form
11672h59857l30953k5631J324011m4504n38889k28529N91485m04282k8874j7992
11662e64015p885K58127L09732l09204l93042P31680K7820j000536L96548P88143
11652B37368q43794N00202P58523J18442l50534m39150M22436o61451k33359k82
11642d91599r05722j82131Q06910k97773n83698J008776L61825J54599Q48288
11633G19475m44340p29225j69235J96735k55827m79328M48256o4888P8200J013709
11623C13532m47627J42036L50259M63123Q6866m24722K13772N2506j122181M27553
11613E5117M7849r19763L2470L5341k30444m25788J83320P91973o40529j22266
11603a192720R4713P99001j55008n69608L35466N52730j84952j17179o7904K42460
$$ plain form
11593 -263001 -149823 -419459 -715328 -128878 119229 -248019 48224 1052329 1033856 684643
11583 684643 524238 -166024 -1239722 -1647414 -1055928 -1264738 -1124494 -1489305 -1243518
11574 -1243518 -587455 260950 -422991 -381624 -902270 -1071088 -1048498 -1044064 -792505 -355159
11564 -355159 -645862 -381547 -183064 263311 -64057 -435989 124289 973581 596626 311913
11554 311913 165400 -187516 -78446 534692 23058 -438049 -160592 176728 194856 88369
11544 88369 -853437 -389433 300498 349631 -254883 -43740 193514 -356829 -492405 -211478
11534 -211478 -229868 -397944 131240 630247 410678 641858 342444 -76643 -72113 -375703
11524 -375703 -731350 61579 731004 498201 223374 372383 -444061 -959652 -291386 -519785
$$ packed form
11593b63001J13178k69636k95869N86450K48107l67248K96243J004105j8473l49213
11583F84643j60405o90262j073698m07692N91486k08810J40244l64811K45787
11574a243518O56063Q48405o83941M1367n20646j68818K2590M434K51559M37346
11564c55159k90703K64315J98483M46375l27368l71932N60278Q49292l76955k84713
11554C11913j46513l52916J09070O13138n11634m61107K77457L37320J8128j06487
11544H8369r41806M64004O89931M9133o04514K11143K37254n50343j35576K80927
11534b11478j8390j68076N29184M99007k19569K31180k99414m19087M530l03590
11524c75703l55647P92929O69425k32803k74827J49009q16444n15591O68266k28399
$$ plain form
11514 -519785 -616200 -586209 -140772 832685 1274382 997107 50277 -577334 -196014 -363465
11504 -363465 -464584 -111690 -296723 -581024 -422667 -341603 -597768 -961660 -955669 -1000782
11494 -1000782 -357193 123481 -112513 -165744 -251925 -360519 489181 -385196 -436430 -305552
11484 -305552 -1059297 -911292 -911751 -839025 -641454 -360258 242343 394648 712720 59230
11474 59230 -4905 -375327 678826 291874 -297007 545093 736714 -147905 68037 826
11464 826 -135450 -914571 -1219962 -684927 -700731 -121772 -239429 -469162 -220096 465696
11454 465696 782956 157013 161815 -107438 -139401 479534 513977 421346 -105017 -367786
11444 -367786 48732 289777 481551 134700 249673 -201468 53150 169216 120432 -47226
$$ packed form
11514e19785r6415K9991M45437R73457M41697k77275r46830o27611L81320j67451
11504c63465j01119L52894j85033k84301J58357Q1064k56165l63892N991m5113
11494a000782O43589M80674k35994n3231q6181j08594Q49700q74377n1234J30878
11484c05552p53745J48005m59P2726J97571K81196O02601J52305L18072o53490
11474E9230o4135l70422J054153l86952n88881Q42100J91621q84619K15942o7211
11464H26j36276p79121l05391N35035j5804N78959j17657k29733K49066O85792
11454D65696L17260o25943M802k69253l1963O18935L4443r2631n26363k62769
11444c67786M16518K41045J91774l46851J14973m51141K54618J16066m8784j67658
$$ plain form
11434 -47226 331389 107151 149433 -53753 -362339 -621493 -1056493 -919112 -546256 -287836
11424 -287836 -689145 -188090 616808 778063 477768 371414 219158 -461799 -906349 -326845
11414 -326845 -285068 -153437 -532590 -161145 -296388 -233972 -228617 -110092 395911 562207
11404 562207 447579 -234827 644545 512276 310590 365320 392657 471511 -42177 403474
11394 403474 672005 259843 141175 253030 -554171 -176187 -671258 -626420 -450046 451242
11384 451242 -194647 -1044631 -376853 -35486 57960 -742805 -352294 -607866 -1170711 105865
11374 105865 369369 714908 196624 989040 878501 691666 448693 -319749 -379081 -663849
11364 -663849 26663 206896 -686030 -1076683 -1278899 -681690 -170191 -379602 -439218 -679200
$$ packed form
11434d7226L78615k24238M2282k03186l08586k59154m35000J37381L72856K58420
11424b87836m01309N01055Q04898J61255l00295j06354j52256o80957m44550N79504
11414c26845M1777J31631l79153L71445j35243O2416N355J18525N06003J66296
11404E62207j14628o82406Q79372j32269k01686N4730K7337P8854n13688M45651
11394D03474K68531m12162j18668J11855q07201L77984m95071M4838J76374R01288
11384D51242o45889q49984O67778L41367R3446q00765L90511k55572n62845J276576
11374A05865K63504L45539n18284P92416j10539j86835k42973p68442n9332k84768
11364f63849O90512J80233q92926l90653k02216N97209N11499k09411n9616k39982
$$ plain form
11354 -679200 -713990 -792145 -233276 -178131 -816884 -699475 -679127 -589399 -62353 -30402 -12718
11343 -12718 733147 536627 732692 977736 1162818 1086778 1056476 687175 857820 836858
11333 836858 -12888 678737 1116547 333281 783106 549585 191044 631380 390598 -46736
11323 -46736 -106882 -268473 -539467 -279864 -241109 -277530 125980 -721710 -454829 63933
11313 63933 -583303 135527 -386156 -501641 -764109 -360803 -349183 -559911 -1265178 -1281642
11303 -1281642 -39119 156292 226753 266812 352653 578508 229521 371983 -352469 -212439
11293 -212439 -868506 -565016 -511502 -774089 -319799 101342 202440 98656 -552807 -870053
11283 -870053 -1005413 -729587 -756829 -1320683 -687053 388372 575975 -161691 261102 424990
$$ packed form
11354f79200l4790p8155N58869N5145o38753J17409K0348Q9728N27046L1951J7684
11343a2718P45865j96520J96065K45044J85082p6040l0302l69301J70645k0962
11333H36858q49746O91625M37810p83266M49825k33521l58541M40336k40782m37334
11323d6736o0146j61591k70994K59603L8755l6421M03510q47690K66881N18762
11313F3933o47236P18830n21683j15485k62468M03306J1620k10728p05267j6464
11303a281642J242523J95411P0461M0059Q5841K25855l48987J42462p24452J40030
11293b12439o56067L03490N3514k62587M54290M21141J01098j03784o51463l17246
11283h70053j35360K75826k7242n63854O33630J075425J87603p37666M22793J63888
$$ plain form
11273 424990 57775 182579 712334 706406 639425 413969 526458 408016 181426 -138425
11263 -138425 -305909 63238 -388717 -384241 -35911 -469920 -591995 -601057 -145939 -609255
11253 -609255 -735907 -440317 -531792 230508 74056 -418143 -52351 132358 265596 653875
11243 653875 992653 670353 470555 697960 243933 -361416 -550946 -528855 -710007 -457864
11233 -457864 29070 -79810 -25261 -758015 -1278086 -1426063 -1065925 -598790 -1457249 -1459893
11223 -1459893 -382797 71960 -85338 -223592 -604970 -704339 -767354 -490439 -711902 -691539
11213 -691539 -509215 -352781 -586029 -632609 -170194 -498169 -431014 93470 -197806 666608
11203 666608 936246 176749 -287099 -480632 32559 -431359 -356518 -348247 -475477 -313248
$$ packed form
11273D24990l67215J24804N29755n928o6981k25456J12489j18442k26590l19851
11263a38425j67484L69147m51955M476L48330m34009j22075r062M55118m63316
11253f09255j26652K95590r1475P62300j56452m92199L65792J84709J33238L88279
11243F53875L38778l22300j99798K27405m54027o05349j89530K2091j81152K52143
11233d57864M86934j08880N4549p32754n20071j47977L60138M67135q58459k644
11223a459893J077096M54757j57298j38254l81378r9369o3015K76915k21463K0363
11213f91539J82324J56434k33248m6580M62415l27975O7155N24484k91276Q64414
11203F66608K69638p59497m63848j93533N13191m63918P4841Q271j27230J62229
$$ plain form
11193 -313248 -92507 -143583 82586 714587 606470 217848 220545 132032 -134710 593821
11183 593821 445625 290946 201584 252909 -585584 -545573 -286049 -656297 -1407593 -636130
11173 -636130 76574 -141655 444627 246734 101009 270622 716795 741091 924961 168304
11163 168304 -11540 354870 33176 -608845 -685223 -752023 410108 -171376 112103 574103
11153 574103 915738 821071 751388 608063 735423 415971 544911 92451 -36189 5586
11143 5586 -239731 422318 984565 903384 46341 1004446 759474 1166668 1071907 894385
11133 894385 862028 148960 81152 829862 708823 252789 398779 437813 257207 75961
11123 75961 73893 92831 -357368 -139266 -528879 -936334 -390870 -930304 -1172567 -904233
$$ packed form
11193c13248K20741n1076K26169O32001j08117l88622K697q8513k66742P28531
11183E93821j48196j54679q9362N1325q38493M0011K59524l70248p51296P71463
11173f36130P12704k18229N86282j97893j45725J69613M46173K4296J83870p56657
11163A68304j79844L66410l21694o42021p6378o6800J162131n81484K83479M62000
11153E74103L41635r4667o9683j43325J27360l19452J28940m52460j28640M1775
11143E586k45317O62049N62247q1181q57043R58105k44972M07194r4761j77522
11133H94385l2357p13068o7808P48710j21039m56034J45990L9034j80606j81246
11123G5961k068J8938m50199K18102l89613m07455N45464n39434k42263K68334
$$ plain form
11113 -904233 -1230053 -774335 -812093 -62773 -525352 -1170951 -1340206 -778109 -1302304 -1128473
11103 -1128473 -274034 -201119 -218992 328481 881452 1207779 983432 358311 930168 653970
11093 653970 460178 -93316 -544255 -309246 -440622 -738427 -296062 -314624 38292 -555441
11083 -555441 -486816 -260711 191000 289659 177823 -518619 -216056 -782722 -348683 -1009175
11073 -1009175 -512366 -152463 -47753 46390 -185038 515414 -273914 207301 190865 -140487
11063 -140487 266761 539768 1244061 168227 -497255 37048 110956 8196 -274968 -417
11053 -417 141815 44434 -152366 219365 350518 -216395 368410 444016 302742 475268
11043 475268 -85699 209839 -790113 -1097940 -1070572 -531406 -957579 -1081826 -581468 -419823
$$ packed form
11113i04233l25820M55718l7758P49320m62579o45599j69255N62097n24195J73831
11103a128473Q54439P2915j7873N47473N52971L26327k24347o25121N71857k76198
11093F53970j93792n53494m50939K35009j31376k97805M42365j8562L52916n93733
11083e55441O8625K26105M51711R8659j11836o96442L02563n66666M34039o60492
11073a009175M96809L59903J04710R4143k31428P00452p89328M81215j6436l31352
11063a40487M07248K73007P04293j075834o65482N34303P3908j02760k83164K74551
11053d17J42232r7381j96800L71731J31153n66913N84805P5606j41274J72526
11043D75268n60967K95538r99952l07827K7368N39166m26173j24247N00358J61645
$$ plain form
11033 -419823 -321972 -479522 -875497 -768790 -1065072 -913159 -858953 -1010812 -1106729 -731503
11023 -731503 -921184 -1322358 -1189683 -871534 -863870 14108 310514 -152497 5455 41088
11013 41088 406825 313206 -490440 306380 419705 -528731 -26923 554056 25150 -1340139
11003 -1340139 -898590 -200170 547537 69686 453087 35568 -490871 -498969 -19350 295952
10993 295952 -252787 453372 888801 777249 663448 107668 -355894 -347182 -437276 20100
10983 20100 -250387 -207013 610383 894484 603141 655443 819308 969820 1759618 1025996
10973 1025996 428985 963483 694612 666656 -17247 46207 -610890 -902725 -360835 -604492
10963 -604492 -185590 174790 -325630 -341551 540338 737344 -282368 -132094 105906 -412893
$$ packed form
11033d19823R7851j57550l95975J06707k96282J51913N4206j51859r5917L75226
11023g31503j89681m01174J32675L18149P664Q77978K96406m63011J57952L5633
11013D1088L65737r3619q03646P96820J13325r48436N01808N80979n28906j365289
11003a340139M41549O98420P47707m77851L83401m17519n26439q098M79619L15302
10993B95952n48739P06159M35429j11552j13801n55780m63562Q712r0094M57376
10983B0100k70487M3374Q17396K84101k91343N2302J63865J50512P89798p33622
10973A025996n97011N34498k68871k7956o83903O3454o57097k91835N41890k43657
10963f04492M18902L60380n00420j5921Q81889J97006j019712J50274K38000n18799
$$ plain form
10953 -412893 -941723 43821 402119 284645 -244831 744561 1462388 1373335 1103268 429571
10943 429571 1044755 776645 369001 1213531 1466730 1590355 1250790 935155 1230854 972304
10933 972304 152106 677128 995052 1052295 1440306 1413484 2214080 2091352 1442977 1268515
10923 1268515 1122068 1083817 1826655 2057616 2855867 2500968 2282678 2354441 2212893 2630197
10913 2630197 2565748 1742291 2392459 2831935 3092891 3159188 2936244 2418955 2192653 1729297
10903 1729297 1959669 2123063 2023690 2830506 2051654 2530911 3193266 2301830 2322979 2699019
10893 2699019 2635822 2333543 2771758 2288067 1622257 1430815 1769784 1623288 1107408 2092464
10883 2092464 2082368 1802129 2118565 1508789 820115 1972320 2704590 1272102 1191463
$$ packed form
10953d12893n28830R85544L58298j17474n29476R89392P17827q9053k70067o73697
10943D29571O15184k68110m07644Q44530K53199J23625l39565l15635K95699k58550
10933I72304q20198N25022L17924N7243L88011k6822Q00596j22728o48375j74462
10923A268515j46447l8251P42838K30961P98251l54899k18290P1763j41548M17304
10913B630197o4449q23457O50168M39476K60956O6297k22944n17289k26302m63356
10903A729297K30372J63394r9373Q06816p78852M79257O62355q91436K1149L76040
10893B699019o3197l02279M38215m83691o65810j91442L38969j46496n15880R85056
10883B092464j0096k80239L16436o09776o88674J152205P32270j432488q0639
$$ plain form
10874 1191463 1536161 1660147 1163355 1472029 1836452 1282698 1299840 2224831 2454240 2693289
10864 2693289 2532754 2795456 2647605 1833280 2174742 1803152 1657341 1908479 1349774
10855 1349774 1738766 1954895 1169070 518752 563442 403635 307849 323463 799353 1352797
10845 1352797 974003 1520585 2081431 1568216 1677023 1475973 1964499 1400192 1180738
10836 1180738 1888621 1112965 909895 1143827 1266627 555099 908667 783850 -187657
10827 -187657 129971 288451 263675 329691 1224329 1877505 1707312 1233114 1588141 1550418
10817 1550418 574088 1669809 1627833 1774925 1864587 2374282 2367934 2311140 1731455 937979
10807 937979 871371 971055 1263889 1097991 1795705 2715414 1968845 1765788 2038777 2019172
$$ packed form
10874A191463L44698J23986m96792L08674L64423n53754J7142R24991K29409K39049
10864B693289j60535K62702j47851q14325L41462l71590j45811K51138n58705
10855A349774L88992K16129p85825o50318M4690j59807r5786J5614M75890N53444
10845A352797l78794N46582N60846n13215J08807k01050M88526n64307k19454
10836A180738P07883p75656k03070K33932J22800p11528L53568j24817r71507
10827a87657L17628J58480k4776O6016Q94638O53176j70193m74198L55027l7723
10817A550418r76330J095721m1976J47092Q9662N09695o348n6794n79685p93476
10807I37979o6608R9684K92834j65898O97714R19709p46569k03057K72989j9605
$$ plain form
10797 2019172 1330874 841079 1571598 1197465 1592574 2207535 2209297 2501916 2370276 2134618
10787 2134618 2461542 2580626 1877746 1262060 1802586 2263154 2365473 2063730 2083497 2848492
10777 2848492 2560014 2292061 1641879 2012178 1629218 1793728 1540483 1405986 1673162
10768 1673162 1658447 1798170 1439406 756611 718246 927564 1586217 1658066 1167699 1173381
10758 1173381 1841378 1251576 880949 280874 174405 -349674 -850904 -505482 -119894
10749 -119894 -297435 -555738 675866 818687 1156593 647655 661190 311545 369086 1042963
10739 1042963 72822 122751 487113 475684 307440 -123926 32369 -161901 23638 538054
10729 538054 93085 286835 895779 776162 668837 1056978 1030380 -17206 -186055 -117466
$$ packed form
10797B019172o88298m89795P30519l74133L95109O14961J762K92619j31640k35658
10787B134618L26924J19084p02880o15686N40526M60568J02319l01743J9767P64995
10777B848492k88478k67953o50182L70299l82960J64510k53245j34497K67176
10768A673162j4715J39723l58764o82795l8365K09318O58653P1849m90367N682
10758A173381O67997n89802l70627o00075j06469n24079n01230L45422L85588
10749a19894j77541k58303J231604J42821L37906n08938J3535l49645N7541O73877
10739A042963r70141M9929L64362j1429j68244m31366J56295j94270J85539N14416
10729E38054m44969J93750O08944j19617j07325L88141k6598j047586j68849O8589
$$ plain form
10719 -117466 -411766 -690998 -45466 348576 466649 673341 1441515 641875 683477 700044
10709 700044 -220589 -253479 79729 281133 389870 63707 65309 -321150 -752190 -587419
10699 -587419 -984379 -1000313 -690014 271177 864014 625586 25679 656047 499440 -206580
10689 -206580 -544014 -743263 -1121526 -959799 -438644 159043 -598522 -912696 -481360 -975544
10679 -975544 -1034317 -461053 -1303455 -1480127 226945 -241485 -291195 -329458 -98579 -550600
10669 -550600 -789312 -331157 -98344 -575932 -448012 -471855 -272461 -92536 -299444 -305446
10659 -305446 139926 218465 64902 -660038 -281213 -325936 -399483 -138197 550281 -106342
10649 -106342 -212750 283196 -647459 -1148418 -596608 71024 -55294 -151133 631704 1113258
$$ packed form
10719a17466k94300k79232O45532L94042J18073K06692P68174p99640M1602J6567
10709G00044r20633l2890L33208K01404J08737l26163J602l86459m31040J64771
10699e87419l96960j5934L10299R61191N92837k38428n99907O30368j56607p06020
10689b06580l37434j99249l78263J61727N21155N97687p57565l14174M31336m94184
10679i75544n8773N73264q42402j76672J707072m68430m9710l8263K30879m52021
10669e50600k38712M58155K32813m77588J27920k3843J99394J79925k06908o002
10659c05446M45372P8539j53563p24940L78825m4723p3547K61286O88478o56623
10649a06342j06408M95946r30655n00959N51810O67632j26318r5839P82837M81554
$$ plain form
10639 1113258 291181 296376 315074 -205842 -341130 -367141 -252336 743188 580553 302176
10629 302176 984991 1131647 744334 479850 917454 1159961 501531 939657 814920 525794
10619 525794 358856 457381 275030 -243169 -91044 -434092 -114362 98829 377722 259340
10609 259340 702515 1033799 575289 214589 136645 774185 213179 715387 497850 429310
10599 429310 107975 883517 757049 352704 -256575 -736309 -337205 -535515 -414161 -967922
10589 -967922 -961095 -636565 -72555 -94669 -283226 -926503 -1157432 -303994 -528248 -1411093
10579 -1411093 -2061465 -1316494 -1593081 -1392820 -210987 -978879 -294220 214438 692005
10570 692005 698247 736160 830906 576080 975320 1641410 1364789 427469 755963 986949
$$ packed form
10639A113258q22077N195J8698n20916j35288k6011J14805R95524j62635k78377
10629C02176O82815J46656l87313k64484M37604K42507o58430M38126j24737k89126
10619E25794j66938R8525j82351n18199J52125l43048L19730K13191K78893j18382
10609B59340M43175L31284m58510l60700p7944O37540n61006N02208k17537o8540
10599D29310l21335P75542j26468m04345o09279m79734L99104j98310J21354n53761
10589i67922O827L24530N64010k2114j88557o43277k30929Q53438k24254q82845
10579a411093o50372P44971k76587K00261J181833p67892O84659N08658M77567
10570F92005O242L7913R4746k54826L99240O66090k76621r37320L28494K30986
$$ plain form
10560 986949 35190 -395305 272183 20933 397441 349254 916882 1297989 1141665 607434
10550 607434 622996 254470 141737 -324381 61344 82920 99561 615957 539987 187690
10540 187690 -19462 -48857 -471644 -683887 -711503 -609891 -701241 -649015 -507566 -375355
10530 -375355 -210843 -439878 -887795 -943570 -469743 -648169 -590478 11022 330769 653453
10520 653453 748614 645440 430088 -458036 13680 784 -148081 -219687 -708274 -40505
10510 -40505 249206 -13508 -91922 116779 96341 -496229 -648577 -707215 -856699 -890414
10500 -890414 -629154 6539 -992222 -440065 -269376 -362780 -609912 84395 -318903 128860
10490 128860 684347 688681 1270342 942270 446508 191207 310572 796788 -113009 434660
$$ packed form
10560I86949r51759m30495O67488k51250L76508m8187N67628L81107j56324n34231
10550F07434J5562l68526j12733m66118L85725K1576J6641N16396p5970l52297
10540A87690k07152k9395m22787k12243k7616J01612r1350N2226J41449J32211
10530c75355J64512k29035m47917n5775M73827j78426N7691O01500L19747L22684
10520F53453R5161j03174k15352q88124M71716j2896j48865p1606m88587O67769
10510d0505K89711k62714p8414K08701k0438n92570j52348n8638j49484l3715
10500h90414K61260O35693r98761N52157J70689r3404k47132O94307m03298M47763
10490A28860N55487M334N81661l28072m95762k55301J19365M86216r09797N47669
$$ plain form
10480 434660 772599 1573456 1726857 1322848 1065080 522338 491803 157316 423280 -103867
10470 -103867 474817 649900 1159958 1047613 910330 1262059 1211779 1489703 1056942 1098275
10460 1098275 1148993 1434195 1109017 685010 715103 172324 452019 155024 232874 787729
10450 787729 797699 230078 -107588 78794 -18560 -720006 -571043 461997 -67606 211184
10440 211184 187634 -154406 22848 387446 616656 621069 418274 519771 171351 -220538
10430 -220538 58977 -354336 -232466 246385 -122251 -290931 362850 629143 549123 674425
10420 674425 309036 255672 -441624 101983 297796 -620538 -397338 433658 549288 652193
10410 652193 965451 1884316 1558025 1184391 1962764 1603460 934510 936504 1299291 928069
$$ packed form
10480D34660L37939Q00857J53401m04009k57768n42742l0535l34487K65964n27147
10470a03867N78684J75083N10058j12345j37283L51729n0280K77924m32761M1333
10460A098275N0718K85202l25178m24007L0093n42779K79695k96995P7850N54855
10450G87729R970n67621l37666J86382r7354p01446J48963J033040n29603K78790
10440B11184k3550l42040J77254L64598K29210M413k02795J01497l48420l91889
10430b20538K79515m13313J21870M78851l68636j68680O53781K66293q0020J25302
10420F74425l65389n3364o97296N43607J95813r18334K23200Q30996J15630J02905
10410F52193L13258R18865l26291l73634P78373l59304o68950J994L62787l71222
$$ plain form
10400 928069 708477 685263 695417 861915 1204880 925817 1742462 1779774 2344522 1783393
10390 1783393 2365407 1935770 1125838 1811407 1372174 549092 304448 733645 1194984
10381 1194984 742510 1411970 1545116 1295365 1146888 1369913 919670 721169 574530
10372 574530 471120 1006010 827200 -80436 294881 628173 427551 194579 507526 732787
10362 732787 576708 1307350 1674212 1216077 734611 600869 483863 685989 431896 92231
10352 92231 -364215 761203 537873 460167 87454 125802 394799 -18869 166043 -311286
10342 -311286 -334558 474779 54545 156503 -348897 109932 875886 587818 675521 361007
10332 361007 637200 1010165 847686 940431 626737 1246645 520525 549887 8493 -74107
$$ packed form
10400I28069k19592k3214J0154J66498L42965k79063Q16645L7312N64748n61129
10390A783393N82014m29637q09932O85569m39233q23082k44644M29197M61339
10381A194984m52474O69460J33146k49751j48477K23025m50243j98501j46639
10372E74530j03410N34890j78810r07636L75317L33292k00622k32972L12947K25261
10362G32787j56079P30642L66862m58135m81466j33742j17006K02126k54093l39665
10352I2231m56446J125418k23330p7706l72713L8348K68997m13668J84912m77329
10342c11286k3272Q09337m20234J01958n05400M58829P65954k88068Q7703l14514
10332C61007K76193L72965j62479R2745l13694O19908p26120K9362n41394q2600
$$ plain form
10322 -74107 -153111 -313304 -162516 13063 865251 828048 691077 856042 739642 274047
10312 274047 -100262 -205159 -222422 13806 696356 293353 686986 743508 913441 12968
10302 12968 569943 663655 293383 1032593 1577846 1109948 1664493 1712367 2273059 1541269
10292 1541269 1166392 1590001 1521037 2071098 2077951 1773640 2093533 2589452 2137371 2253181
10282 2253181 1884679 1939068 1512228 1672789 1504388 1440684 1489308 1502933 2409997 2006691
10272 2006691 1800546 1728367 1306652 1559173 549417 1214654 1454083 1416083 1763900 1229846
10262 1229846 1621550 1694429 933114 1240621 1233314 2011529 1861859 1963871 2369148 2475237
10252 2475237 2617711 2301664 2660541 2531405 2796631 2499758 2266145 2906909 3177368
$$ packed form
10322g4107p9004j60193J50788J75579Q52188l7203j36971J64965j16400m65595
10312B74047l74309j04897j7263K36228O82550m03003L93633N6522J69933r00473
10302A2968N56975R3712l70272P39210N45253m67898N54545M7874N60692p31790
10292A541269l74877M23609o8964N50061O853l04311L19893M95919m52081J15810
10282B253181l68502N4389m26840J60561j68401o3704M8624J3625R07064m03306
10272B006691k06145p2179m21715K52521j009756O65237K39429l8000L47817n34054
10262A229846L91704P2879p61315L07507p307P78215j49670J02012M05277J06089
10252B475237J42474l16047L58877j29136K65226k96873k33613O40764K70459
$$ plain form
10243 3177368 2763365 2285463 2164041 2124410 1639382 2276400 2399461 2886061 3441145 3660961
10233 3660961 3460425 3772476 3781522 2754466 2691453 2458743 2890256 3217834 2755066 3145445
10223 3145445 2948789 3310687 3636473 3686768 3229403 3299437 2827179 3563323 3860574 2729511
10213 2729511 2634406 3196214 2567969 2548658 2902515 3406970 2826390 2375836 3069796 3265735
10203 3265735 3656441 3471835 4142592 4412803 4321018 4219307 4293030 4283375 3808552 4336237
10193 4336237 4714894 4997122 5303871 5363509 5910632 6020183 6419501 5420178 5689589 6197877
10183 6197877 6145892 5212326 6002535 5555718 5416519 6114145 6031805 5363485 5645508 6192916
10173 6192916 6561522 6800367 7158020 7710958 6898418 6979431 7551085 7594483 8090918 8458357
$$ packed form
10243C177368m14003m77902j21422l9631m85028O37018J23061M86600N55084K19816
10233C660961k00536L12051R046j027056o3013k32710M31513L27578m62768L90379
10223C145445j96656L61898L25786N0295m57365P0034m72258P36144K97251j131063
10213B729511r5105N61808o28245j9311L53857N04455n80580m50554O93960J95939
10203C265735L90706j84606O70757K70211r1785j01711P3723r655m74823N27685
10193D336237L78657K82228L06749N9638N47123J09551L99318r99323K69411N08288
10183F197877n1985r33566P90209m46817j39199O97626q2340o68320K82023N47408
10173F192916L68606K38845L57653N52938q12540Q1013N71654M3398M96435L67439
$$ plain form
10163 8458357 8515283 9095872 9299451 9576486 9540645 10585722 11142830 11894455 12449279 13228399
10153 13228399 13705722 14174641 15028485 14833870 15064681 16241890 17579887 18609565 19980586
10144 19980586 21398924 22500207 23001509 24615577 26455518 27229060 28497815 30288965
10136 30288965 32439161 33330697 35128919 37292253 38043848 38580005 39629780 41354118
10128 41354118 41601498 41101746 40353693 39827203 39667633 39055201 37882296 36294460 35611232
10119 35611232 35044481 33579123 32947647 31730727 30940790 30709512 30793865 30853578 30499418
10110 30499418 30323585 31287124 31742816 31570344 32066148 32481155 33337446 34576583 35313977
10101 35313977 36527547 38017893 39377935 39725951 40484662 41879631 42111571 42317002 42230508
$$ packed form
10163H458357N6926N80589K03579K77035l5841J045077N57108P51625N54824P79120
10153A3228399M77323M68919Q53844j94615K30811J177209J337997J029678J371021
10144A9980586J418338J101283N01302J614068J839941P73542J268755J791150
10136C0288965K150196Q91536J798222K163334P51595N36157J049775J724338
10128D1354118K47380m99752p48053n26490j59570o12432j172905j587836o83228
10119C5611232n66751j465358o31476j216920p89937k31278Q4353N9713l54160
10110C0499418j75833R63539M55692j72472M95804M15007Q56291J239137P37394
10101C5313977J213570J490346J360042L48016P58711J394969K31940K05431q6494
$$ plain form
10092 42230508 42129380 41307230 40392055 38916820 37015414 35863494 34641368 32638773
10084 32638773 30701664 29543234 28435084 26462204 24726835 23922362 22623515 21239419
10076 21239419 20325378 19309904 19087017 18092620 16680074 16348155 15727510 14780231 14248223
10067 14248223 13907702 13529375 13011285 13142215 13146979 13111006 12886256 11800747 11042095 11792422
10057 11792422 11989716 11454725 11657013 11396667 10650061 10456920 10522042 9578338 9007864
10048 9007864 9085532 8735730 8179665 8464769 9113596 7948799 8524583 8513579 8425533 7941962
10038 7941962 8007695 7748920 7569258 7301105 7424165 7455065 7127044 8006158 7815797 8033982
10028 8033982 8155552 8496141 8266161 8390143 8560960 8320870 8539713 8295141 8422694
$$ packed form
10092D2230508j01128q22150r15175j475235j901406j151920j222126k002595
10084C2638773j937109j158430j108150j972880j735369q04473j298847j384096
10076B1239419r14041j015474k22887r94397j412546l31919o20645r47279n32008
10067A4248223l40521l78327n18090J30930M764l5973k24750j085509p58652P50327
10057A1792422J97294n34991K02288k60346p46606j93141O5122r43704n70474
10048I007864P7668l49802n56065K85104O48827j164797N75784j1004q8046m83571
10038G941962O5733k58775j79662k68153J23060L0900l28021Q79114j90361K18185
10028H033982J21570L40589k29980J23982J70817k40090K18843k44572J27553
$$ plain form
10019 8422694 8572149 8534957 7893227 6887268 6912006 7195876 7105735 7098327 6888477 7228023
10009 7228023 6594769 5892393 5514896 5102427 4429242 4426355 4396262 4164763 5286733 5584760
9999 5584760 5991053 5600425 4557052 4345004 4839685 5257894 5352782 4993194 5663583 5698478
9989 5698478 5269360 4822302 4614504 4710534 4588374 4570418 4622808 5431735 5362622 4735112
9979 4735112 4713899 4281617 4581541 4618202 3922482 3883817 3513049 3812661 3503023 3301459
9969 3301459 3572628 3905633 3525623 3175282 4269279 4365231 3743713 3436619 3514945 3179671
9959 3179671 3230495 3219679 3177566 3433502 3350111 3141917 3377839 3540360 3484972 3568310 3961443
9948 3961443 4182813 4065642 2657980 2433012 2471535 3232034 3140159 2939142 3260357 3781197
$$ packed form
10019H422694J49455l7192o41730j005959K4738K83870r0141p408k09850L39546
10009G228023o33254p02376l77497m12469o73185k887l0093k31499J121970K98027
9999E584760M06293l90628j043373k12048M94681M18209R4888l59588O70389L4895
9989E698478m29118m47058k07798R6030j22160j7956N2390Q08927o9113o27510
9979D735112k1213m32282K99924L6661o95720l8665l70768K99612l09638k01564
9969C301459K71169L33005l80010l50341J093997R5952o21518l07094P8326l35274
9959C179671N0824j0816m2113K55936q3391k08194K35922J62521n5388Q3338L93133
9948C961443K21370j17171j407662k24968L8523P60499r1875k01017L21215N20840
$$ plain form
9938 3781197 3902809 3694082 3910248 3644105 3422903 3470597 3726320 3994508 3907184 3392327
9928 3392327 2992098 2298414 2462016 2647373 2208335 2187424 2405367 2979239 2308194 2729350
9918 2729350 2512325 1809472 1750592 1730531 2335017 2538956 2529154 2537805 2504493 2474249 2164734
9907 2164734 1867788 1695210 1657800 1430767 1169952 1916872 1932848 1428296 955413 1380126
9897 1380126 2155505 1446537 1078166 1268946 849461 683083 334587 801431 653052 353930
9887 353930 858044 884782 1264347 869941 559494 755282 361278 650182 1209695 1243984
9877 1243984 1676569 1329310 1264810 1420205 1366875 1145291 633352 829934 1363167 1501132
9867 1501132 898550 981444 1168220 1253662 195778 -10236 348867 153389 -168598 401
$$ packed form
9938C781197J21612k08727K16166k66143k21202M7694K55723K68188q7324n14857
9928C392327m00229o93684J63602J85357m39038k0911K17943N73872o71045M21156
9918B729350k17025p02853n8880k0061O04486K03939r802Q651l3312l0244l09515
9907B164734k96946j72578l7410k27033k60815P46920J5976n04552m72883M24713
9897A380126P75379p08968l68371J90780m19485j66378l48496M66844j48379k99122
9887C53930N04114K6738L79565l94406l10447J95788l94004K88904N59513L4289
9877A243984M32585l47259o4500J55395n3330k21584n11939J96582N33233J37965
9867A501132o02582Q2894J86776Q5442j057884k06014L59103j95478l21987J68999
$$ plain form
9857 401 -197679 -643940 -685707 471981 445399 -484471 170664 822228 695201 182062
9847 182062 358009 -73944 -231486 -116499 -17934 64300 -95941 -30073 91072 221119
9837 221119 734629 619382 300987 1481175 1973974 1230308 397003 1036199 868460 748358
9827 748358 263828 193745 381255 250563 1182173 1006776 1288043 708466 666529 1330041
9817 1330041 1009974 997574 72872 138564 -316004 -371240 -608717 -279280 -798888 -700164
9807 -700164 -194433 406706 910488 647058 650487 699822 1018059 497542 441454 654000
9797 654000 797941 1437577 1087356 1275325 885445 1173211 1044723 435888 431858 606597
9787 606597 907189 1075567 1306052 1281472 1469434 1744682 774830 485857 1072106 1018388
$$ packed form
9857D01j98080m46261m1767J157688k6582r29870O55135O51564j27027n13139
9847A82062J75947m31953j57542J14987R8565Q2234j60241O5868J21145J30047
9837B21119N13510j15247l18395J180188M92799p43666q33305O39196j67739j20102
9827G48358m84530p0083J87510j30692R31610j75397K81267n79577m1937O63512
9817A330041l20067j2400r24702O5692m54568n5236k37477L29437n19608R8724
9807g00164N05731O01139N03782k63430L429M9335L18237n20517n6088K12546
9797F54000J43941O39636l50221J87969l89880K87766j28488o08835m030J74739
9787F06597L00592J68378K30485k4580J87962K75248r69852k88973N86249n3718
$$ plain form
9777 1018388 852000 912905 885834 1319979 842134 590201 584341 -119804 -191626 186260
9767 186260 559412 -189070 975530 991935 1543459 2103056 1796638 1321039 676353 564760
9757 564760 353012 -136351 185023 303032 112066 -115714 896733 926433 -63264 -140889
9747 -140889 952357 1192597 612409 406056 1078404 1393771 699118 463178 139386 19214
9737 19214 -2476 -169816 153736 511640 566028 773918 1453510 1377721 1004297 1851666
9727 1851666 1512055 703479 1262144 933665 579763 1461269 1581718 1471586 1237101 883927
9717 883927 513223 183087 886287 669450 413121 663705 910649 957944 1354129 1308605
9707 1308605 628686 944961 1563605 -26130 516448 645547 103460 -214640 743472
$$ packed form
9777A018388j66388O0905k7071M34145m77845k51933n860p04145p1822L77886
9767A86260L73152p48482J164600J6405N51524N59597l06418m75599o44686j11593
9757E64760k11748m89363L21374J18009j90966k27780J012447K9700r89697p7625
9747a40889J093246K40240n80188k06353O72348L15367o94653k35940l23792j20172
9737A9214k1690j67340L23552L57904N4388K07890O79592p5789l73424Q47369
9727A851666l39611q08576N58665l28479l53902Q81506J20449j10132k34485l53174
9717H83927l70704l30136P03200k16837k56329K50584K46944M7295L96185m5524
9707A308605o79919L16275O18644j589735N42578J29099n42087l18100R58112
$$ plain form
9698 743472 333559 21403 580756 1392738 413876 32509 657427 1148318 -198079 -188634
9688 -188634 -106324 -127289 552180 703953 677785 890995 829055 680717 1267289 1176303 1025482
9677 1025482 497072 561284 813213 350016 -26645 -159649 -408698 -273370 -232853 -281236
9667 -281236 -619436 -57540 259805 -526034 15590 245965 -623713 44074 301187 605888
9657 605888 11860 -304548 -456559 -81192 -1113881 -612781 -374369 -88923 -11717 -95896
9647 -95896 157683 230985 -381865 170707 235898 -131675 -499499 123905 -181429 -199277
9637 -199277 -470941 -300038 -456532 -316582 -6939 202570 -72890 556276 752715 303494
9627 303494 173625 184245 314111 132720 259136 1420122 1242240 1037937 1143690 741065
$$ packed form
9698G43472m09913l12156N59353Q11982r78862l81367O24918M90891j346397R445
9688a88634Q2310k0965O79469J51773k6168K13210o1940j48338N86572r0986j50821
9677A025482n28410O4212K51929m63197l76661j33004k49049J35328M0517m8383
9667b81236l38200N61896L17345p85839N41624K30375q69678O67787K57113L04701
9657F05888n94028l16408j52011L75367j032689N01100K38412K85446P7206q4179
9647i5896K53579P3302o12850N52572O5191l67573l67824O23404l05334j7848
9637a99277k71664J70903j56494J39950L09643K09509k75460O29166J96439m49221
9627C03494j29869J0620J29866j81391J26416J160986j77882k04303J05753m02625
$$ plain form
9617 741065 1432130 1225998 1241065 992493 479996 872762 1185854 302668 -1085259 -48258
9607 -48258 870843 331852 323655 940017 1531223 564961 1116972 1173964 376883 144560
9597 144560 741475 856918 493117 1211377 1300553 1048299 1122402 942100 1008372 1261582
9587 1261582 1583550 1391524 1267546 2169428 2148815 1620160 984346 1159190 985803 426103
9577 426103 289149 207109 577000 720385 268298 644055 1191235 1391790 1038540 1025936
9567 1025936 1046962 647906 184626 268859 336598 124966 -2519 454035 306735 410802
9557 410802 282863 64917 -85931 -363018 -377046 -634946 5223 -219637 -598887 -204082
9547 -204082 -506981 -854950 -1047097 -896094 308852 -6864 762854 876116 1524865 1709924
$$ packed form
9617G41065O91065k06132J5067k48572n12497L92766L13092q83186j387927J037001
9607d8258R19101n38991q197O16362N91206r66262N52011N6992p97081k32323
9597A44560N96915J15443l63801P18260Q9176k52254P4103j80302O6272K53210
9587A261582L21968j92026j23978R01882k0613n28655o35814J74844j73387n59700
9577D26103j36954q2040L69891J43385m52087L75757N47180K00555l53250j2604
9567A025936K1026l99056m63280Q4233O7739k11632j27485M56554j47300J04067
9557D10802j27939k17946j50848k77087j4028k57900O40169k24860l79250L94805
9547b04082l02899l47969j92147J51003J204946l15716P69718J13262O48749J85059
$$ plain form
9537 1709924 1627295 1434641 1032091 1056577 1702714 1242697 1601693 1056632 577943 847237
9527 847237 -206835 -833755 376450 471875 492050 424042 1194913 1230962 983254 143607
9517 143607 -345960 -612979 -114872 -666058 -572484 391131 733747 -79989 385626 1217518
9507 1217518 1448065 1540670 1858962 1880441 2850060 3754360 3526020 3536957 3516863 2943088
9497 2943088 2071046 2457177 1935556 1031769 1375082 2096990 971715 821241 1706888
9488 1706888 1748992 1254891 785613 -110246 303454 314652 333697 157719 507725 497510
9478 497510 811056 754087 557006 84982 330993 700718 347742 811831 1988608 1635193
9468 1635193 296965 531456 473508 94021 -171313 -110296 -324236 -276139 -274348 -252011
$$ packed form
9537A709924q2629j92654m02550K4486O46137m60017L58996n45061m78689K69294
9527H47237j054072o26920J210205R5425K0175o8008P70871L6049k47708q39647
9517A43607m89567k67019M98107n51186R3574R63615L42616q13736M65615Q31892
9507A217518K30547R2605L18292K1479R69619R04300k28340J0937k0094n73775
9497B943088q72042L86131n21621r03787L43313P21908j125275j50474Q85647
9488A706888M2104m94101m69278q95859M13700J1198J9045j75978L50006j0215
9478D97510L13546n6969j97081m72024K46011L69725l52976M64089J176777l53415
9468A635193j338228K34491n7948l79487k65334O1017k13940M8097J791K2337
$$ plain form
9458 -252011 318662 85230 92436 -325729 -423306 -229084 -208903 -913521 -1230897 -1543685
9448 -1543685 -1335333 -1412317 -1265504 -504755 -424936 -300031 -607369 -174637 -410118 -1714921
9438 -1714921 -1449035 -316315 -781001 -731856 -287350 207332 -268406 -1161829 -759642 -1266792
9428 -1266792 -627229 -969997 -367985 229870 2662 244031 -544650 -941509 -1304187 -1423752
9418 -1423752 -1017430 -590446 -355823 28074 -147886 -549138 -403012 -1670141 -707129
9409 -707129 -519605 -304047 -470524 -709684 -180292 -688503 -480583 96008 -433316 -843878
9399 -843878 -332765 -860962 -1386098 -945471 -960603 -817074 -58645 -95307 -88166 -23437 -483796
9388 -483796 -367530 -441112 -696908 -614830 -307139 -518697 -329180 111628 536524 304877
$$ packed form
9458b52011N70673k33432P206m18165r7577J94222K0181p04618l17376l12788
9448a543685K08352p6984J46813P60749P9819J24905l07338M32732k35481j304803
9438a714921K65886J132720m64686M9145M44506M94682m75738q93423M02187n07150
9428a266792O39563l42768O02012N97855k27208K41369p88681l96859l62678j19565
9418a423752M06322M26984K34623L83897j75960m01252J46126j267129R63012
9409g07129J87524K15558j66477k39160N29392n08211K07920N76591n29324m10562
9399h43878N11113n28197n25136M40627j5132J43529P58429l6662P141O4729m60359
9388d83796J16266p3582k55796Q2078L07691k11558J89517M40808M24896k31647
$$ plain form
9378 304877 -128624 -116972 -103725 -408646 -96487 1097477 967264 841347 1023618 889678
9368 889678 452730 115025 526478 319598 461790 693657 1044378 1663747 1401869 975185
9358 975185 417010 949867 668234 259025 1060482 1225688 944262 1276500 1328736 1351874
9348 1351874 1276839 1290239 701527 722672 1603446 1803192 1171904 842134 1233863 1208145
9338 1208145 1339824 1585233 1349334 1473027 1824357 1513079 1690695 1202974 1103162 2052298
9328 2052298 1454180 1313819 1995866 2024052 1433683 1570414 1452641 1166347 247701 331115
9318 331115 697962 1341322 1205991 906389 702218 995745 1717130 1476947 485985 782998
9308 782998 1529107 1473298 1481319 1269394 1053122 949967 1207040 1449890 1010967 1015957 1006364
$$ packed form
9378C04877m33501J1652J3247l04921L12159J193964j30213j25917J82271j33940
9368H89678m36948l37705M11453k06880J42192K31867L50721O19369k61878m26684
9358I75185n58175N32857k81633m09209Q01457J65206k81426L32238N2236K3138
9348A351874p5035J3400n88712K1145Q80774J99746o31288l29770L91729k5718
9338A208145J31679K45409k35899J23693L51330l11278J77616m87721r9812R49136
9328B052298n98118j40361O82047K8186n90369J36731j17773k86294r18646Q3414
9318C31115L66847O43360j35331k99602k04171K93527P21385k40183r90962K97013
9308G82998P46109n5809Q021k11925k16272j03155K57073K42850m38923M990r593
$$ plain form
9297 1006364 843319 -38909 -440101 44756 139784 713203 532268 600148 741085 1411788
9287 1411788 1458561 1157039 1720853 1344386 1493505 1242589 1154514 1729021 1892432 1811755
9277 1811755 1507966 2067929 2050627 1605991 1358099 1766166 1892054 1398188 2174134 1753650
9267 1753650 882843 1313008 1387378 1071120 1250812 1387105 1081165 1022322 361048 978874
9257 978874 501321 929368 1781061 1319468 1021512 1162463 1892315 1382507 1509511 1150498
9247 1150498 1383866 1499341 1023174 1519031 1739938 1478346 825731 -46247 1056427
9238 1056427 1324411 785789 822278 1877665 1050221 1258462 608198 -17785 102534 1095858
9228 1095858 1424363 1132096 1812044 2071682 1794631 1626780 780475 150974 529255 708529
$$ packed form
9297A006364j63045q82228m01192M84857R5028N73419j80935O7880J40937O70703
9287A411788M6773l01522N63814l76467J49119k50916q8075N74507J63411q0677
9277A811755l03789N59963j7302m44636k47892M08067J25888m93866P75946m20484
9267A753650q70807M30165P4370l16258J79692J36293l05940n8843o61274O17826
9257I78874m77553M28047Q51693m61593k97956J40951P29852n09808J27004l59013
9247A150498K33368J15475m76167M95857K20907k61592o52615q71978J102674
9238A056427K67984n38622L6489J055387q27444K08241o50264o25983J20319R93324
9228A095858L28505k92267O79948K59638k77051j67851q46305o29501L78281J79274
$$ plain form
9218 708529 711675 411385 1239474 1405331 1079849 1039782 1287740 1228373 859559 377413
9208 377413 575367 624777 1414788 997184 587723 411882 696828 819365 1274549 1074862
9198 1074862 724437 1071567 1252666 953302 1786395 2088720 2211255 2115165 2779321 1918605
9188 1918605 1808430 899898 470047 641466 945030 1276303 1210957 1721789 2067286 2279070
9178 2279070 1728873 1101536 731479 793753 1208557 1812451 1578408 1673412 2085801 2222698
9168 2222698 2314882 1861030 1485987 1840216 2329926 2885180 2927238 3273965 2690460 2347158
9158 2347158 2823917 2875582 2146149 1904878 2464391 2953355 2652888 2743971 3501241 2489655
9148 2489655 2706318 2806809 2503644 2630327 2183988 2047427 2174867 3199712 3068742
$$ packed form
9218G08529L146l00290Q28089J65857l25482m0067K47958n9367l68814m82146
9208C77413J97954M9410P90011m17604m09461j75841K84946J22537M55184j99687
9198A074862l50425L47130J81099k99364Q33093L02325J22535r6090O64156q60716
9188A918605j10175r08532m29851J71419L03564L31273o5346N10832L45497K11784
9178B279070n50197o27337l70057O2274M14804O03894k34043R5004M12389J36897
9168B222698R2184m53852l75043L54229M89710N55254M2058L46727n83505l43302
9158B347158M76759N1665p29433k41271N59513M88964l00467R1083P57270j011586
9148B489655K16663J00491l03165J26683m46339j36561J27440J024845j30970
$$ plain form
9139 3068742 2379547 2731513 3966501 4066947 3851746 4748269 4593798 4124835 4187965 4369191
9129 4369191 4452643 4530025 4609595 4594682 4874294 5066509 4706650 4917314 5111932 5392135
9119 5392135 4900194 5408417 5090560 4658496 5373681 5436145 5098028 5180200 5044711 5451234
9109 5451234 5628168 5723204 5527939 5867507 6204643 6611118 6809661 6693430 6196061 6503236
9099 6503236 6765593 6728836 7517847 7387587 7321383 7585793 8151657 8019420 8470984 7739441
9089 7739441 7740635 7421794 8171516 8708730 8480163 8801836 9436000 9209072 9888164 10543179
9079 10543179 10330717 10377228 11518907 11748355 12156940 12538631 12084798 12190560 12764033
9070 12764033 12269404 11811056 11787034 12621505 12518692 13090979 13802005 13744044 13577000 14269671
$$ packed form
9139C068742o89195L51966J234988J00446k15201Q96523j54471m68963O3130J81226
9129D369191Q3452P7382P9570j4913K79612J92215l59859K10664J94618K80203
9119E392135m91941N08223l17857m32064P15185O2464l38117Q2172j35489M06523
9109E451234J76934R5036j95265L39568L37136M06475J98543j16231m97369L07175
9099F503236K62357l6757P89011j30260o6204K64410N65864j32237M51564p31543
9089G739441J194l18841P49722N37214k28567L21673O34164k26928O79092O55015
9079A0543179k12462M6511J141679K29448M08585L81691m53833J05762N73473
9070A2764033m94629m58348k4022Q34471j02813N72287P11026n7961j67044O92671
$$ plain form
9060 14269671 14655913 14049141 14126325 14739582 14026360 13427702 14164925 14744695 14667568 14828335
9050 14828335 15351701 16539954 17563768 17463067 18211158 19076020 19767493 20587396 20859181
9041 20859181 20918700 21868848 22484606 22255609 23025185 24053797 24067123 24074891 24819217 26070257
9031 26070257 26238255 26716260 28072952 28408000 29149752 30007343 29710973 30043390 30266979
9022 30266979 30850705 31675918 32565988 32711658 32367797 33382762 34847064 35565505 35710867
9013 35710867 36536570 37898134 38837887 39582424 40867141 41488233 42700967 44323813 45514679
9004 45514679 47655989 49373988 50591069 52130917 53703495 54943148 56424827 58409762
8996 58409762 59491239 61546364 63586796 65414764 67959559 70049604 71957502 74544199
$$ packed form
9060A4269671L86242o06772P7184O13257p13222n98658P37223N79770p7127J60767
9050A4828335N23366J188253J023814j00701P48091Q64862O91473Q19903K71785
9041B0859181N9519R50148O15758k28997P69576J028612J3326P768P44326J251040
9031B6070257J67998M78005J356692L35048P41752Q57591k96370L32417K23589
9022C0266979N83726Q25213Q90070J45670l43861J014965J464302P18441J45362
9013C5710867Q25703J361564R39753P44537J284717O21092J212734J622846J190866
9004D5514679K141310J717999J217081J539848J572578J239653J481679J984935
8996E8409762J081477K055125K040432J827968K544795K090045J907898K586697
$$ plain form
8988 74544199 77969898 79998450 82019198 85104859 88337624 91853763 94304291 97391412
8980 97391412 100731655 105098740 109824301 115100276 121247539 127485639 135176809 143933801
8972 143933801 153953381 165590100 179833727 197188959 217013272 241449817 269916272
8965 269916272 295928590 317813618 332371403 338556848 336083007 329492385 319643226 307799088
8957 307799088 295287030 285135098 276089354 270215894 267602027 268970156 275219030 287490420
8949 287490420 306010284 333709440 369758271 409617939 447225774 474926919 484543610
8942 484543610 473056657 444543872 407072300 367162973 328645519 295434353 266956269
8935 266956269 243662705 225270381 210562560 197590679 187388595 179445273 172383224
$$ packed form
8988G4544199L425699K028552K020748L085661L232765L516139K450528L087121
8980I7391412L340243M367085M725561N275975O147263O238100P691170Q756992
8972A43933801J0019580J1636719J4243627J7355232J9824313K4436545K8466455
8965B69916272K6012318K1885028J4557785O185445k473841o590622r849159j1844138
8957C07799088j2512058j0151932r045744n873460k613867J368129O248874J2271390
8949B87490420J8519864K7699156L6048831L9859668L7607835K7701145R616691
8942D84543610j1486953k8512785l7471572l9909327l8517454l3211166k8478084
8935B66956269k3293564j8392324j4707821j2971881j0202084p943322p062049
$$ plain form
8928 172383224 165399214 159520031 155051746 149052497 144242359 140439714 136917783 134057384
8920 134057384 130971469 128178007 125789423 123668124 121596928 119869469 117758004 116859334
8912 116859334 115255325 113292338 112566080 111146070 109439920 108789221 109356250 110049604 111624041
8903 111624041 113138403 114783192 116972534 118354275 117884452 116716690 114729425 111678439
8895 111678439 108211657 105535055 103694402 101407029 99293715 98215179 98184018 98697451
8887 98697451 100009898 102064327 105051613 108278387 110323455 111205442 110409682 108723980
8879 108723980 106208276 103673024 100038609 96446495 93818774 90827079 88953398 87389715
8871 87389715 85711988 84685341 84488787 84412502 84603673 85222006 86327783 88111328 89528271
$$ packed form
8928A72383224o984010n879183m468285n999249m810138l802645l521931k860399
8920A34057384l085915k793462k388584k121299k071196j727459k111465q98670
8912A16859334j604009j962987p26258j420010j706150o50699N67029O93354J574437
8903A11624041J514362J644789K189342J381741m69823j167762j987265l050986
8895A11678439l466782k676602j840653k287373k113314j078536l1161N13433
8887I8697451J312447K054429K987286L226774K045068Q81987p95760j685702
8879A08723980k515704k535252l634415l592114k627721k991695j873681j563683
8871H7389715j677727j026647j96554p6285J91171O18333J105777J783545J416943
$$ plain form
8862 89528271 90469384 90464491 88595145 87209445 84327598 81121844 78087899 75702281 72419234
8853 72419234 69798258 68068827 66955655 65374039 64463110 63780354 63608884 63451494 63182103
8844 63182103 62569173 61838077 61587077 61495803 60496950 60066381 59427228 58730263 56650968
8835 56650968 54509737 52970599 50313704 48025591 45864965 43748674 42818813 41347159
8827 41347159 40622961 39777855 39948604 39629549 39144352 38358036 36867852 35463598 33651383
8818 33651383 32766211 31676885 30486181 29886729 28631989 28524780 27769556 26495924 26005941
8809 26005941 26272868 26159607 25524147 25620555 24825411 24019318 23156165 22660870 21641697
8800 21641697 21128417 21434921 20309633 19671340 20211174 20171838 19008564 18200883 18457321
$$ packed form
8862H9528271R41113m893j869346j385700k881847l205754l033945k385618l283047
8853G2419234k620976j729431j113172j581616r10929o82756j71470j57390k69391
8844F3182103o12930p31096k51000r1274r98853m30569o39153o96965k079295
8835E6650968k141231j539138k656895k288113k160626k116291r29861j471654
8827D1347159p24198q45106J70749l19055m85197p86316j490184j404254j812215
8818C3651383q85172j089326j190704n99452j254740j07209p55224j273632m89983
8809B6005941K66927j13261o35460R6408p95144q06093q63153m95295j019173
8800B1641697n13280L06504j125288o38293N39834l9336j163274q07681K56438
$$ plain form
8791 18457321 17519107 17152670 16704792 16116388 16023449 15594407 15573594 15597954 15193558 14540761
8781 14540761 14255578 13625280 13270059 12936342 12977237 12826313 12532702 12780861 12200661 12559172
8771 12559172 11826861 10704423 10499466 10725117 11077393 10277579 10119734 10631596 9774548
8762 9774548 9776636 9518527 9305830 8132875 8145078 8351043 8119914 8441754 8854817 8482099
8752 8482099 9001732 8571669 8501819 8826240 8700808 8703380 8135910 8432760 8421327 7683844
8742 7683844 7210202 6981544 7026190 7153183 6940208 6817097 6744167 6394530 6317430 6243301
8732 6243301 6200316 5733625 5735568 5101339 5379748 5074435 5013143 4753700 4913625 5318300
8722 5318300 4889927 5062059 6224346 6527010 6466315 5960273 6345831 5725207 4946207 5157135
$$ packed form
8791A8457321r38214l66437m47878n88404r2939m29042k0813K4360m04396o52797
8781A4540761k85183o30298l55221l33717M0895j50924k93611K48159n80200L58511
8771A2559172p32311j122438k04957K25651L52276p99814j57845N11862q57048
8762I774548K088k58109k12697j172955J2203K05965k31129L21840M13063l72718
8752H482099N19633m30063o9850L24421j25432K572n67470K96850j1433p37483
8742G683844m73642k28658M4646J26993k12975j23111p2930l49637p7100p4129
8732F243301m2985m66691J943o34229K78409l05313o1292k59443J59925M04675
8722E318300m28373J72132J162287L02664o0695n06042L85558o20624p79000K10928
$$ plain form
8712 5157135 5563304 5270515 5397891 5260868 5482360 5922966 5537848 5694230 5669119 5464398
8702 5464398 5482529 5693462 5265377 5540767 5526500 4689648 4687442 4548003 4583275 4691979
8692 4691979 3817312 4365515 4562853 3289400 3314399 3519602 3493359 3141412 3775221 4607551
8682 4607551 4180071 4166742 3991434 4131294 3232942 3032372 3269583 2773893 2544575 2511788
8672 2511788 2871603 2801994 3421560 4514970 4300297 4362870 4389602 4187764 3807200 3812250
8662 3812250 3716421 3317651 3244976 3142856 3667897 3212092 3295996 3653841 3328013 3890959
8652 3890959 3384319 3290498 3224945 4021717 3645357 3866220 3985548 4075852 4183936 3649827
8642 3649827 2955579 2809315 2985662 3192723 3112104 3360201 3709193 3085426 2958166 3667654
$$ packed form
8712E157135M06169k92789J27376j37023K21492M40606l85118J56382k5111k04721
8702E464398J8131K10933m28085K75390j4267q36852k206j39439L5272J08704
8692D691979q74667N48203J97338j273453K4999K05203k6243l51947O33809Q32330
8682D607551m27480j3329j75308J39860q98352k00570K37211m95690k29318l2787
8672B511788L59815o9609O19566J093410k14673O2573K6732k01838l80564N050
8662C812250r5829l98770p2675j02120N25041m55805Q3904L57845l25828N62946
8652C890959n06640r3821o5553P96772l76360K20863J19328R0304J08084n34109
8642C649827o94248j46264J76347K07061q0619K48097L48992o23767j27260P09488
$$ plain form
8632 3667654 3529882 3569754 3222991 3357276 3051099 3717889 3186036 3208368 3891076 3335468
8622 3335468 3238238 3842566 4510074 3575441 3130579 4237935 4221045 3833437 3994166 4523688
8612 4523688 3853616 4231663 4104622 4139285 3104560 3391963 3181492 3092223 4220621 4312058
8602 4312058 4440716 4934991 4564484 4157925 4388709 4450849 3686918 3509504 4316404 4581788
8592 4581788 3930424 3906709 4165714 4697957 4516497 3930583 3845185 4233498 4652507 3851583
8582 3851583 4329755 4080893 3097446 3490436 4492659 3750069 2937153 3375966 4099462
8573 4099462 3298130 2486005 2994916 3419036 3219537 3654781 3579915 3373731 3342410 3542161
8563 3542161 2672985 2292495 2955765 4066509 3929966 4259261 3978439 3828906 3808678 3645826
$$ packed form
8632C667654j37772L9872l46763J34285l06177O66790n31853K2332O82708n55608
8622C335468r7230O04328O67508r34633m44862J107356j6890l87608J60729N29522
8612D523688o70072L78047j27041L4663j034725K87403k10471q9269J128398R1437
8602D312058J28658M94275l70507m06559K30784O2140p63931j77414Q06900K65384
8592D581788o51364k3715K59005N32243j81460n85914q5398L88313M19009q00924
8582C851583M78172k48862r83447L92990J002223p42590q12916M38813P23496
8573D099462q01332q12125N08911M24120j99499M35244p4866k06184l1321J99751
8563C542161q69176l80490O63270J110744j36543L29295k80822j49533k0228j62852
$$ plain form
8553 3645826 3627196 3824203 3798948 4510996 4647305 4698369 5072601 5011032 4717203 5330744
8543 5330744 4919275 5438536 5868078 6032651 5757371 6871977 7602497 8051155 10722013
8534 10722013 11667930 10822637 10158050 9278457 7810098 6436622 5638057 5653516 4225973
8525 4225973 3469732 4449679 4670735 4524439 3663214 3720737 3343466 3105175 3277178 3388266
8515 3388266 3581356 3637146 3325023 3561988 3102494 2233190 2432781 2549834 1864659 2723481
8505 2723481 2368130 2460925 2279852 1991404 1789389 1672935 1539211 1878113 1958555 2595152
8495 2595152 3520678 2311583 2428349 2760740 2796929 2295917 2531019 3054010 2772768 3010670
8485 3010670 2878113 3219008 2506773 1027889 1363920 1922215 2308985 1870591 1628031
$$ packed form
8553C645826j8630J97007k5255P12048J36309N1064L74232o1569k93829O13541
8543E330744m11469N19261M29542J64573k75280J114606P30520M48658K670858
8534A0722013R45917q45293o64587q79593j468359j373476p98565J5459j427543
8525D225973p56241R79947K21056j46296q61225N7523l77271k38291J72003J11088
8515C388266J93090N5790l12123K36965m59494q69304J99591J17053o85175Q58822
8505B723481l55351R2795j81073k88448k02015j16454j33724L38902Q0442O36597
8495B595152R25526j209095J16766L32391L6189n01012K35102N22991k81242K37902
8485C010670j32557L40895p12235j478884L36031N58295L86770m38394k42560
$$ plain form
8476 1628031 2726123 2958713 3237742 3075697 3065978 3066237 2007260 2809038 2354444 1337452
8466 1337452 1514061 1950537 2347067 2588980 2758784 2847061 3022291 3326683 3296658 3202610
8456 3202610 2981004 4130720 3045760 2845804 3242542 2585512 1570873 1954941 1953869
8447 1953869 1788303 1440872 2232921 1913692 2235456 3017165 2948689 2261930 2479098 2533953
8437 2533953 3187811 3628694 3186685 3255457 3132991 3719196 2865599 3230360 3809419 3663748
8427 3663748 3369841 3655044 3858784 3345683 3679848 3489865 3033389 3286187 3611319 2873212
8417 2873212 2572657 2159946 2684568 2809307 2791971 2996361 3140056 2866241 2654153 2976842
8407 2976842 2455525 2124594 2207924 2330616 2035442 1880876 2919624 3210142 3182994 3436552
$$ packed form
8476A628031J098092K32590K79029j62045r719K59j058977Q01778m54594j016992
8466A337452J76609M36476L96530K41913J69804Q8277J75230L04392l0025r4048
8456C202610k21606J149716j084960j99956L96738o57030j014639L84068j072
8447A953869j65566l47431P92049l19229L21764P81709o8476o86759K17168N4855
8437B533953O53858M40883m42009O8772j22466N86205q53597L64761N79059j45671
8427C663748k93907K85203K03740n13101L34165j89983m56476K52798L25132p38107
8417B873212l00555m12711N24622J24739j7336K04390J43695k73815k12088L22689
8407B976842n21317l30931Q3330J22692k95174j54566J038748K90518k7148K53558
$$ plain form
8397 3436552 3944582 3329372 3357176 3558594 3510002 3657714 3214876 3567388 2606589 2605013
8387 2605013 2707961 2565493 2233497 1653128 2361145 3252877 3133396 3016817 3580379 3405992
8377 3405992 3786209 2410208 2554076 2396026 2113163 2240563 1770217 2367440 2006056
8368 2006056 2089964 2513371 2598904 2599510 2699621 2338603 2059704 1567319 1502414 878131 592702
8357 592702 872529 1540161 1021643 1207074 1033406 494054 1008466 1433015 1123783 1301117
8347 1301117 1729429 1394358 1387537 1542733 1556872 1422478 952526 1517180 997403 1317382
8337 1317382 1587666 1646523 1106364 1316315 1521299 1515810 1110781 444078 752631 1698563
8327 1698563 2075440 1401285 1176762 1357327 1624744 1818481 1976032 1260516 1498251 1650587
$$ packed form
8397C436552N08030o15210K7804K01418m8592J47712m42838L52512r60799j576
8387B605013J02948j42468l31996n80369P08017Q91732j19481j16579N63562j74387
8377C405992L80217j376001J43868j58050k82863J27400m70346N97223l61384
8368B006056Q3908M23407Q5533O06J00111l61018k78899m92385o4905o24283k85429
8357E92702K79827O67632n18518J85431j73668n39352N14412M24549l09232J77334
8347A301117M28312l35071o821J55196J4139j34394m69952N64654n19777L19979
8337A317382K70284N8857n40159K09951K04984n489m05029o66703L08553R45932
8327A698563L76877o74155k24523J80565K67417J93737J57551p15516K37735J52336
$$ plain form
8317 1650587 1297460 1982752 1482376 1728653 2208137 2291346 2135813 3075021 2996723 2550880
8307 2550880 1655667 1325118 1681536 1198499 1042691 1032124 1058318 1428968 1272558 655307
8297 655307 340641 275640 878219 815264 772179 560411 221549 822638 1369730 1208962
8287 1208962 891660 1651116 2313290 2520184 1689082 2294332 2975176 1466202 1896088
8278 1896088 2582882 2735452 2507779 2613429 2826372 2886857 2978939 3030816 2367874 2461337
8268 2461337 2853570 3018235 2555034 2935477 2281769 1997638 1911963 1233793 1518858 2314139
8258 2314139 2281515 2346399 2346986 2157109 2131232 2526588 2207210 1433492 1067527 1766953 1449780
8247 1449780 1637793 1732184 1027164 1489749 1660932 1830753 1783495 1801618 2099051 1927880
$$ packed form
8317A650587l53127O85292n00376K46277M79484Q3209j55533R39208p8298m45843
8307B550880q95213l30549L56418m83037j55808j0567K6194L70650j56410o17251
8297F55307l14666o5001O02579o2955m3085k11768l38862O01089N47092j60768
8287A208962l17302P59456O62174K06894q31102O05250O80844j508974M29886
8278A896088O86794J52570k27673J05650K12943O0485R2082N1877o62942R3463
8268B461337L92233J64665m63201L80443o53708k84131q5675o78170K85065P95281
8258B314139l2624O4884N87j89877k5877L95356l19378p73718l65965O99426l17173
8247A449780J88013R4391p05020M62585J71183J69821m7258J8123K97433j71171
$$ plain form
8237 1927880 1032084 1102368 1336433 1185028 757525 897837 1546752 1734226 515042 -134342
8227 -134342 734386 881741 1251005 1617455 2781847 3644663 2578836 2795946 2591607
8218 2591607 2043859 1721157 1582816 934234 1039660 1233105 1478209 1106605 532708 1234465
8208 1234465 1461342 1263688 1644323 1994279 1876403 2874560 3765751 3703552 2946203 3118619
8198 3118619 3523211 1576244 1734555 883806 468580 222902 -169437 2072895 3204320
8189 3204320 3507455 2915163 3404764 2941132 2713413 1492586 944381 331156 831405
8180 831405 1622671 1749198 1122232 1447659 2881293 1794155 873759 1075510 342924
8171 342924 267018 1059340 1543324 2038760 2159351 2529953 2727961 1793795 1923315 1628968
$$ packed form
8237A927880q95796P0284K34065j51405m27503J40312O48915J87474j219184o49384
8227a34342Q68728J47355L69264L66450J164392Q62816j065827K17110k04339
8218B591607n47748l22702j38341o48582J05426J93445K45104l71604n73897P01757
8208A234465K26877j97654L80635L49956j17876R98157Q91191o2199p57349J72416
8198C118619M04592j946967J58311q50749m15226k45678l92339K242332J131425
8189C204320L03135n92292M89601m63632k27719j220827n48205o13225N00249
8180H31405P91266J26527o26966L25427J433634j087138r20396K01751p32586
8171C42924p5906P92322M83984M95436J20591L70602J98008r34166J29520k94347
$$ plain form
8161 1628968 2025971 2036154 1211408 3028878 3046875 2521946 1664495 600849 1255279 1321091
8151 1321091 1085190 1742844 2341725 2811525 2726223 1490715 1347013 1615230 1107246 1315363
8141 1315363 785602 406227 1505373 1791601 798091 861453 312412 1104876 1645699 1403035
8131 1403035 1261485 1251131 1389299 766005 612716 970240 993314 703676 867993 429096
8121 429096 1044505 1319113 1154483 1068186 1299099 1560246 1881914 1897498 1832944 1382015
8111 1382015 1616065 1054937 350389 432864 1376104 1532724 526775 841564 499097 935533
8101 935533 868517 181585 476530 1153016 1322074 1273715 1361891 1702230 1672032 -29559
8091 -29559 387934 608658 343571 1504555 1266687 1241593 1129031 1296253 400641 201237
$$ packed form
8161A628968L97003J0183q24746J817470J7997n24929q57451j063646O54430O5812
8151A321091k35901O57654N98881M69800q5302j235508j43702K68217n07984K08117
8141A315363n29761l79375J099146K86228r93510O3362n49041P92464N40823k42664
8131A403035j41550j0354J38168o23294j53289L57524K3074k89638J64317m38897
8121D29096O15409K74608j64630q6297K30913K61147L21668J5584o4554m50929
8111A382015K34050n61128p04548Q2475R43240J56620j005949L14789l42467M36436
8101I35533o7016o86932K94945O76486J69058m8359Q8176L40339l0198j701591
8091b9559M17493K20724k65087J160984k37868k5094j12562J67222q95612j99404
$$ plain form
8081 201237 -130996 182609 165199 440378 588010 219214 680764 -342505 -1318949 -714187
8071 -714187 -593037 -53204 731739 1021950 992506 424330 346125 38091 -537761 148565
8061 148565 88635 185984 762493 990526 709890 221808 267892 -78901 -41539 166946
8051 166946 83083 -180761 -130743 382056 129474 968366 326696 290648 932785 1064567
8041 1064567 869683 -245930 308745 712426 78775 -17427 1133205 1207803 1411608 1807031
8031 1807031 1810552 1596703 1440377 1517992 1445003 1616590 2033713 1900551 1303753 1420622
8021 1420622 895787 963261 821198 131827 -106233 -134533 1107159 1281747 1036046 1174667
8011 1174667 526135 449496 163348 -113899 -822622 93223 421281 287084 960964 426956
$$ packed form
8081B01237l32233L13605j7410K75179J47632l68796M61550j023269r76444O04762
8071g14187J21150N39833P84943K90211k9444n68176p8205l08034n75852O86326
8061A48565n9930R7349N76509K28033k80636m88082M6084l46793L7362K08485
8051A66946q3863k63844N0018N12799k52582Q38892o41670l6048O42137J31782
8041A064567j94884j115613N54675M03681o33651r6202J150632P4598K03805L95423
8031A807031L521k13849j56326P7615p2989J71587M17123j33162n96798J16869
8021A420622n24835O7474j42063o89371k38060k8300J241692J74588k45701J38621
8011A174667o48532p6639k86148k77247p08723R15845L28058j34197O73880n34008
$$ plain form
8001 426956 -116450 88549 -263168 201284 1060186 -33883 665954 325949 820748 1596957
7991 1596957 1526016 1267664 986604 870162 871108 845303 547124 503236 587675 222228 -352259
7980 -352259 -208104 936012 145675 172562 599735 237596 665369 -5120 88923 1069524
7970 1069524 549084 888142 1004184 1365069 1719102 934352 566116 814600 217099 180231
7960 180231 577106 490445 220033 463760 618577 711687 659834 152891 -207471 -636118
7950 -636118 -63824 185447 -698674 -241798 -147018 -251454 660973 750601 450231 878677
7940 878677 465289 485588 210472 123318 270831 839444 1525616 1156032 -53343 -37940
7930 -37940 690413 262533 521060 -498634 -396041 146221 796548 1577213 561751 -267218
$$ packed form
8001D26956n43406K04999l51717M64452Q58902j094069O99837l40005M94799P76209
7991A596957p0941k58352k81060j16442R46k5805k98179m3888Q4439l65447n74487
7980c52259J44155J144116p90337K6887M27173l62139M27773o70489R4043R80601
7970A069524n20440L39058J16042L60885L54033p84750l68236K48484n97501l6868
7960A80231L96875q6661k70412K43727J54817R3110n1853n06943l60362m28647
7950f36118N72294K49271q84121M56876R4780j04436R12427Q9628l00370M28446
7940H78677m13388K0299k75116q7154J47513N68613O86172l69584j209375J5403
7930c7940P28353m27880K58527j019694J02593N42262O50327P80665j015462q28969
$$ plain form
7920 -267218 -123483 123648 263255 826236 559003 -135900 57204 143481 875876 543681
7910 543681 504552 604743 456542 854643 1226716 751988 269806 32618 350200 519924
7900 519924 42337 398992 950869 956100 1228081 1107482 739277 747098 667172 641574 705091
7889 705091 102215 86957 423132 235089 -290420 -684069 11368 228375 208205 800323
7879 800323 700317 550024 121275 281315 7300 698690 518116 225444 -27103 3257
7869 3257 358416 237165 271982 193111 592523 345636 659880 571858 853751 204835 -121123
7858 -121123 -331629 81937 991584 406211 806331 487053 674976 307431 648386 706845
7848 706845 454917 351095 -36657 263945 -160490 -214066 -139741 -31510 -90139 39242
$$ packed form
7920b67218J43735K47131J39607N62981k67233o94903J93104Q6277P32395l32195
7910E43681l9129J00191j48201L98101L72073m74728m82182k37188L17582J69724
7900E19924m77587L56655N51877N231K71981j20599l68205P821p9926k5598O3517
7889G05091o02876j5258L36175j88043n25509l93649O95437K17007k0170N92118
7879H00323j00006j50293m28749J60040k74015O91390j80574k92672k52547L0360
7869C257L55159j21251L4817p8871L99412k46887L14244q8022K81893o48916l25958
7858a21123k10506M13566R09647n85373M00120l19278J87923l67545L40955N8459
7848G06845k51928j03822l87752L00602m24435n3576P4325J08231n8629J29381
$$ plain form
7838 39242 -104261 -778846 -25290 -519212 493916 504468 -242113 135294 -208555 -197063
7828 -197063 9020 -39289 -462145 -671462 -288169 176199 36167 886285 1042086 1066063
7818 1066063 876524 355263 842508 664346 646892 897637 -88728 511659 890953 48956
7808 48956 181488 628690 834822 840599 424854 563279 228461 -43020 141096 -43438
7798 -43438 -40287 232203 476842 944303 596025 988911 530933 672192 659406 595727 802903
7787 802903 1168628 1545875 1366835 685650 848655 845188 129913 -50092 477034 1245771
7777 1245771 844122 802626 629006 -369421 304033 716711 575704 -204223 -220314 210563
7767 210563 71173 331149 603476 411294 90970 412001 -79299 755666 1612075 1055143
$$ packed form
7838C9242j43503o74585P53556m93922J013128J0552p46581L77407l43849J1492
7828a97063K06083m8309m22856k09317L83293M64368j40032Q50118J55801K3977
7818A066063j89539n21261M87245j78162j7454K50745r86365O00387L79294q41997
7808D8956J32532M47202K06132N777m15745J38425l34818k71481J84116j84534
7798d3438L151K72490K44639M67461l48278L92886m57978J41259j2786o3679K07176
7787H02903L65725L77247j79040o81185J63005l467p15275j80005N27126P68737
7777A245771m01649m1496j73620r98427O73454M12678j41007p79927j6091M30877
7767B10563j39390K59976K72327j92182l20324L21031m91300Q34965Q56409n56932
$$ plain form
7757 1055143 547569 1064837 1053957 376503 458659 569417 203346 285400 370465 472693
7747 472693 -69663 621284 968228 645428 218752 -772094 -688353 71057 552227 322936
7737 322936 -515855 81976 594324 -156705 322507 814163 1446244 886214 822212 1480517
7727 1480517 1313721 560788 982336 966810 542396 585644 57671 356079 179883 59374
7717 59374 546945 177806 91098 333312 27536 17836 -205050 -967859 -640850 -753446
7707 -753446 -406728 -981012 -1636226 -483185 -135615 499683 635380 229309 -203353 681577
7697 681577 1137430 515577 921374 592837 311384 890668 987947 1113695 1423475 1628059
7687 1628059 1323977 712640 990251 1217634 540818 1124155 874680 536998 126703 -69348
$$ packed form
7757A055143n07574N17268j0880o77454Q2156J10758l66071Q2054Q5065J02228
7747D72693n42356O90947L46944l22800m26676r90846Q3741P59410M81170k29291
7737C22936q38791N97831N12348p51029M79212M91656O32081n60030o4002O58305
7727A480517j66796p52933M21548j5526m24414M3248n27973K98408j76196j20509
7717E9374M87571l69139q6708K42214l05776r700k22886p62809L27009j12596
7707g53446L46718n74284o55214J153041L47570O35298J35697m06071m32662Q84930
7697F81577M55853o21853M05797l28537k81453N79284R7279J25748L09780K04584
7687A628059l04082o11337K77611K27383o76816N83337k49475l37682m10295j96051
$$ plain form
7677 -69348 428934 462286 -209226 -539918 -545687 -83359 118630 42589 377582 728536 15351
7666 15351 408455 415627 364668 193027 284548 910643 582203 493390 924364 337957 -185766
7655 -185766 -227918 -304063 290298 463190 566977 1060426 486531 1310170 1162525 18772
7645 18772 342182 675252 1077711 379284 827957 746599 761153 696244 856198 727535
7635 727535 832867 1107498 1363373 1884292 2191923 519183 191757 556821 201334 114928
7625 114928 -203063 129972 134559 503361 202635 232369 471031 157163 242545 1069718
7615 1069718 1572602 958427 837899 989734 900572 735634 1208812 611183 1116244 798508
7605 798508 694682 669249 281411 730331 90261 -10069 1356338 792695 421408 634523
$$ packed form
7677f9348M98282L3352o71512l30692n769M62328K01989p6041L34993L50954p13185
7666A5351L93104P172n0959j71641R1521O26095l28440q8813M30974n86407n23723
7655a85766m2152p6145N94361J72892J03787M93449n73895Q23639j47645j143753
7645A8772L23410L33070M02459o98427M48673q1358J4554o4909J59954j28663
7635G27535J05332K74631K55875N20919L07631j672740l27426L65064l55487q6406
7625A14928l17991L33035M587L68802l00726K9734K38662l13868Q5382Q27173
7615A069718N02884o14175j20528J51835q9162j64938M73178n97629N05061l17736
7605G98508j03826k5433l87838M48920o40070j00330J366407n63643l71287K13115
$$ plain form
7595 634523 -205848 229897 422478 818291 451748 546177 884368 1146292 951818 681149
7585 681149 468160 1079008 1014923 654739 1205464 1032182 932450 636038 1213291 1444517
7575 1444517 414730 975674 330246 9188 -108964 -304415 557015 263731 -87899
7566 -87899 284039 715037 603126 294303 565539 1086367 -17717 170216 195784 294492
7556 294492 386898 452513 980008 368261 901918 674287 435044 349462 521190 224491
7546 224491 89840 382775 433062 610167 287745 1471312 1430099 925427 1161851 1707344
7536 1707344 1774104 1847680 1239254 882498 1382142 901811 783963 1234812 1506198 845615
7526 845615 538864 702428 691012 791224 649098 184968 -60610 229245 617081 -220504
$$ packed form
7595F34523q40371M35745J92581L95813l66543R4429L38191K61924j94474k70669
7585F81149k12989O10848o4085l60184N50725j73282r9732k96412N77253K31226
7575A444517j029787N60944o45428l21058j18152j95451Q61430k93284l51630
7566h7899L71938M30998j11911l08823K71236N20828j104084J87933K5568R8708
7556B94492R2406O5615N27495o11747N33657k27631k39243q5582J71728k96699
7546B24491j34651K92935N0287J77105l22422J183567m1213n04672K36424N45493
7536A707344O6760P3576o08426l56756M99644m80331j17848M50849K71386o60583
7526H45615l06751J63564j1416J00212j42126m64130k45578K89855L87836q37585
$$ plain form
7516 -220504 -75937 -103155 -146321 278936 -641360 -487202 -582582 -239248 571268 271627
7506 271627 695009 -85999 -153896 259916 454955 -26915 747452 1223690 894634 867338
7496 867338 1076240 1073916 613567 561873 575972 327337 227650 508982 -31700 237178 542370
7485 542370 313390 -227738 -318044 804230 775210 609382 484157 414475 188984 -310815
7475 -310815 109708 55515 -6816 44954 -11131 -381929 99446 -6829 -286174 377348
7465 377348 1013337 559246 1360788 1924363 1472998 1072722 819695 486727 -124646 -1087974
7455 -1087974 -1282246 -558879 -152028 -64792 102636 -164564 139069 4992 -670528 133857
7445 133857 -54882 -243490 645659 -663874 -701190 -344533 -479996 -197324 -331392 53082
$$ packed form
7516b20504J44567k7218m3166M25257r20296J54158r5380L43334Q10516k99641
7506B71627M23382p81008o7897M13812J95039m81870P74367M76238l29056k7296
7496H67338K08902k324m60349n1694J4099k48635r9687K81332n40682K68878L05192
7485E42370k28980n41128r0306J122274k9020j65828j25225o9682k25491m99799
7475c10815M20523n4193o2331N1770n6085l70798M81375j06275k79345O63522
7465C77348O35989m54091Q01542N63575m51365m00276k53027l32968o11373r63328
7455a087974j94272P23367M06851Q7236J67428k67200L03633j34077o75520Q04385
7445A33857j88739j88608Q89149j309533l7316L56657j35463K82672j34068L84474
$$ plain form
7435 53082 -408626 -739705 -685379 -608850 -290841 543981 367332 196975 306007 -463765
7425 -463765 -734129 -600635 -953129 -760522 -455360 170851 -158381 13338 870600 -35402
7415 -35402 -705974 182611 32525 -156523 498708 534895 409656 328260 -42105 -903699
7405 -903699 -495097 64445 153787 699233 1395012 2223409 1519907 1495407 1407936 121494
7395 121494 881070 1035369 311520 306001 97462 -382417 175631 323650 216682 -368588
7385 -368588 337727 1151661 732154 857082 1063157 918637 1081915 744806 488335 343237
7375 343237 -157146 -37079 81128 204875 -42971 -300959 -11139 200751 32116 501380
7365 501380 596972 249648 258678 723521 -75693 -127942 281129 43743 211085 -5140
$$ packed form
7435E3082m61708l31079N4326P6529L18009Q34822j76649j70357J09032p69772
7425d63765k70364J33494l52494J92607L05162O26211l29232J71719Q57262r06002
7415c5402o70572Q88585j50086j89048O55231L6187j25239q1396l70365q61594
7405i03699M08602N59542Q9342N45446O95779Q28397p03502k4500q7471j286442
7395A21494P59576J54299p23849n519k08539m79879N58048J48019j06968n85270
7385c68588P06315Q13934m19507J24928K06075j44520J63278l37109k56471j45098
7375C43237n00383J20067J18207J23747k47846k57988K89820K11890j68635M69264
7365E01380R5592l47324R030M64843p99214n2249M09071k37386J67342k16225
$$ plain form
7355 -5140 -70445 -562478 -289478 459795 -2285 548520 166208 136107 1042761 1065739 559543
7344 559543 -119411 1054917 1221717 537520 418060 595117 394816 124263 891852 171409
7334 171409 394136 304052 1043014 842153 192209 603227 75810 -148851 -212600 -205046
7324 -205046 -254868 -130066 615725 -661243 -1242736 -707134 -887481 -187055 -251570 24695
7314 24695 640592 748522 551819 -68673 -59171 500224 142332 184531 1120670 1017723
7304 1017723 525833 714829 503016 -61609 521315 1383677 1493218 1459138 2047037 2002930
7294 2002930 1284360 1385825 1378862 827098 529454 623524 263909 -31816 673136 1187047
7284 1187047 774174 147647 33298 895240 724550 434408 386247 381760 -319845 -118873
$$ packed form
7355e140o5305m92033K73000P49273m62080N50805l82312l0101R06654K2978n06196
7344E59543o78954J174328J66800o84197j19460J77057k00301k70553P67589p20443
7334A71409K22727r0084P38962k00861o49944M11018n27417k24661o3749P554
7324b05046m9822J24802P45791j276968n81493N35602j80347P00426o4515K76265
7314B4695O15897J07930j96703o20492R502N59395l57892M2199R36139j02947
7304A017723m91890J88996k11813n64625N82924Q62362J09541l4080N87899m4107
7294B002930p18570J01465o963n51764k97644R4070l59615k95725P04952N13911
7284A187047m12873o26527j14349Q61942j70690k90142m8161m487p01605K00972
$$ plain form
7274 -118873 -95070 -170795 -424736 -193132 466322 355512 458114 230797 840220 1140183
7264 1140183 1179168 726905 1064983 1848913 1780033 1848014 1240439 1418967 1287892 815733
7254 815733 839552 961063 612007 902196 1860805 2064134 1731879 1195793 929539 1291637
7244 1291637 1057078 597957 731796 1202184 602146 164053 21345 -255820 -445689 -103311
7234 -103311 344355 462484 753434 1156888 1370427 1323907 1105201 371634 431597 -59574
7224 -59574 -499445 194633 705152 565718 427295 224302 793674 760998 -156167 233
7214 233 -192140 -113175 -149913 145559 717805 1003682 1257130 960796 1192703 954324 346768
7203 346768 311951 189197 -480006 -176817 287713 202882 -1005 742144 1114139 1490211
$$ packed form
7274a18873K3803p5725k53941K31604O59454j10810J02602k27317O09423K99963
7264A140183L8985m52263L38078P83930o8880O7981o07575J78528j31075m72159
7254H15733K3819J21511l49056K90189R58609K03329l32255n36086k66254L62098
7244A291637k34559m59121J33839M70388o00038m38093j42708k77165j89869L42378
7234a03311M47666J18129K90950M03454K13539m6520k18706p33567N9963m91171
7224e9574m39871O94078N10519j39434j38423k02993N69372l2676r17165J56400
7214B33j92373P8965l6738K95472N72246K85877K53448k96334K31907k38379o07556
7203C46768l4817j22754o69203L03189M64530q4831k03887P43149L71995L76072
$$ plain form
7193 1490211 1811505 1052940 1184297 1595748 1828281 1744952 1718320 1477318 1189442 841967
7183 841967 777141 664931 630740 778742 471147 816716 1072720 1059038 1448972 1236281
7173 1236281 1111893 1250809 639679 809053 329062 -74613 53944 -257596 -141272 94678
7163 94678 992580 1133050 947622 1219728 664840 873435 1134543 755911 441355 1051650
7153 1051650 1123173 1381614 1921277 1142944 1514010 1619757 711702 993733 869764 320646
7143 320646 760277 201176 379160 762054 776892 1210015 737785 414876 -84556 -70512
7133 -70512 -158092 538941 564517 358824 548095 389713 1085121 755275 989135 457517
7123 457517 -459614 -152825 1014705 1873777 1227875 1064362 1290546 1192302 1650021 1762056
$$ packed form
7193A490211L21294p58565J31357M11451K32533q3329k6632k41002k87876l47475
7183H41967o4826j12210l4191J48002l07595L45569K56004j3682L89934k12691
7173A236281j24388J38916o11130J69374m79991m03675J28557l11540J16324K35950
7163I4678Q97902J40470j85428K72106n54888K08595K61108l78632l14556O10295
7153A051650P1523K58441N39663p78333L71066J05747r08055K82031j23969n49118
7143C20646M39631n59101J77984L82894J4838M33123m72230l22909m99432J4044
7133g0512q7580O97033K5576k05693J89271j58382O95408l29846K33860n31618
7123D57517r17131L06789J167530Q59072o45902j63513K26184r8244M57719J12035
$$ plain form
7113 1762056 927288 1668979 2305458 2063750 1946966 2421054 1942629 2051188 1794859 1929317
7103 1929317 1786829 1309871 1900235 2339858 1891142 1971937 2256793 2110199 1955161 1110141
7093 1110141 584126 684695 540315 -9948 715337 642945 752524 836076 1522403 1347650
7083 1347650 1067250 1750970 1150306 638735 1688584 1782354 1349447 1332429 1725412 1552726
7073 1552726 733400 1362904 1355103 1145643 1609311 1868542 1917891 2453877 2466681 1598913
7063 1598913 1896343 1315080 631629 792017 1073058 1366035 1409056 1564572 2395599 2504627
7053 2504627 2297555 2934142 2611907 2426534 2829752 2312415 2024079 1346531 1415401 2412194
7043 2412194 2745696 2858388 3163182 3452483 3122950 2445228 2413120 3125846 3090715 2539353
$$ packed form
7113A762056q34768P41691O36479k41708j16784M74088m78425J08559k56329J34458
7103A929317j42488m76958N90364M39623m48716Q0795K84856j46594j55038q45020
7093A110141n26015J00569j44380n50263P25285p2392J09579Q3552O86327j74753
7083A347650k80400O83720o00664n11571J049849R3770m32907j7018L92983j72686
7073A552726q19326O29504p801k09460M63668K59231M9349N35986J2804q67768
7063A598913K97430n81263o83451J60388K81041K92977M3021J55516Q31027J09028
7053B504627k07072O36587l22235j85373M03218n17337k88336o77548O8870R96793
7043B412194L33502J12692L04794K89301l29533o77722l2108P12726l5131n51362
$$ plain form
7033 2539353 3011046 3009119 2230407 1986100 2005581 2690654 2024301 1949906 2603383 2901670
7023 2901670 3254378 3025170 3051253 3136710 2692478 2626511 2605436 2710168 2849580 2002315
7013 2002315 2984924 4016772 3471535 2838963 2755777 2595548 2532844 3176182 3187846 3360666
7003 3360666 3770921 3897614 3675194 4185143 4493666 3973511 3715782 3891144 3849905 3324695
6993 3324695 3847181 3859464 4592931 4054303 3654107 3690995 4023481 4589687 4358789 3752766
6983 3752766 3466768 3932375 3846476 3580558 3657775 4009707 3881593 2672931 2646639 3526002
6973 3526002 4316253 4088989 3677515 4986259 4635484 4693242 4541257 4848856 4504277 4465788
6963 4465788 4630427 4106605 4323677 3768909 3702097 3982416 3970389 3901673 3292138 3937552
$$ packed form
7033B539353M71693j927p78712k44307J9481O85073o66353p4395O53477K98287
7023B901670L52708k29208K6083Q5457m44232o5967k1075J04732J39412q47265
7013B002315R82609J031848n45237o32572q3186j60229o2704O43338J1664J72820
7003C360666M10255J26693k22420N09949L08523n20155k57729J75362m1239n25210
6993C324695N22486J2283P33467n38628m00196L6888L32486N66206k30898o06023
6983C752766k85998M65607q5899k65918P7217L51932j28114j208662k6292Q79363
6973C526002P90251k27264m11474J308744l50775N7758j51985L07599l44579l8489
6963D465788J64639n23822K17072n54768o6812K80319j2027o8716o09535O45414
$$ plain form
6953 3937552 3490799 3870783 4571723 4821620 5340963 5206311 4509483 4258275 4246315 4132539
6943 4132539 3553220 3723645 4140157 3927933 3515084 3775918 4177720 3957770 3981062 3721937
6933 3721937 3897717 4067820 4315770 4277195 4260099 4320048 3722271 3852524 3682363 3619899
6923 3619899 4293815 4172517 4630355 4224048 5069223 5577608 5478139 5254252 5374657 5417603
6913 5417603 4922643 5131426 5148528 4637887 4832372 4968957 4630052 4504002 4813565 4733603
6903 4733603 4963058 4803827 4617015 4576359 4810204 5204656 5526134 5250917 5793077 6394843
6893 6394843 5784225 5808486 5839970 6086440 6586818 6936615 7917738 8107433 7732374 7803347
6883 7803347 7420239 7936284 7794058 7559273 7349280 8237710 8359575 8225673 7958960 7655300
$$ packed form
6953C937552m46753L79984P00940K49897N19343j34652o96828k51208j1960j13776
6943D132539n79319J70425M16512k12224m12849K60834M01802k19950K3292k59125
6933C721937J75780J70103K47950l8575j7096N9949n97777J30253j70161o2464
6923C619899O73916j21298M57838m06307Q45175N08385r9469k23887J20405M2946
6913E417603m94960K08783J7102n10641J94485J36585l38905j26050L09563p9962
6903D733603K29455j59231j86812m0656K33845L94452L21478k75217N42160O01766
6893F394843o10618K4261L1484K46470N00378L49797R81123J89695l75059P0973
6883G803347l83108N16045j42226k34785k09993Q88430J21865j33902k66713l03660
$$ plain form
6873 7655300 8048829 8102903 7433162 7942498 8090973 8443692 9041221 9537054 10326194 11299371
6863 11299371 12278287 13211720 14187052 14031030 15294209 16202465 16499376 17277960 17361387
6854 17361387 18150231 18039254 18201605 18244926 18030120 18199234 17602902 17650159 17900658 18432761
6844 18432761 17876273 17934241 18675638 19306118 19786125 20031055 19908170 20261951 21588746
6835 21588746 21907665 22716134 25547096 27067456 29179548 32095433 34117536 36839919
6827 36839919 39306728 40250406 41521351 41410747 41145261 40580342 39374493 38219807 36854608
6818 36854608 34843489 33508354 32394114 31405343 30524617 30372592 30663251 30118286 30127694
6809 30127694 30616143 30889249 30478573 30293465 31490803 32714538 33318969 34462171 36076908
$$ packed form
6873G655300L93529N4074o69741N09336J48475L52719N97529M95833P89140R73177
6863A1299371R78916R33433R75332j56022J263179R08256K96911P78584Q3427
6854A7361387P88844j10977J62351M3321k14806J69114n96332M7257K50499N32103
6844A8432761n56488N7968P41397O30480M80007K44930j22885L53781J326795
6835B1588746L18919Q08469K830962J520360K112092K915885K022103K722383
6827C6839919K466809R43678J270945j10604k65486n64919j205849j154686j365199
6818C6854608k011119j335135j114240r88771q80726j52025K90659n44965R408
6809C0127694M88449K73106m10676j85108J197338J223735O04431J143202J614737
$$ plain form
6800 36076908 38630443 40706055 43911276 47241615 50372711 53376480 55922109 57371921
6792 57371921 57020856 56420016 55580856 52912117 49421100 45897542 43236827 40981830 38409725
6783 38409725 35941445 34575034 32696796 31561475 31039617 29769509 29309687 29197253 28630408
6774 28630408 27924937 27600608 27639743 28104856 29017470 29734468 31084031 31966033 33345874
6765 33345874 34074109 35272544 36292822 37431552 39530713 39865092 39885989 40005932 37703485
6756 37703485 34594966 32468270 30269926 27860697 25447565 24013348 22134911 20836674
6748 20836674 20556396 19742137 17648024 16676432 16708147 15445897 15121566 14766196 14152495
6739 14152495 13968197 13914981 14289792 13250714 13577384 14078522 14137374 13879096 14090300 14103507
$$ packed form
6800C6076908K553535K075612L205221L330339L131096L003769K545629J449812
6792E7371921l51065o00840q39160k668739l491017l523558k660715k254997k572105
6783C8409725k468280j366411j878238j135321n21858j270108m59822j12434n66845
6774B8630408p05471l24329L9135M65113R12614P16998J349563Q82002J379841
6765C3345874P28235J198435J020278J138730K099161L34379K0897J19943k302447
6756C7703485l108519k126696k198344k409229k413132j434217j878437j298237
6748B0836674k80278q14259k094113r71592L1715j262250l24331l55370o13701
6739A4152495j84298n3216L74811j039078L26670N01138N8852k58278K11204J3207
$$ plain form
6729 14103507 13467793 13357408 13346979 12798645 13126801 12271194 12174260 11451364 10884532 9744080
6719 9744080 8227166 8897701 7979568 8049047 8149540 7734128 7479104 6806638 6395728 6416719
6709 6416719 5984838 4997030 5348741 4945952 4796079 4859305 4692164 4500727 4265183 4718217
6699 4718217 4579786 4879703 5389526 5360667 5021766 4349783 3957442 3443918 3193976 3470685
6689 3470685 4095733 3421348 2734518 3513935 3339175 3340952 3418080 3143845 3054029 2912992
6679 2912992 2696317 2796639 2278750 2185517 1900402 2134554 1933865 2080651 2364635 2614757
6669 2614757 2669600 2816956 3061069 2714643 2104307 1922221 2465592 2011273 2438710 2716937
6659 2716937 2803067 2852101 2618520 2474897 2820766 2669806 2924818 3387590 2968029 2485439
$$ packed form
6729A4103507o35714j10385j0429n48334L28156q55607r6934p22896n66832j140452
6719I744080j516914O70535r18133O9479J00493m15412k55024o72466m10910K0991
6709F416719m31881r87808L51711m02789j49873O3226j67141j91437k35544M53034
6699D718217j38431K99917N09823k8859l38901o71983l92341n13524k49942K76709
6689C470685O25048o74385o86830P79417j74760J777P7128k74235q9816j41037
6679B912992k16675J00322n17889r3233k85115K34152k00689J46786K83984K50122
6669B614757N4843J47356K44113l46426o10336j82086N43371m54319M27437K78227
6659B716937Q6130M9034k33581j43623L45869j50960K55012M62772m19561m82590
$$ plain form
6649 2485439 2446732 2374691 2014019 2125731 1647660 2005953 1958017 1563419 1770813 1642674
6639 1642674 2026044 2738776 2489169 2298517 3004602 2856321 2202620 2293722 1753451 1678975
6629 1678975 811676 1122490 851075 927382 1702992 1603475 1250101 1768649 2353396 2077437
6619 2077437 2676998 2835150 2414466 1724283 2300475 2735414 1598955 1455190 1419540 1042609
6609 1042609 1353738 1488445 1397436 1612994 2265767 2176788 2220898 2295542 2446495 2470981
6599 2470981 1800707 1503042 1474338 1391172 830104 738327 1762454 1981313 2066337 2702420
6589 2702420 2867748 2506174 2016173 2518802 2670318 2262481 2684595 2912316 2566731 1854389
6579 1854389 1718326 497009 524934 308419 348347 1015296 968788 1549317 2165814 1992104
$$ packed form
6649B485439l8707p2041l60672J11712m78071L58293m7936l94598K07394j28139
6639A642674L83370P12732k49607j90652P06085j48281o53701R1102n40271p4476
6629A678975q67299L10814k71415P6307P75610r9517l53374N18548N84747k75959
6619B077437N99561J58152m20684o90183N76192M34939j136459j43765l5650l76931
6609A042609L11129J34707r1009K15558O52773q8979M4110P4644J50953K4486
6599B470981o70274k97665k8704q3166n61068r1777J024127K18859Q5024O36083
6589B702420J65328l61574m90001N02629J51516m07837M22114K27721l45585p12342
6579A854389j36063j221317K7925k16515L9928O66949m6508N80529O16497j73710
$$ plain form
6569 1992104 2376719 2730395 2165967 1392000 1279176 1476068 1953440 1897606 878923 1180207
6559 1180207 938564 1415831 1948981 1668922 1487708 1712222 2023172 959203 1073828
6550 1073828 922208 955126 836080 179917 851598 468252 1251502 1406448 1265397 1129471
6540 1129471 1360331 1731959 1002932 1527030 1671427 1204599 1004240 1322654 1199344 1837413
6530 1837413 1863768 1909529 2156645 1532793 1455113 1825828 1257561 994880 697330 1272443
6520 1272443 1747517 1223810 1140547 1700727 1737492 995670 1416385 1743880 2148071 1823103
6510 1823103 1056020 1041059 797947 975701 926759 623851 386873 869073 1024023 889563
6500 889563 1415972 1074071 721229 974374 1587283 1934127 1670529 1765848 1553069 1326886
$$ packed form
6569A992104L84615L53676n64428p73967j12824J96892M77372n5834j018683L01284
6559A180207k41643M77267N33150k80059j81214K24514L10950j063969J14625
6550A073828j51620L2918j19046o56163O71681l83346P83250J54946j41051j35926
6540A129471K30860L71628p29027N24098J44397m66828k00359L18414j23310O38069
6530A837413K6355M5761K47116o23852p7680L70715n68267k62681k97550N75113
6520A272443M75074n23707q3263N60180L6765p41822M20715L27495M04191l24968
6510A823103p67083j4961k43112J77754m8942l02908k36978M82200J54950j34460
6500H89563N26409l41901l52842K53145O12909L46844k63598R5319k12779k26183
$$ plain form
6490 1326886 1511602 1510010 1540178 1689482 2865516 3252946 2975500 2468998 3001971 2786539
6480 2786539 2220903 2262766 1983334 1669790 2331303 2625106 2740234 2058793 1527775 1612091
6470 1612091 2185989 2220319 1260951 1358120 1715057 1035873 853204 1150431 1555594 1824189
6460 1824189 1177424 2071495 2536673 2106055 1985944 1934281 1938557 2265484 2441293 2684837
6450 2684837 3121509 2867028 2956036 2683083 2003745 2269958 1288916 1468598 1762521 2483394
6440 2483394 2256095 1914980 2645438 2611512 2635529 2343665 2625155 2254803 1938799 1821402
6430 1821402 1781727 1650072 1431921 1666551 2305621 2488329 2702666 2856842 2741729 3236194
6420 3236194 2741093 2438547 2575851 2289504 3717408 3462302 3152110 2960036 2685001
$$ packed form
6490A326886J84716j592L0168J49304J176034L87430k77446n06502N32973k15432
6480B786539n65636M1863k79432l13544O61513K93803J15128o81441n31018Q4316
6470A612091N73898L4330r59368R7169L56937o79184j82669K97227M05163K68595
6460A824189o46765Q94071M65178m30618j20111n1663M276L26927J75809K43544
6450B684837M36672k54481Q9008k72953o79338K66213r81042J79682K93923P20873
6440B483394k27299l41115P30458l3926K4017k91864K81490l70352l16004j17397
6430A821402l9675j31655k18151K34630O39070J82708K14337J54176j15113M94465
6420C236194m95101l02546J37304k86347J427904k55106l10192j92074k75035
$$ plain form
6411 2685001 2519578 2936395 2932409 2756861 2708187 2402039 2922804 3171758 3093322 2297118
6401 2297118 1847317 2155054 2440248 2457151 2090696 1836364 1658894 1636173 2186850 2321518
6391 2321518 1921870 2154062 2719207 2854115 2990754 2917699 2050649 1954128 2341084 3099810
6381 3099810 3406576 3098221 3942513 4164598 3680195 3242667 2774362 2077385 2376138 2373660
6371 2373660 2699916 2691631 2704389 2634700 2864294 3137364 3082352 2481930 2292267 3114364
6361 3114364 3738136 2690761 2089534 2220511 1654466 843583 2037507 2937412 2950782
6352 2950782 2478711 2612612 3285509 3223510 2268187 1206498 1410258 1345610 1168059 379451
6342 379451 857601 1754027 1504912 1692226 2122253 1763224 1632895 1461252 2174965 1790926
$$ packed form
6411B685001j65423M16817l986j75548m8674l06148N20765K48954p8436p96204
6401B297118m49801L07737K85194J6903l66455k54332j77470k2721N50677J34668
6391B321518l99648K32192N65145J34908J36639p3055q67050r6521L86956P58726
6381C099810L06766l08355Q44292K22085m84403m37528m68305o96977K98753k478
6371B373660L26256q285J2758o9689K29594K73070n5012o00422j89663Q22097
6361C114364O23772j047375o01227J30977n66045q10883J193924Q99905J3370
6352B950782m72071J33901O72897o1999r55323j061689K03760o4648j77551p88608
6342C79451M78150Q96426k49115J87314M30027l59029j30329j71643P13713l84039
$$ plain form
6332 1790926 2119618 2218945 1875710 2776466 2719739 2578623 2635571 3610767 3477928 2438016
6322 2438016 3008272 2765764 1951356 2519733 2642187 2789897 2110389 2358757 2160726 1773527
6312 1773527 2227936 1782615 959193 1434740 1875363 2039807 1618470 1354634 1850702 1908231
6302 1908231 1935997 1771710 1525564 1621294 1449416 1298371 1583441 1751065 1519525 877615
6292 877615 1731616 2419720 2211396 1194372 1620883 2055478 2120874 2077206 1645819 1644952
6282 1644952 1394469 1241090 2003810 1433908 1375055 1468809 1133627 1457779 1575281 1495876
6272 1495876 1823830 2581653 1748685 1199958 1819053 1599788 1355798 783859 1533407 2551063
6262 2551063 3050720 1983309 2681034 1946558 2472525 2261674 945741 979856 1285878
$$ packed form
6332A790926L28692R9327l43235R00756n6727j41116N6948R75196j32839j039912
6322B438016N70256k42508q14408N68377J22454J47710o79508K48368j98031l87199
6312A773527M54409m45321q23422M75547M40623J64444m21337k63836M96068N7529
6302A908231K7766j64287k46146R5730j71878j51045K85070J67624k31540o41910
6292H77615Q54001O88104k08324j017024M26511M34595O5396m3668m31387q67
6282A644952k50483j53379P62720n69902n8853R3754l35182L24152J17502p9405
6272A495876L27954P57823q32968n48727O19095k19265k43990n71939P49548J017656
6262B551063M99657j067411O97725p34476N25967k10851j315933L4115L06022
$$ plain form
6253 1285878 1893461 1052838 942865 1251786 1492834 1504135 1167098 1333494 1534137 2240159
6243 2240159 1603713 950558 1620432 1694523 1194290 588137 1175614 721426 664980 1072588
6233 1072588 642039 333098 1532065 1474983 1407096 781950 738262 804458 1478734 1336403
6223 1336403 287271 1092234 1742422 971615 417023 672554 2089699 1393419 1066468
6214 1066468 1148210 1622707 1699831 1204915 903258 1133745 1207449 1008221 1411694 1588718
6204 1588718 1037480 1470916 2617757 2077539 449441 1136469 1621322 999636 305071
6195 305071 643235 1600795 1262103 649552 485508 904964 1287630 972793 106710 833914
6185 833914 1311455 1851693 1616155 1593021 1513473 1575793 1744597 1420910 1291429 955906
$$ packed form
6253A285878O07583q40623j09973L08921K41048J1301l37037J66396K00643P06022
6243B240159o36446o53155O69874P4091n00233o06153N87477m54188n6446M07608
6233A072588m30549l08941J198967n7082o7887o25146m3688O6196O74276j42331
6223A336403j049132Q04963O50188p70807n54592K55531J417145o96280l26951
6214A066468Q1742M74497P7124m94916l01657K30487P3704j99228M03473J77024
6204A588718n51238M33436J146841n40218j628098O87028M84853o21686o94565
6195C05071L38164R57560l38692o12551j64044M19456L82666l14837q66083P27204
6185H33914M77541N40238k35538k3134p9548O2320J68804l23687j29481l35523
$$ plain form
6175 955906 700123 1325850 1164949 604928 914294 1706656 1188084 596805 589060 1369837
6165 1369837 723691 -83834 131694 1111065 1886045 1304334 1708667 1840419 1918906 1141713
6155 1141713 724004 958427 799896 566634 1631262 1707119 771950 926807 1790909 684581
6145 684581 507173 1103680 1106396 583469 989673 1450926 910622 279083 363450 854087
6135 854087 535807 1557371 1237037 795885 1280994 2113141 2743644 2193996 2869894 2584266
6125 2584266 2112325 1861331 1382687 1386540 847212 1570272 1442841 1409864 1839086 2222818
6115 2222818 1795670 1290397 1422005 1430654 847617 1179055 1445648 1368188 1530241 1754592
6105 1754592 1384016 912862 1361001 1872860 943888 588623 845883 2403457 2002126
$$ packed form
6175I55906k55783O25727j60901n60021L09366P92362n18572n91279p745P80777
6165A369837o46146q07525K15528R79371P74980n81711M04333J31752P8487p77193
6155A141713m17709K34423j58531k33262J064628P5857r35169J54857Q64102j106328
6145F84581j77408N96507K716n22927M06204M61253n40304o31539Q4367M90637
6135H54087l18280J021564l20334m41152M85109Q32147O30503n49648O75898k85628
6125B584266m71941k50994m78644L853n39328P23060j27431l2977M29222L83732
6115B222818m27148n05273J31608Q649n83037L31438K66593p7460J62053K24351
6105A754592l70576m71154M48139N11859r28972l55265K57260J557574m01331
$$ plain form
6096 2002126 1999668 1712822 1782882 2247026 2419879 1245079 943469 1672088 1629975 1498059
6086 1498059 1768375 2030652 2456014 2096601 1906429 2034291 2011053 2694731 1610781 1524109
6076 1524109 1908745 1903555 2057869 2291071 2476383 2798784 3560681 3737606 2674748 2306945
6066 2306945 2718719 3274381 1706310 1010903 1849314 2336879 2153995 2061766 2443162 2829023
6056 2829023 2874870 3121802 2954867 3750767 3975856 4288414 4287917 3363757 3548621 3809012
6046 3809012 2984791 1819219 1894492 2237755 2149652 2558103 2111131 2088072 2311288 2817927
$$ packed form
6096B002126k458k86846P0060M64144J72853j174800l01610P28619m2113j31916
6086A498059K70316K62277M25362l59413j90172J27862k3238O83678j083950q6672
6076A524109L84636n190J54314K33202J85312L22401P61897J76925j062858l67803
6066B306945M11774N55662j568071o95407Q38411M87565j82884r2229L81396L85861
6056B829023M5847K46932j66935P95900K25089L12558m97r24160J84864K60391
6046C809012q24221j165572P5273L43263q8103M08451m46972k3059K23216N06639
$$ [...]
##END NTUPLES=NMR SPECTRUM
##END=
