##TITLE=1H_DE-80H_X3
 200.13MHz, d2o
 8 sc
 
 19ns.26.2.2025
##JCAMPDX= 6.0         $$ Bruker NMR JCAMP-DX V2.0
##DATA TYPE= NMR SPECTRUM
##DATA CLASS= NTUPLES
##ORIGIN= UXNMR, Bruker Analytische Messtechnik GmbH
##OWNER= pz
$$ XWIN-NMR		Version 3.5
$$ Fri Jan 23 11:29:53 2026 Russian Standard Time (UT+4h)  Yarkov@DPX200
##.OBSERVE FREQUENCY= 200.1313
##.OBSERVE NUCLEUS= ^1H
##.ACQUISITION MODE= SIMULTANEOUS
##.ACQUISITION SCHEME= undefined
##.AVERAGES= 8
##.DIGITISER RES= 18
##SPECTROMETER/DATA SYSTEM= spect
##.PULSE SEQUENCE= zg30
##.SOLVENT NAME= DMSO
##.SHIFT REFERENCE= (INTERNAL, DMSO, 0, 15.4979)
##AUDIT TRAIL= $$ (NUMBER, WHEN, WHO, WHERE, WHAT)
$$ ##TITLE= Audit trail, XWIN-NMR		Version 3.5
$$ ##JCAMPDX= 5.01
$$ ##ORIGIN= Bruker BioSpin GmbH
$$ ##OWNER= Yarkov
$$ C:/Bruker/XWIN-NMR/data/yarkov2/nmr/H-C/1/pdata/1/auditp.txt
$$ ##AUDIT TRAIL=  $$ (NUMBER, WHEN, WHO, WHERE, WHAT)
(   1,<2026-01-23 11:27:55.57 +0400>,<Yarkov>,<DPX200>,
      <created by zg, POWCHK disabled, PULCHK disabled
       configuration hash MD5:
       00 E9 B6 7A A2 85 ED C7 34 08 36 98 17 FE 4E 26
       data hash MD5: 16K
       92 12 C0 6C 21 B5 7D 10 ED 1B 98 35 2A 9A BC 51>)
(   2,<2026-01-23 11:28:03.01 +0400>,<Yarkov>,<DPX200>,
      <Start of raw data processing
       efp BC_mod = 2 LB = 0.25 FT_mod = 6 PKNL = 1 PHC0 = -5297.497 PHC1 = 7.62193 SI = 16K 
       data hash MD5: 16K
       07 9B 73 47 2D 01 12 C4 12 87 8D 18 7C 58 56 9F>)
(   3,<2026-01-23 11:28:38.96 +0400>,<Yarkov>,<DPX200>,
      <pk PHC0 = -3.4 PHC1 = 0 
       data hash MD5: 16K
       16 46 56 88 B6 5C 38 69 C4 DD A1 8B 9B 0D 1D 47>)
$$ ##END=
$$ 
$$ hash MD5
$$ 9A 62 DD DE A7 D2 80 B0 78 EE 95 39 CE 51 9A 0D
##$RELAX= 
##$RELAX= 
##$RELAX= 
##$RELAX= 
##$RELAX= 
##$RELAX= 
$$ Bruker specific parameters
$$ --------------------------
##$DU= <C:/Bruker/XWIN-NMR>
##$EXPNO= 1
##$NAME= <H-C>
##$PROCNO= 1
##$TYPE= <nmr>
##$USER= <yarkov2>
##$AMP= (0..31)
100 100 100 100 100 100 100 100 100 100 100 100 100 100 100 100 100 100 
100 100 100 100 100 100 100 100 100 100 100 100 100 100 
##$AQSEQ= 0
##$AQ_mod= 1
##$AUNM= <au_zg>
##$AUTOPOS= <>
##$BF1= 200.13
##$BF2= 200.13
##$BF3= 200.13
##$BF4= 200.13
##$BF5= 200.13
##$BF6= 200.13
##$BF7= 200.13
##$BF8= 200.13
##$BYTORDA= 1
##$CFDGTYP= 0
##$CFRGTYP= 5
##$CHEMSTR= <none>
##$CNST= (0..31)
1 1 145 1 1 1 1 1 1 1 1 1 1 1 1 1 1 1 1 1 1 1 1 1 1 1 1 1 1 1 1 1 
##$CPDPRG= <>
##$CPDPRG1= <>
##$CPDPRG2= <>
##$CPDPRG3= <>
##$CPDPRG4= <mlev>
##$CPDPRG5= <mlev>
##$CPDPRG6= <mlev>
##$CPDPRG7= <mlev>
##$CPDPRG8= <mlev>
##$CPDPRGB= <>
##$CPDPRGT= <>
##$D= (0..31)
0 0.7 0 0 0 0 0 0 0 0 0 0.03 0 0 0 0 0 0 0 0 0 0 0 0 0 0 0 0 0 0 0 0 
##$DATE= 1769153275
##$DBL= (0..7)
120 120 120 120 120 120 120 120 
##$DBP= (0..7)
150 150 150 150 150 150 150 150 
##$DBP07= 0
##$DBPNAM0= <>
##$DBPNAM1= <>
##$DBPNAM2= <>
##$DBPNAM3= <>
##$DBPNAM4= <>
##$DBPNAM5= <>
##$DBPNAM6= <>
##$DBPNAM7= <>
##$DBPOAL= (0..7)
0.5 0.5 0.5 0.5 0.5 0.5 0.5 0.5 
##$DBPOFFS= (0..7)
0 0 0 0 0 0 0 0 
$$ [...]
##$SUBNAM2= <"">
##$SUBNAM3= <"">
##$SUBNAM4= <"">
##$SUBNAM5= <"">
##$SUBNAM6= <"">
##$SUBNAM7= <"">
##$SUBNAM8= <"">
##$SUBNAM9= <"">
##$SW= 18.0517328524113
##$SWIBOX= (0..15)
0 0 2 0 0 0 0 0 0 0 0 0 0 0 0 0 
##$SW_h= 3612.71676300578
##$TD= 16384
##$TD0= 1
##$TE= 0
##$TE2= 300
##$TE3= 300
##$TEG= 300
##$TL= (0..7)
0 120 120 120 120 120 120 120 
##$TP= (0..7)
150 150 150 150 150 150 150 150 
##$TP07= 0
##$TPNAME0= <>
##$TPNAME1= <>
##$TPNAME2= <>
##$TPNAME3= <>
##$TPNAME4= <>
##$TPNAME5= <>
##$TPNAME6= <>
##$TPNAME7= <>
##$TPOAL= (0..7)
0.5 0.5 0.5 0.5 0.5 0.5 0.5 0.5 
##$TPOFFS= (0..7)
0 0 0 0 0 0 0 0 
##$TUNHIN= 0
##$TUNHOUT= 0
##$TUNXOUT= 0
##$USERA1= <user>
##$USERA2= <user>
##$USERA3= <user>
##$USERA4= <user>
##$USERA5= <user>
##$V9= 5
##$VALIST= <valist>
##$VCLIST= <CCCCCCCCCCCCCCC>
##$VD= 0
##$VDLIST= <DDDDDDDDDDDDDDD>
##$VPLIST= <PPPPPPPPPPPPPPP>
##$VTLIST= <TTTTTTTTTTTTTTT>
##$WBST= 1024
##$WBSW= 4
##$XGAIN= (0..3)
0 0 0 0 
##$XL= 0
##$YL= 0
##$YMAX_a= 454642
##$YMIN_a= -224587
##$ZGOPTNS= <>
##$ZL1= 120
##$ZL2= 120
##$ZL3= 120
##$ZL4= 120
##$ABSF1= 0
##$ABSF2= 0
##$ABSG= 0
##$ABSL= 0
##$ALPHA= 0
##$AQORDER= 0
##$ASSFAC= 0
##$ASSFACI= 0
##$ASSFACX= 0
##$ASSWID= 0
##$AUNMP= <proc_1d>
##$AZFE= 0.1
##$AZFW= 0.1
##$BCFW= 0
##$BC_mod= 2
##$BYTORDP= 0
##$COROFFS= 0
##$CY= -3
##$DATMOD= 1
##$DC= 0
##$DFILT= <>
##$DTYPP= 0
##$F1P= 0
##$F2P= 0
##$FCOR= 1
##$FTSIZE= 16384
##$FT_mod= 6
##$GAMMA= 0
##$GB= 0
##$INTBC= 1
##$INTSCL= 3.241238e-09
##$ISEN= 128
##$LB= 0.25
##$LEV0= 0
##$LPBIN= 0
##$MAXI= 10000
##$MC2= 0
##$MEAN= 0
##$ME_mod= 0
##$MI= 1.114404
##$NCOEF= 0
##$NC_proc= -8
##$NLEV= 6
##$NOISF1= 3.799351
##$NOISF2= 2.8
##$NSP= 0
##$NTH_PI= 0
##$NZP= 0
##$OFFSET= 15.4979
##$PC= 1
##$PHC0= -5300.897
##$PHC1= 7.62193
##$PH_mod= 1
##$PKNL= yes
##$PPARMOD= 0
##$PSCAL= 0
##$PSIGN= 0
##$REVERSE= no
##$SF= 200.130004763139
##$SI= 16384
##$SIGF1= 3
##$SIGF2= 2
##$SINO= 0.751879
##$SIOLD= 32768
##$SREGLST= <19F.Aceton>
##$SSB= 0
##$STSI= 16384
##$STSR= 0
##$SW_p= 3612.71676300578
##$SYMM= 0
##$S_DEV= 0
##$TDeff= 16384
##$TDoff= 0
##$TI= <>
##$TILT= no
##$TM1= 0
##$TM2= 0
##$TOPLEV= 0
##$USERP1= <user>
##$USERP2= <user>
##$USERP3= <user>
##$USERP4= <user>
##$USERP5= <user>
##$WDW= 1
##$XDIM= 16384
##$YMAX_p= 485342891
##$YMIN_p= -6610331
$$ End of Bruker specific parameters
$$ ---------------------------------
##NTUPLES= NMR SPECTRUM
##VAR_NAME=  FREQUENCY,     SPECTRUM/REAL,   SPECTRUM/IMAG
##SYMBOL=    X,             R,               I
##VAR_TYPE=  INDEPENDENT,   DEPENDENT,       DEPENDENT
##VAR_FORM=  AFFN,          ASDF,            ASDF
##VAR_DIM=   16384,         16384,           16384
##UNITS=     HZ,            ARBITRARY UNITS, ARBITRARY UNITS
##FACTOR=    0.220516191357247, 1,           1
##FIRST=     3101.5948026509, 0,             0
##LAST=      -511.121960354883, 0,           0
##MIN=       -511.121960354883, -6610331,    0
##MAX=       3101.5948026509, 485342891,     0
$$ Real data points
##PAGE= N=1
##DATA TABLE= (X++(R..R)), XYDATA
$$ [...]
11850f44267P73157n44295M67594j66954l58205M94104K8127j04462j7381m77434
11840e50016p56214J468063k62680n37954J58375o53959Q16628n97911O5127n22222
11830a372763O35242K87637M74828m88915o97706P97186J3555O32291r20248k38553
11820h77446J167427n7407K05610n92026p93474N42233M81002M88085q67457J57239
11810a46214r49352P21035k99146M76398P1191p32025M34969L1887O75416K46548
11800E30707p78415L16362J11932q86012M12715j78470J05417M73652k75128p21219
11790h88459k8615L59863O77408l62776J53461k89920J1655k80245M14455j081959
11780a315132O97250M45581l30948J53649K5437k71624Q37833r4002K5170L61049
$$ plain form
11850 -644267 128890 -415405 52189 -114765 -472970 21134 49261 -55201 -72582 -550016
11840 -550016 -1306230 161833 -100847 -638801 -480426 -1134385 -317757 -915668 -850541 -1372763
11830 -1372763 -737521 -449884 24944 -463971 -1161677 -364491 -350936 281355 -638893 -877446
11820 -877446 289981 232574 438184 -153842 -947316 -405083 75919 564004 -303453 -146214
11810 -146214 -1095566 -374531 -673677 -197279 -126088 -858113 -423144 -391257 284159 530707
11800 530707 -247708 68654 180586 -705426 -292711 -471181 -365764 107888 -167240 -888459
11790 -888459 -917074 -557211 120197 -242579 -89118 -379038 -367383 -647628 -233173 -1315132
11780 -1315132 -617882 -172301 -503249 -349600 -324163 -595787 242046 148044 173214 534263
11770E34263J18362j167288l58543R67391j42078M03016j574238l16917P81016
11761g55016R61784N69229j727496L88826K10602k93904M55179l65957n01057
11752a057810N83630Q74545j975292L81092o2944M05971K87003P5417J46424k35497
11742e77461k7308k20130m53580N38856L56533k97153M26642O58223j008068m9130
11732f52576l46764O98071N24908N97133j351543k33478R08286k20494P33452
11723F56995p36401n38952K68229N74869L37837k77271m63973j96998J65208K23686
11713A3229M28437p97909o8478J177463p60188k24957o77139j9703M53254L78136
11703i7855J74862n23040Q6972O17695l62642j91196n36815J89873M50176O91698
$$ plain form
11770 534263 652625 -514663 -873206 94185 -47893 355123 -1219115 -1536032 -755016
11761 -755016 206768 775997 -951499 -562673 -352071 -645975 -190796 -556753 -1057810
11752 -1057810 -474180 400365 -1574927 -1193835 -1256779 -850808 -563805 -488388 -341964 -577461
11742 -577461 -604769 -824899 -1278479 -739623 -383090 -680243 -253601 404622 -603446 -652576
11732 -652576 -999340 -301269 223639 820772 -530771 -764249 144037 -76457 656995
11723 656995 -79406 -618358 -350129 224740 562577 285306 -178667 -375665 -210457 13229
11713 13229 441666 -356243 -424721 752742 -7446 -232403 -909542 -929245 -475991 -97855
11703 -97855 77007 -446033 -359061 258634 -104008 -295204 -832019 -642146 -191970 499728
11693D99728k59143l95187j90789j08031M02629k49747m64027K76824N73322J69534
11683B55113j42386j10475j124853N53402N88172P328k68400j04595j26126R2782
11673c80038J35996o03913L2151k24381P87264r48538L54275N79250j70758J143121
11663G04429j034144J05214m09580K87450L25714n2042M94472j231422R0668j49476
11653h68717M05700N72433P20518L06646j511742Q75803n96056J99240j51201
11644d7376K32692l05765q13643N74836j131611L78435J41634M3406J139539p79842
11634e67695K39819n59368Q1770O05993p61431J83175p31836M06230K67194K42664
11624e93485J11490m2677O11151m12732L55724J3980l41646M78847k50590J44984
$$ plain form
11693 499728 240585 -154602 -345391 -453422 -50793 -300540 -764567 -487743 85579 255113
11683 255113 112727 2252 -1122601 -569199 18973 26301 -242099 -346694 -472820 -380038
11673 -380038 -244042 -847955 -815804 -1040185 -252921 -1201459 -847184 -267934 -438692 704429
11663 704429 -329715 -224501 -634081 -346631 -20917 -72959 421513 -809909 -719241 -868717
11653 -868717 -463017 109416 829934 1136580 -375162 500641 -95415 103825 -47376
11644 -47376 185316 -120449 -934092 -359256 -1490867 -1112432 -970798 -927392 212147 -567695
11634 -567695 -327876 -887244 -805474 -199481 -960912 -777737 -1509573 -1103343 -836149 -593485
11624 -593485 -481995 -524672 86479 -326253 29471 43451 -298195 180652 -69938 75046
11614G5046j038287J00086O32764Q1357j2907j4576n05932Q61602o5260k48891
11604a34998Q0168o3715N91492j12470j014528M88940q94069J276973l72559p004
11594a61770L52601l75783j30936m5893n7434k30323M03975J56873n683j72270
11584b66643j35927m3657J10332k148J58489m6283j29647M77674J55287m31564
11574a54087j12546N9084O44448M07013k89124j28421q62039q6307Q71102q85224
11564e36101L57299l36287k95471M79331k56096J44622M80902n8044j09911j41678
11554b71434K75650l36561o2421k28414M76799r1751J65106k3570k11612K40107
11544f8101O52040j91588O04031m58605l12126l26758L77966L4869N56127m11067
$$ plain form
11614 75046 -963241 -863155 -230391 -149034 -161941 -176517 -682449 179153 113893 -134998
11604 -134998 -54830 -118545 472947 360477 -654051 -165111 -1059180 217793 -154766 -161770
11594 -161770 190831 -184952 -315888 -361781 -419215 -649538 -245563 -88690 -94373 -266643
11584 -266643 -402570 -446227 -335895 -338043 -179554 -225837 -355484 122190 277477 -154087
11574 -154087 -266633 -207549 436899 843912 554788 426367 -435672 -521979 349123 -536101
11564 -536101 -178802 -515089 -810560 -331229 -587325 -442703 38199 -19845 -129756 -271434
11554 -271434 4216 -332345 -394766 -623180 -146381 -238132 -73026 -96596 -308208 -68101
11544 -68101 583939 392351 996382 537777 225651 -101107 276859 311728 867855 456788
11534D56788q59414n1374N82823N82048N21757n74957m32372m52464M23925o76232
11524d79472N4318L38702j52255r45561l20727J70653O95289P04055j98083P3049
11514f0032l62950j16625l83994O86106J0705R22959q13718j31486k75558P81681
11504B57088L63656k60121K42702j55102p75459r173o63354O71560O76609K12876
11494E61282O2796p08236m03314Q64363q4317N77898m10553l65534l29709M7287
11484a88037L99361O52569m53760l82196j42744o96476J329462Q05032k30024
11475A093187j59066n91283j87240R4266j03320m32720J022311K66766N39242
11466A542143K23864j099823K41195m84216R40725l44192j91459p94389L60278
$$ plain form
11534 456788 -402626 -454000 128823 710871 1232628 657671 225299 -227165 196760 -479472
11524 -479472 -425154 -86452 -238707 -1184268 -1504995 -1334342 -639053 65002 -133081 -60032
11514 -60032 -422982 -539607 -923601 -237495 -226790 696169 -117549 -249035 -524593 257088
11504 257088 620744 360623 603325 448223 -327236 -336409 -999763 -328203 348406 561282
11494 561282 624078 -84158 -487472 376891 292574 870472 459919 94385 -235324 -188037
11484 -188037 211324 863893 410133 27937 -114807 -811283 518179 1323211 1093187
11475 1093187 934121 342838 155598 249864 146544 -286176 736135 1002901 1542143
11466 1542143 1766007 666184 907379 423163 1363888 1019696 828237 33848 394126
11457C94126m81333N05487J11210o05092J121793n70404j7813j14442N08695L69723
11447A221950n33694n08447L8928m5640Q5399R58426J33368j5270m20672L35708
11437A250056l19028K98656M20183p53929j41550j90278P83258o31926j47934
11428E67508o4556l69802J879248o67942r4524N83910l96783J41855K50891j013944
11418H15861N7081N53798q84998Q84289k98949M67172m13941o3749J80073m36797
11408H59840P42888N47064j297862M01753N71668r50236L22716m44524N19830
11399A273137k14161N52995j328428J708729K69292j12824k93349n93418P09324
11390A971297n73779J244645p99036j106883O74286p31105L0023O8475Q2147K01908
$$ plain form
11457 394126 -87207 418280 529490 -75602 1046191 475787 457974 343532 852227 1221950
11447 1221950 688256 179809 218737 173097 258496 1216922 1350290 1335020 914348 1250056
11437 1250056 931028 1229684 1649867 895938 754388 564110 1347368 715442 567508
11428 567508 502952 133150 2012398 1344456 1249932 1833842 1437059 1578914 1829805 815861
11418 815861 872942 1426740 541742 1426031 1127082 1594254 1180313 1116564 1296637 859840
11408 859840 1602728 2149792 851930 1253683 1825351 875115 1197831 753307 1273137
11399 1273137 1058976 1611971 283543 1992272 2261564 2148740 1855391 1261973 1971297
11390 1971297 1397518 2642163 1843127 736244 1410530 679425 709448 777923 860070 1061978
11380A061978l24987L87181j017594N28851M15016K4431n32317K65714o37644
11371A70629R7675K62462J22159K79870k05635Q5492n08073N9961M49146p72760
11361D0926Q31925J74361m01373q5956l76364r2468k96092Q48798J44501n36146
11351B52112M81628k80711o21515K30798K71315j98345O10893n8565j84740J72809
11341F75679l31821K33770o38690L69815J77061m53084K92820l51785l23879L84195
11331C4081J83125j2395k39119N13434o52861N14841N00684n11024L7469o01825
11321b33590k22156L95722Q2363N22149k65984k11042Q41615r09461Q89127K48770
11311A137513m28110K6134n94875q70439P23662q12540O92538P17l20345K59951
$$ plain form
11380 1061978 736991 1124172 106578 635429 1050445 1074876 542559 808273 170629
11371 170629 268304 530766 652925 932795 727160 812652 304579 364540 813686 40926
11361 40926 872851 1047212 645839 559883 183519 91051 -205041 643757 788258 252112
11351 252112 733740 453029 -168486 62312 333627 135282 746175 687610 502870 675679
11341 675679 343858 577628 -61062 308753 485814 32730 325550 -26235 -350114 34081
11331 34081 217206 204811 -34308 479126 -173735 341106 841790 330766 368235 -233590
11321 -233590 -455746 -60024 22339 544488 278504 67462 909077 -384 888743 1137513
11311 1137513 709403 735537 140662 -729777 -6115 -818655 -126117 -125400 -445745 -185794
11301a85794n99554Q20758J43193M19434q44602q39027j53228J010648k86224
11292e14396r91429Q9094j0422N94179O22773k27557P40578j50975O2695k69871
11282e5331l23814j53597M47714O280K56680J00124l31163J65336J59970N78373
11272H50572N70418q66765n47504p9036j79058N73623L56811o29316l63554k80047
11262e93856j39331L96300M88877J41418L59170j217513j15715k80250K24557
11253g36343J764721o49213l77385m34501k83986L44362J251216k99039o45626
11244f5794K61250j101038O38496K23647M12979O81471n67541l67985L57951o60968
11234a87532M31225L68750n84182P81024j082112m47167L03074k3553K90469m5002
$$ plain form
11301 -185794 -785348 35410 178603 598037 -246565 -1085592 -1238820 -228172 -514396
11292 -514396 -1505825 -1416731 -1427153 -832974 -210201 -437758 302820 151845 214540 -55331
11282 -55331 -379145 -532742 -85028 -78748 177932 278056 -53107 112229 272199 850572
11272 850572 1420990 554225 6721 -72315 -251373 322250 679061 49745 -313809 -593856
11262 -593856 -733187 -336887 151990 293408 652578 -564935 -680650 -960900 -736343
11253 -736343 1028378 379165 1780 -432721 -716707 -372345 878871 579832 -65794
11244 -65794 195456 -905582 -267086 -43439 369540 1051011 483470 115485 473436 -187532
11234 -187532 243693 612443 28261 809285 -272827 -719994 -416920 -440473 -150004 -195006
11224a95006L13287J68164m64193O97025n88623O42805p32074j49681n05222l3822
11214h47340R84887k39082j28690r8775M7190J95455M99185k01116k84593Q9475
11204A6596m95070l21151J00538p14500Q28283O52286k44295L19688K68241O07535
11194A018151J40277j61441j411427N37771l97438O60211q36665n39238J72262
11185h17537J387J235401q00578L03029o18011Q04069J88154m26263n58152p10756
11175a399257Q13319K23410N829m07617j4492Q35398j02125N71094r97873J27447
11165c44867M77846k21080K45009l92945m43762P20072K76421j25811J30794p13751
11155c92074O31204J59290l67598n5974l22826p94J49312J65602o14161p0083
$$ plain form
11224 -195006 118281 286445 -177748 519277 -69346 573459 -158615 -308296 -813518 -847340
11214 -847340 137547 -101535 -230225 -329000 -281810 -86355 412830 211714 -72879 16596
11204 16596 -478474 -799625 -699087 -1413587 -585304 66982 -177313 142375 410616 1018151
11194 1018151 1158428 996987 -414440 123331 -274107 386104 -450561 -989799 -817537
11185 -817537 -816150 419251 -381327 -78298 -696309 107760 295914 -130349 -688501 -1399257
11175 -1399257 -585938 -362528 -356699 -764316 -778808 56590 -45535 525559 -472314 -344867
11165 -344867 132979 -88101 156908 -236037 -679799 40273 316694 190883 321677 -392074
11155 -392074 239130 398420 30822 -25152 -347978 -348772 -199460 -33858 -648019 -718102
11145g18102k38455P11379j89828J69693K37957r55512K93381K48715p4671j28911
11135f44354j60616K25766M05792L20892M6773o85385N04353K28748J61345K59508
11125F62822j277080K15853M1436L9122K36529r54825R21987L542L45215P3316
11115C07917o55362m156J73391k37863K19445L521o27472j31882J69169P31477
11105e1815N27805l01896j39092n55230j4209J19292M74688k14145k95696J66868
11095b83430J43371q2555j252089J244578J002759n45542Q50073j294898o37172
11086h54905J624733p21750M39550n51370r231M3032l5430l96340M7556L14800
11076i9355r4618R98819j898763M66687L24015l67886J202557r10511q14845J69470
$$ plain form
11145 -718102 -956557 -245178 -435006 -265313 -27356 -982868 -689487 -440772 -515443 -644354
11135 -644354 -804970 -579204 -173412 147480 194253 -491132 13221 241969 403314 662822
11125 662822 -614258 -398405 -356969 -317847 -81318 -1036143 -114156 -110614 234601 307917
11115 307917 -347445 -351601 -178210 -416073 -196628 -193107 -820579 -952461 -783292 -51815
11105 -51815 475990 174094 35002 -520228 -534437 -415145 59543 -154602 -450298 -283430
11095 -283430 -140059 -222614 -1474703 -230125 772634 227092 1077165 -217733 -854905
11086 -854905 769828 48078 487628 -63742 -72973 -29941 -65371 -461711 -414155 -99355
11076 -99355 -193973 804846 -1093917 -627230 -303215 -671101 531456 -379055 -1193900 -1024430
11066a024430L87980K32112Q14935o95885n15457Q17054P3280J01146k66091N39712
11056D64356j51340l15535J30102p32290L7571N95044O46044p17280L40747l51942
11046e4523j0557K26477j1461o70307N05269R12539o69636O117K04336j383830
11036i45576Q47734l32090J0602o04060N97852K27807j061360J510345n95853
11027c44599R3651N04199k07915k18496J49332J41161o70416J46424N70243k21370
11017e7786k1478j86413K98938p43192J644583q31428M1581J30800j559179O56485
11007f27089O72817l16416M34751n52320n88413j41500M06862N62770L08343R462
10997A69267O06706p25729l85497P30241p13949P11655k82791l02184J99928o55833
$$ plain form
11066 -1024430 -636450 -404338 410597 -285288 -800745 16309 89589 190735 -75356 464356
11056 464356 313016 -2519 127583 -604707 -567136 27908 673952 -43328 297419 -54523
11046 -54523 -65080 161397 149936 -520371 -15102 897437 227801 233918 438254 -945576
11036 -945576 -97842 -429932 -419330 -1023390 -425538 -197731 -1259091 251254 -344599
11027 -344599 -250948 253251 45336 -173160 -23828 117333 -553083 -406659 163584 -57786
11017 -57786 -79264 -265677 33261 -709931 934652 103224 144805 275605 -1283574 -627089
11007 -627089 45728 -270688 164063 -388257 -976670 -1118170 -711308 -148538 159805 169267
10997 169267 775973 50244 -335253 394988 -318961 392694 109903 -192281 7647 -648186
10987f48186J299996l84844K79716l77991K17643n93919n57276M90933j09485
10978c83413O74511p18617Q3619m77004m56990J394451l49752O78230o09526q8618
10968b53109l59729k84704J57473K46421Q63250r21593K55691n74818O43103k29422
10958d57437J60667K27243o3252L42875l35961j95146o87783P19276M77295q07480
10948f19703J432867q86048P26376K86548n92189k57725M29632k2883j28254j177897
10938h09276j1529O51970L34613L67968J28666j111965L68003K11969k38354k69508
10928c77443J15202K50907K27134p8521j093538K47205K60199q3382N28529m66194
10918d69902N18472J70297l0618P72624j784739J068934k13510n60454J44450
$$ plain form
10987 -648186 651810 266966 546682 168691 386334 -207585 -764861 -273928 -383413
10978 -383413 291098 -427519 -343900 -820904 -1277894 116557 -233195 445035 -164491 -253109
10968 -253109 -612838 -897542 -740069 -493648 369602 -551991 -296300 -871118 -228015 -457437
10958 -457437 -296770 -69527 -132779 210096 -125865 -321011 -1008794 -289518 187777 -619703
10948 -619703 813164 -72884 653492 940040 347851 90126 519758 496875 368621 -809276
10938 -809276 -820805 -168835 165778 533746 662412 -449553 -81550 130419 -107935 -377443
10928 -377443 -262241 -11334 215800 137279 -956259 -709054 -448855 -532237 -3708 -469902
10918 -469902 48570 218867 188249 960873 -823866 245068 31558 -528896 -384446
10909c84446J14594J87852l7860K4360l50177j254941J437346P12440p55359Q23128
10899E16937q46116j95702M61434q82534M20375l47461P53471K87192l60214R6987
10889i5631m30917J99112N14336j52170l99309J63476Q8821k2528J045376n45338
10879C65228o63873L45586k51764M08162O73354n94774J85621p97155j95671P49349
10869B24063p20135P28359M95519p88413K22335K58794q47371N22723m55294Q20097
10859D60677p72640k26824J8255m55403J053444K70053k86015p86799Q27194N1692
10849A53634k45183L26764j071563R73338J44035j137409J81489M5637Q33761
10840B04503J62492K41891j086938J59366O34145n03460k1319J06766N56076o68933
$$ plain form
10909 -384446 -269852 -82000 -119860 -95500 -445677 -1700618 -263272 449168 -306191 516937
10899 516937 -329179 -524881 -63447 -945981 -525606 -873067 -119596 167596 -192618 -95631
10889 -95631 -526548 -327436 186900 34730 -364579 -201103 -112282 -134810 910566 365228
10879 365228 -298645 46941 -204823 203339 876693 281919 467540 -329615 -525286 224063
10869 224063 -496072 232287 727806 -60607 161728 420522 -426849 95874 -359420 460677
10859 460677 -311963 -538787 -520532 -975935 77509 347562 61547 -725252 101942 153634
10849 153634 -91549 235215 -836348 136990 281025 -856384 -674895 -629258 204503
10840 204503 366995 608886 -478052 -318686 315459 -188001 -209320 -102554 453522 -215411
10830b15411m35888o5237j43707P42269L17896j027617r0809J164068M67703j65529
10820E47738n14946l66324P47239m38482m1602m21775k82638Q95814J51910K6940
10810C03874k80229k26323L00456j47889l03621P12646m43947j59466n769j094045
10800a344313J171258n53510O18429k92447R85Q7761m14231Q49234n57821M91591
10790E6936J20627K11760K95582m44813K93644m93954n93659K07228K71854M84634
10780D09839j96219q49902L9695J040268M3802l83667p05009l44036R84375j98382
10770a59236j22874K46058n44453M71665m40669l07235r7310J204817n513J03949
10760C49199L267m85469K72130J26386n42445j17967L46495j05261p5357r6887
$$ plain form
10830 -215411 -651299 -716536 -860243 -117974 199922 -827695 -918504 245564 713267 547738
10820 547738 32792 -333532 413707 -24775 -66377 -488152 -770790 125024 276934 303874
10810 303874 23645 -202678 97778 -50111 -353732 358914 -85033 -244499 -250268 -1344313
10800 -1344313 -173055 -726565 -108136 -400583 -399598 -311837 -726068 123166 -434655 56936
10790 56936 177563 389323 684905 240092 533736 39782 -553877 -346649 -74795 409839
10780 409839 213620 -636282 -596587 443681 487483 103816 -601193 -945229 39146 -159236
10770 -159236 -282110 -36052 -580505 -108840 -549509 -856744 -954054 250763 245250 349199
10760 349199 352466 -133003 139127 265513 -276932 -394899 -48404 -153665 -229022 -325909
10750c25909k58833O06514k83372O75859k75945r5654O69192j024951N2628L17801
10740E7330m00997k46878J69204r06909N24450J211504p44588o67898M56417K24722
10730c23643R9022K08306J71234J41488k95856M18782j197472n7062L97246O25845
10720A87890k62767n1257Q90111k22546Q89903j052920l99165P07585q11843P17947
10710E92938q15700J13642K90038k85781r2014o2108L30615m34555K25869K22979
10700H5923Q39058n32381K3283j144449L32243K15608p94831L7337J66125M22707
10690c49377N85331k37550j71200O310O69314j52678l57266K24037K51031m38523
10680B9429k41748L04285o51154j85818R33951p02952L22217R21860p79274j58671
$$ plain form
10750 -325909 -584742 21772 -261600 414259 138314 42660 711852 -313099 -260471 57330
10740 57330 -343667 -590545 -421341 -1328250 -803800 407704 -336884 -1004782 -548365 -323643
10730 -323643 -224621 -16315 154919 296407 551 419333 -778139 -835201 -437955 187890
10720 187890 -74877 -126134 763977 541431 1431334 378414 -20751 686834 -125009 592938
10710 592938 -222762 -109120 180918 -104863 -196877 -258985 71630 -362925 -137056 85923
10700 85923 924981 392600 415883 -728566 -396323 -180715 -975546 -938209 -772084 -349377
10690 -349377 235954 -1596 -172796 -166486 502828 350150 -7116 216921 467952 29429
10680 29429 -212319 91966 -559188 -745006 188945 -514007 -191790 730070 -49204 -207875
10670b07875k29498J08291O03180n90640o51368L27703N16781K68662n46514p99172
10660a200450M54763O40377n7040K93654k11651k20470J817559j288463p03505
10651d75226L17831M7781J027630l60586J80120q97725N8991L56098n89758O51095
10641C16251r85731J229286m43820l14576L97232m92955P20394o63596O6680l7404
10631b08239N32376n75332Q5040n04836j15003N86131m17563L97001L60289k34056
10621i4192L36372j040456J58633O46720N3743m01666K70977m80918K58655N62103
10611B69971n56198O99945K41817K84494k80953l20308M60716j86603K72275j72257
10601G12899q03528K45615k7692o089n35048M20458k49849L60369M84062j039367
$$ plain form
10670 -207875 -437373 -329082 274098 -316542 -967910 -640207 -123426 145236 -401278 -1200450
10660 -1200450 -745687 -105310 -162350 131304 -80347 -300817 1516742 228279 -475226
10651 -475226 -157395 -109614 918016 557430 737550 -160175 -101184 254914 -334844 316251
10641 316251 -669480 559806 115986 -198590 198642 -294313 426081 -237515 -170835 -208239
10631 -208239 324137 -251195 -166155 -670991 -785994 -199863 -617426 -220425 139864 -94192
10621 -94192 242180 -798276 -639643 7077 60820 -340846 -69869 -550787 -292132 269971
10611 269971 -286227 413718 655535 940029 659076 338768 799484 612881 885156 712899
10601 712899 -90629 154986 127294 121205 -413843 6615 -243234 117135 601197 -438170
10591d38170N65054r54207J43885l05666N43366L94451o72700L37852N8011N44434
10581B16310N83389k17791l93768J12073L58981q70777O6898m2921M32885K66282
10571E11561p26658J79849J40709N66531m55576J82601R884J45052N58608j260370
10561a47809l28975L22324M6834M45173j287072J54059M13784O59546K77967n58431
10551b600m85687O30767N5307p08009Q58108l88335M68935j38652j140558J43030
10541g07694l20171J296801Q9831L68903l37506l58271M09806j52768N80207k48886
10531F20252j13316k53015p96640N54895K60345q98559Q48250r0646R0776l08076
10521h5734o39355K22795P11948M45715j76728p42499m55040M58785l09796n92252
$$ plain form
10591 -438170 126884 -827323 -683438 -989104 -445738 -51287 -723987 -386135 -328124 216310
10581 216310 799699 581908 188140 300213 659194 -211583 -144685 -187606 245279 511561
10571 511561 -215097 -35248 105461 671992 216416 399017 408901 553953 1112561 -147809
10561 -147809 -476784 -154460 -107626 337547 -949525 -795466 -381682 277864 555831 -2600
10551 -2600 -488287 142480 197787 -510222 347886 -40449 428486 289834 -850724 -707694
10541 -707694 -1027865 268936 358767 727670 390164 31893 441699 288931 869138 620252
10531 620252 506936 253921 -542719 12176 272521 -626038 222212 131566 222342 -85734
10521 -85734 -725089 -502294 209654 655369 478641 -263858 -718898 -260113 -569909 -1162161
10511a162161L97449r5553L77962L46197l59400L61977L32612n0870j9730n72109
10501d43626j05152J025917m76715R52997j537222L50800M92432j65110O19106
10492G13427j50381Q98769j158968J055991o64312L5352l92889k36552K34356
10483C34793j03539P80998l19263l09481n89518o14453P86881k904Q23501p40905
10473D6110l2068O4976l24831N56191l65703J110794n94003j47009j6886o05796
10463c08225j15617M79054L401J40107L18169m10645q2215M97295k65654L66153
10453F21823j69039k84944p33203j99535O13089l4531N05581J08078k89581k28954
10443i1216r8070M65777r36959J342707j2198k47997k37514o70727j25673K62319
$$ plain form
10511 -1162161 -764712 -860265 -482303 -136106 -495506 -133529 199083 148213 128483 -443626
10501 -443626 -548778 477139 424 953421 -583801 -233001 259431 94321 713427
10492 713427 563046 1461815 302847 1358838 694526 729878 336989 100437 334793
10483 334793 231254 1012252 692989 383508 -206010 -820463 -33582 -36486 787015 46110
10473 46110 14042 79018 -245813 310378 -55325 1055469 461466 314457 297571 -308225
10463 -308225 -423842 55212 58613 198720 516889 106244 24029 521324 255670 621823
10453 621823 452784 167840 -565363 -764898 -151809 -186340 319241 427319 137738 -91216
10443 -91216 -189286 276491 -660468 682239 670041 422044 184530 -486197 -611870 -349551
10433c49551P5941L24361o2394K14376L45920m24008M48497n38318K67581r6321
10423B06084K69057L72569j175467J007260o91230P63977j4693p84344N06712
10414D59925n06142R28367L72N14136j003602k01078l70119j36755O75279p24413
10404c64030O14088m0622n67256K95844j6994l46809P26205K58463p79922P52427
10394E31394j229131L68009L79420K3526P0625n401N19759l86920o10984J172338
10384H32635N13362L33758K45481p58787j136116R59530L34294p15736O66065
10375A274486m00577p63272J228088j056377l24728Q70243M59007k70257p47749
10366B68864N07759l87389J11263P53427j003204n6487R87765m87651q54398M60206
$$ plain form
10433 -349551 -273610 50751 -11643 202733 548653 124645 573142 34824 302405 206084
10423 206084 475141 847710 -327757 679503 -11727 752250 737557 -46787 459925
10414 459925 -46217 882150 882522 1396658 393056 191978 -178141 -314896 360383 -364030
10404 -364030 250058 209436 -357820 -61976 -78970 -425779 300426 558889 -221033 531394
10394 531394 -697737 -329728 49692 73218 143843 138442 658201 271281 -339703 832635
10384 832635 1345997 1679755 1925236 1166449 30333 989863 1324157 608421 1274486
10375 1274486 873909 110637 1338725 282348 -42380 827863 1286870 1016613 268864
10366 268864 776623 389234 500497 1253924 250720 194233 1181998 694347 -160051 300155
10356C00155J14684l32100M57902K77457r03805M6640O24407m01411Q00155p24901
10346B59183m09440k64291J399150m7840o11368k68889p57815L21800R25171n76230
10336c0569Q05543J13594R6885n33664q29630M86982N98338p823K24437p40368
10326A83725q84259J531309o70716L5014M19996l58972L65462l07556o31878J06944
10316b10931j244M82888l10417k54946k74101O30544k7225k75168J203152l57810
10306F04742N2151l15373k85313R35004J00878m39065L52906q15872j23141M83703
10296E50620j21108P8539J46248J50755n90260L79922o38539j32182Q63075j086659
10286c99589N15619n65469m15524J560070o83218M71621l0266l62583O99658n12259
$$ plain form
10356 300155 414839 82739 540641 818098 -85707 -39067 585340 183929 984084 259183
10346 259183 -150257 -414548 984602 936762 325394 56505 -701310 -379510 545661 -30569
10336 -30569 774974 888568 985453 451789 -377841 109141 707479 699656 924093 183725
10326 183725 -700534 830775 160059 195073 615069 256097 621559 314003 -317875 -210931
10316 -210931 -212175 270713 -39704 -294650 -568751 61793 34568 -240600 962552 604742
10306 604742 656893 341520 56207 991211 1092089 653024 1005930 190058 66917 550620
10296 550620 429512 508051 654299 805054 214794 594716 -43823 -176005 687070 -399589
10286 -399589 116030 -449439 -864963 695107 11889 483510 453244 90661 790319 278060
10276B78060L3557P59929p69839l17049M61812n69699m13960N27992k8099M47756
10266D10460M54775L92699m68889n28064L23992O9540o28391J007692j3030l15757
10256G05027K80283n65750J03755K78415M57708j7553J52051r27768J47997m97431
10246A16734N11094n19387j6446n84460O7456N67261R8027J96334J67022J027399
10236A631034l59440n77051j15584o07836M28679Q07110l30188M0892l22104L19079
10226I14591P0400n0113k30600O10368n21621M599J81541n0193P8314l45616j72538
10215D89132j21001p995Q72219J6474q76764J101157n48334o18391K88113M88969
10205A083579m09298L92027k66893n48909M80136L67236p5086p7507j38174q8684
$$ plain form
10276 278060 311617 1071546 301707 -15342 446470 -123229 -537189 -9197 -37296 410460
10266 410460 865235 1257934 789045 260981 584973 654513 26122 1033814 1020784 705027
10256 705027 985310 419560 523315 801730 1259438 1241885 1393936 466168 614165 116734
10246 116734 627828 108441 91995 -492465 -425009 142252 240279 436613 603635 1631034
10236 1631034 1271594 694543 578959 -28877 399802 1206912 876724 917616 595512 914591
10226 914591 984991 934878 704278 1314646 793025 797624 979165 928972 1007286 661670 489132
10215 489132 368131 360136 1232355 1248829 372065 1473222 924888 306497 594610 1083579
10205 1083579 674281 1066308 799415 250506 730642 1097878 1022792 945285 807111 718427
10195G18427L96772m09479O26170k80355J01260L04231p26882O08868M62906m74320
10185A327598N59933o79129m03047q5422q2422k23386o46127L91169l59175P8972
10175a21036Q23041l16781M22524l52520M02158J42303o90656Q9880J79157N61080
10165A139150k24439m58631n14304Q5078J065136M76945Q35974l90318k32236
10156A782355K361k33750J19201m7692l53011l99050P72069j83063m96331j88244
10146G74845L18545M22272N3616o71150L35391k04748j16244N59367j281826k169
10136A87899L26491O72611J67740J31450l13848l29031M95891j93204L87437K28592
10126A762028n37751K91061k51033L817O58643j101551Q55559N91185k54834k19843
$$ plain form
10195 718427 1115199 705720 1331890 1051535 1152795 1457026 730144 1339012 1801918 1327598
10185 1327598 1887531 1208402 805355 719933 637511 414125 -232002 159167 -200008 -121036
10175 -121036 702005 385224 807748 455228 857386 999689 309033 398913 578070 1139150
10165 1139150 914711 456080 -58224 26854 1091990 1568935 2404909 2014591 1782355
10156 1782355 1784716 1550966 1670167 1622475 1269464 870414 1642483 1459420 963089 774845
10146 774845 1093390 1515662 1569278 898128 1233519 1028771 912527 1471894 190068 187899
10136 187899 514390 1187001 1354741 1486191 1172343 843312 1339203 1145999 1533436 1762028
10126 1762028 1224277 1515338 1264305 1268122 1926765 825214 1680773 2271958 2017124 1797281
10116A797281r21667n04002J084767J09564K41447m20325l83923J93504Q47140
10107B043786l16854L05555m45853L06889Q28187p05559J14418p3522l06089M86721
10097B237679M89337o97148N71936J12445K51571K70714k29317n4757o8551N5439
10087B939348j8616J80830K71004n57802O75426M64607k09850k18929k36721M62405
10077C751702J00322K61834j69125p99924M32755J38545L14037p4370l83756l09143
10067C262877K60093O97822m40719l31274r44336Q711P24728n9169j30806m9575
10057B998352Q53073J38547P63318r86793r22331M03016J86745L85261l2663m85212
10047C301313J97749J29683n9531k72084j26803P31881Q44546m74393k99750m23868
$$ plain form
10116 1797281 875614 371612 1456379 1565943 1807390 1387065 1003142 1196646 2043786
10107 2043786 1726932 2032487 1586634 1893523 2721710 2016151 2130569 2057047 1750958 2237679
10097 2237679 2727016 2029868 2601804 2714249 2965820 3236534 3007217 2952460 2883909 2939348
10087 2939348 2920732 3101562 3372566 2814764 3490190 3954797 3744947 3526018 3289297 3751702
10077 3751702 3852024 4113858 3944733 3144809 3577564 3716109 4030146 3955776 3572020 3262877
10067 3262877 3522970 4220792 3780073 3448799 2504463 2513174 3237902 3178733 3047927 2998352
10057 2998352 3851425 3989972 4753290 3766497 2844166 3247182 3433927 3819188 3786525 3301313
10047 3301313 3499062 3628745 3569214 3297130 3170327 3902208 4746754 4272361 3972611 3548743
10037C548743j92142L87399J77910O99326p08818l04146j92985J60492K92813
10028C868592J06244n24658n29616P67216k66733Q969l55203m69502R14181L5326
10018C554816j84797o17220j27897P23599Q1322j94542o2238n25497K40792N36912
10008C425250j42524O3913J10796o83180K34524j86560R60272m49350M5158j57361
9998C220938l89751k3942K05758P33928l36212Q08737R6320m26568m70724l84311
9988C034173J456019K40420l11837j45137p47656M57062L69252j26817j12630
9979D112849O30610M10437P13092r15892m64791p2363k27275J046611o14769n48698
9969D069811P49183o09837J380393J30066p57132n2604L93098L75691O75961q20496
$$ plain form
10037 3548743 3356601 3744000 3921910 4621236 3912418 3608272 3415287 3575779 3868592
10028 3868592 3974836 3450178 2920562 3687778 3421045 3430014 3074811 2605309 3519490 3554816
10018 3554816 3370019 2752799 2624902 3348501 3429823 3235281 3173043 2647546 2888338 3425250
10008 3425250 3282726 3346639 3457435 2774255 3008779 2822219 3782491 3333141 3378299 3220938
9998 3220938 2831187 2807245 3013003 3746931 3410719 4219456 4315776 3889208 3418484 3034173
9988 3034173 4490192 4730612 4418775 4273638 3525982 3983044 4352296 4225479 4112849
9979 4112849 4743459 5153896 5866988 4951096 4486305 4413942 4186667 5233278 4618509 4069811
9969 4069811 4818994 4209157 5589550 5719616 4962484 4909880 5302978 5678669 6354630 5534134
9959E534134M12183L27807k15779P14918j417488P63539R79711L09258N37230
9950G945513r09495l1634K50918P81998j86866p28196N36945K61996J298761l94753
9940H825187N74509j046858L25577J357873k47266j77638K61747J01838l2851
9931I942118R39640m29719K22003K43846l337R41897K08917J98027K73781m95360
9921A2041813L31394O93758M06587K28084O10434L97685J736595O06736j20851
9912A6932235Q38936p006K244859R00091P12396J207850J747956K295279K376933
9903B9249529K395492L530182M591706N375535O477229P007082R833377J4242323
9895H2702455J7889335K3030651K5978051K3719021J3271218l117472j7171372
$$ plain form
9959 5534134 5946317 6274124 6058345 6773263 5355775 6119314 7099025 7408283 7945513
9950 7945513 7036018 7004384 7255302 8037300 7850434 7122238 7659183 7921179 9219940 8825187
9940 8825187 9399696 8352838 8678415 10036288 9789022 9611384 9873131 9974969 9942118
9931 9942118 10881758 10452039 10674042 10917888 10914551 11856448 12065365 12263392 12537173 12041813
9921 12041813 12373207 13066965 13473552 13701636 14312070 14709755 16446350 17053086 16932235
9912 16932235 17771171 17764165 20009024 20909115 21621511 22829361 24577317 26872596 29249529
9903 29249529 31645021 35175203 39766909 45142444 51619673 58626755 68460132 82702455
9895 82702455 100591790 123622441 149600492 173319513 186590731 183473259 166301887
9888A66301887k5113778k3904633k1162601j7206843j2616506q843625q244896
9881D9209005o470213m319856l769563k633739j635258k224235r87067p65448
9873B6403626l26218j291314j150036L24061j541207K19375J64885j610439K22433
9864B1415166J031994n70549P5865M77352p28523P01292P73583J98771J18607
9855B3493558q9955Q37621Q16105J423805J242244J156677J361351K520789K458474
9846C5220669K060247L681651K469584L425400M207830K033218K949400J779519
9838E7827518J808031J790198j056151o69802k544989k096613k437113k664242
9830D9956837l217027l213085k162705k630576j690687m75266n21599o19783j26825
$$ plain form
9888 166301887 141188109 117283476 96120875 78914032 66297526 57453901 49209005
9881 49209005 42738792 38418936 34649373 32015634 30380376 28156141 27169074 26403626
9873 26403626 26077408 24786094 23636058 23960119 22418912 22638287 22803172 21192733 21415166
9864 21415166 22447160 21876611 21952476 22429828 21701305 22402597 23176180 23374951 23493558
9855 23493558 23403603 24241224 25057329 26481134 27723378 28880055 30241406 32762195 35220669
9846 35220669 37280916 40962567 43432151 46857551 51065381 53098599 56047999 57827518
9838 57827518 59635549 61425747 60369596 59699794 57154805 55058192 52621079 49956837
9830 49956837 46739810 43526725 41364020 38733444 37042757 36567491 36045892 35426109 35299284
9821C5299284q06830j10597Q69224Q62558O5006J092084J336611J421558K019054
9812D2047952K360843K514588L654895L316975L612983K656194K826386K954454
9804F5945270J614724J191761k82492j404107q07372k200983k822547k647089
9796E8587165m138473k678878l408681k643045k423035k789170j363782q87184
9788C8254917j296307q94644p58341Q28411K94666Q2203n39572n58040P77245
9779C6190538O81789M35925r15891O78587L11808L63017P57158l52164P80411
9770C8931178J558109N96165P15076K69391O27355P44003K020803M70554J214182
9761D7146816J554924J814116K872249Q56178K958064J840977J751524L173788
$$ plain form
9821 35299284 34492454 34381857 35251081 36113639 36178645 37270729 38607340 40028898 42047952
9812 42047952 44408795 46923383 50578278 53895253 57508236 60164430 62990816 65945270
9804 65945270 67559994 68751755 68469263 67065156 66257784 64056801 61234254 58587165
9796 58587165 54448692 51769814 48361133 45718088 43295053 40505883 39142101 38254917
9788 38254917 36958610 36063966 35305625 36134036 36428702 36510905 35971333 35413293 36190538
9779 36190538 36872327 37308252 36392361 37070948 37382756 37745773 38502931 38150767 38931178
9770 38931178 40489287 41085452 41800528 42069919 42697274 43441277 45462080 45932634 47146816
9761 47146816 48701740 50515856 53388105 54244283 57202347 59043324 60794848 63968636
9753F3968636J466582K136909K614906L332694L679081M006734L205200N342802
9745H9753544N940400N706791R285368P792199J0064150J2981402J2861914J6912641
9737A71298409J7592284K0860261K2652679K2579909K2996917J8602002J6213535
9730C12795996J2142445P761819K402795j393081n728694q936841r200067q486693
9722C01357679p172477j995179L337879O633989J2934362J4030332J6036413J6480634
9714C61643632J4545369J0732989M952375K087559l428381p801880r747290j3669436
9706C59314937j3805440j1586340q067649m502364J087213P200773J0277533J4018534
9698C53937197J3423530J2505087R526246O515729P89198l845414p833158j0862394
$$ plain form
9753 63968636 65435218 67572127 70187033 73519727 77198808 81205542 84410742 89753544
9745 89753544 95693944 101400735 110686103 118478302 128542452 141523854 154385768 171298409
9737 171298409 188890693 209750954 232403633 254983542 277980459 296582461 312795996
9730 312795996 324938441 332700260 335103055 333709974 327981280 319044439 309844372 301357679
9722 301357679 294185202 292190023 295527902 302161891 315096253 329126585 345162998 361643632
9714 361643632 376189001 386921990 391874365 393961924 390533543 382731663 372984373 359314937
9706 359314937 345509497 333923157 325855508 321353144 322440357 329641130 339918663 353937197
9698 353937197 367360727 379865814 389392060 395907789 396696987 392851573 385018415 374156021
9690C74156021j3646622j5017788j3705036j1744129o088800j148784L909066
9683C16713928Q488434J1390434J3778055J2340365J0086538N633202j039344
9676C77391612n259998j2073154j7235434k1229789k5443920k7018547k7447725
9669B41683045k4744712k3121710k0269714j7142505j4705125j2459260r873013
9662A19367006r094736q054908o786779n862981n581214m754530l584334m113037
9654G1534487k957497l299864l016981k122504j618032k358767j424702k199944
9646E2536196j673273j724859k061574j209451j38350j635284n12980k065590
9638D1514835r69146K57981j781560n59626j310091n69767K46913q43209j186578
$$ plain form
9690 374156021 360509399 345491611 331786575 320042446 313953646 312804862 316713928
9683 316713928 325202362 336592796 350370851 362711216 372797754 378430956 377391612
9676 377391612 372131614 360058460 342823026 321593237 296149317 269130770 241683045
9669 241683045 216938333 193816623 173546909 156404404 141699279 129240019 119367006
9662 119367006 110272270 102217362 95430583 89567602 83986388 79231858 75647524 71534487
9654 71534487 68576990 65277126 62260145 60137641 58519609 56160842 54736140 52536196
9646 52536196 50862923 49138064 47076490 45867039 45728689 44093405 43580425 41514835
9638 41514835 40545689 40803670 39022110 38462484 37152393 36582626 36829539 35986330 34799752
9629C4799752r42552L52634Q02159q70214o49957j16687k564Q8760l7645j17358
9619C3306328n92849Q96270M49140J42606R47805J712346J354219J441694J796122
9610D1453681R52627L263185K808282K514341L258482J846122K537287J242027
9602E9876034J547250J261235j062245N74327j498820j601983j113617k599654
9594E5382527l579871k537448l346117j928970k308634j954468j346996j434393
9586C6945630m4434j374234J87078M54569l08324L46041R07249J200779J244584
9577C9558938J564479J585914K773028L701790K823329K247088K553500K298167
9569E9106233J749665J481130m88994j303361n74069j610220k148831l004059
$$ plain form
9629 34799752 33857200 34209834 35011993 34141779 33491822 33375135 33372571 33461331 33423686 33306328
9619 33306328 32713479 33609749 34058889 34201495 35149300 36861646 38215865 39657559 41453681
9610 41453681 42406308 45669493 48477775 50992116 54250598 56096720 58634007 59876034
9602 59876034 61423284 62684519 61622274 62196601 60697781 59095798 57982181 55382527
9594 55382527 51802656 49265208 45919091 43990121 41681487 39727019 38380023 36945630
9586 36945630 36901196 35526962 35714040 36168609 35860285 36206326 37113575 38314354 39558938
9577 39558938 41123417 42709331 45482359 49184149 52007478 54254566 56808066 59106233
9569 59106233 60855898 62337028 61848034 60544673 59970604 58360384 56211553 53207494
9561E3207494l626046l590485l468087l661840k747966l420824j941283j942915
9553B8808048j913959j127683k120621j453950m0286q72560m03403j024978j103936
9544A8746672l2476K7649L61755j015385j60968l29076J49562J138986j306667
9535A7580052J53244m78478k68696J097403j124417j61305o26463k38024J52036
9526A6085352m7473l41442L8590o92802L24705n46900J5474m21900J06207k33750
9516A4286061K81564n79940o40249N2437k38818n82664R81695L5579k99768r7797
9506A3198100l27304l20721R25914j25550m24062J86092m49812M66632K50683
9497A3379972N13270l62236N35605K36503p9456n81593Q1045Q28574L13343M80328
$$ plain form
9561 53207494 49581448 45990963 42522876 38861036 36113070 32692246 30750963 28808048
9553 28808048 26894089 25766406 23645785 22191835 22151549 21278989 20875586 19850608 18746672
9544 18746672 18714196 18741845 19103600 18088215 17927247 17598171 17747733 18886719 17580052
9535 17580052 17733296 17254818 16986122 18083525 16959108 16797803 16171340 15933316 16085352
9526 16085352 16037879 15696437 15735027 15042225 15366930 14820030 14835504 14413604 14519811 14286061
9516 14286061 14567625 13987685 13347436 13399873 13161055 12578391 13560086 13595665 13295897 13198100
9506 13198100 12870796 12550075 13475989 13350439 12926377 13112469 12662657 13129289 13379972
9497 13379972 13893242 13531006 14066611 14303114 14223658 13642065 13723110 14551684 14865027 15345355
9487A5345355m26508j048958K70373P35522l21526M69378M07347K46708J80181
9478A5857872p74627j75434J14143J023685r2715K30794q50402Q29557J59861
9469A6322734J62439n2100K10347K71799l21242P82709o50989P92551P37279K19711
9459A8475238K77724j123079O95867M65267Q71119P15163l06882K98410P0194
9450B0439021J009880J18503L48234L27622N53697O79503o56512N12607M78060
9441B3810615Q55185R13747L08550k26838Q71786P12668R41394O54945R42980
9432B9785032M66560J034689N62098N50073O80610J469714K071936Q41169J715822
9423C9177703J046572K178813J935936K790712J224975K348198L169818K612111
$$ plain form
9487 15345355 14918847 13869889 14140262 14875784 14554258 15023636 15430983 15677691 15857872
9478 15857872 15083245 14907811 15021954 16045639 15952924 16183718 15333316 16162873 16322734
9469 16322734 16485173 16433073 16643420 16915219 16593977 17376686 16725697 17518248 18255527 18475238
9459 18475238 18752962 17629883 18325750 18791017 19662136 20377299 20070417 20368827 20439021
9450 20439021 21448901 21567404 21915638 22243260 22796957 23476460 22819948 23332555 23810615
9441 23810615 24665800 25579547 25888097 25661259 26533045 27245713 28187107 28842052 29785032
9432 29785032 30251592 31286281 31848379 32398452 33079062 34548776 36620712 37461881 39177703
9423 39177703 40224275 42403088 44339024 47129736 48354711 50702909 53872727 56484838
9415E6484838L721320M307838L273803N252854N976415N801130O879311Q914889
9407A00612398R715312J2228220J2758369J3951650J5895596J6238367J7322626
9400A98722538J5266262J2762578R095078M715514k97662m770517r788837j2054010
9392B13650944j4076009j5448159j4710551j3676495j1539220q580857q689500
9385A26930153o078001n387989m579586k526124r21348m46920P93157J430998
9377A09214340J166655J844809M219684N353105P157041Q291379R403271R598168
9369A56248452J2898722J4966230J7471502J9450876K0384428K0279384J7536476
9362B79236070J7133035J0809439N944552k98576p470156j2184263j7282812j9863927
$$ plain form
9415 56484838 60206158 64513996 67787799 73040653 79017068 84818198 91697509 100612398
9407 100612398 110327710 122555930 135314299 149265949 165161545 181399912 198722538
9400 198722538 213988800 226751378 235846456 240561970 240264308 235493791 225704954 213650944
9392 213650944 199574935 184126776 169416225 155739730 144200510 135619653 126930153
9385 126930153 120852152 115464163 110884577 108358453 107437105 106990185 107783342 109214340
9377 109214340 110380995 112225804 116445488 121798593 128955634 137247013 146650284 156248452
9369 156248452 169147174 184113404 201584906 221035782 241420210 261699594 279236070
9362 279236070 296369105 307178544 313123096 312824520 305354364 293170101 275887289 256023362
9354B56023362k1555038k1232593j9370034j7977339j5737818j3900143j1171142
9347A35079255r825762o890983o094821n680738m274248m178987k938504j232920
9339I3962292r10758m16464l20450N27477J205404J819104J059249L561694L735768
9330A04223316N198687N504867M857308O826485R485491J0942626J1915955J3274990
9322A72229725J5100344J4475263J5675533J2851590J0339201O927788K644512
9315B50243956k790406q513586j0278507j3738939j4884203j4410495j4184969
9308A71442851j3171215j0486243r865347q927934n694860l523395l765767k415126
9300A13592964k472904j238517R69217K283844J907714K803529L623937N468806
$$ plain form
9354 256023362 234468324 213235731 193865697 175888358 160150540 146250397 135079255
9347 135079255 125253493 118362510 112267689 106586951 102312703 98133716 95195212 93962292
9339 93962292 93051534 92635070 92314620 92842097 94047501 95866605 96925854 100487548 104223316
9330 104223316 109422003 114926870 119784178 126610663 136096154 147038780 158954735 172229725
9322 172229725 187330069 201805332 217480865 230332455 240671656 247599444 250243956
9315 250243956 247453550 238939964 228661457 214922518 200038315 185627820 171442851
9308 171442851 158271636 147785393 137920046 128992112 123297252 119773857 116008090 113592964
9300 113592964 111120060 109881543 110850760 113134604 115042318 117845847 121469784 126938590
9292A26938590O545837P659277R654055J1582457J4124636J5793629J7642216
9285B09940697J9279777K0699486K0579844J8251917J4452853R201676L511757
9278C15918007m064628j0105680j5751275j9703239k0599324k3175078k2083673
9271B00435110j9800400j7965869j5321454j4475761j2331561j0879839q274388
9264A01385838o943354o341688o094627m994256m411173l069099l621033k811372
9256F3099236k384651k003576j338591k200844k071091j498122j181550n1197
9248E0369614k030059j449001j074926j203453N4812j270593j191499o47854n39033
9239D1018008j177484P639l39248j075864j74765j144915q0799m49333q60434
$$ plain form
9292 126938590 133484427 141143704 150797759 162380216 176504852 192298481 209940697
9285 209940697 229220474 249919960 270499804 288751721 303204574 312406250 315918007
9278 315918007 311853379 301747699 285996424 266293185 245693861 222518783 200435110
9271 200435110 180634710 162668841 147347387 132871626 120540065 109660226 101385838
9264 101385838 94442484 88100796 82006169 77011913 72600740 69531641 65910608 63099236
9256 63099236 60714585 58711009 57372418 55171574 53100483 51602361 50420811 50369614
9248 50369614 48339555 46890554 45815628 44612175 44666987 43396394 42204895 41557041 41018008
9239 41018008 39840524 39848163 39508915 38433051 38258286 37113371 37032572 36583239 35722805
9230C5722805J055008p52689P22287l47833j097047j49069N55441L94941N76027
9221C6679871K49106k64076L59137J130726j93630K96881Q36508J575379Q28368
9212D1498270M17125P59408Q54695J501685K556913K052850N64860K338895M74789
9203E3019490R62349J258326j294766j00266j297142j516631j247999k107048
9195D7676313p28261j398125L53175p97071o90711j09993K80872J375651P11472
9186D6673322M3043J35153J20025J613685J107916J464284J442809J072053K277258
9177E5949548J473899K349362K179471L579250L809765L326510L411606L649426
9169G9728837L996004M479504M418335L055108K539039K500144K487827J964782
$$ plain form
9230 35722805 36777813 36025124 36747411 36399578 35302531 35153462 35708903 36103844 36679871
9221 36679871 36928977 36664901 37024038 38154764 37961134 38258015 39094523 40669902 41498270
9212 41498270 41915395 42674803 43529498 45031183 47588096 49640946 50205806 52544701 53019490
9203 53019490 53981839 55240165 53945399 53845133 52547991 51031360 49783361 47676313
9195 47676313 46948052 45549927 45903102 45106031 44415320 44305327 44586199 45961850 46673322
9186 46673322 46716365 46851518 46971543 48585228 49693144 51157428 52600237 53672290 55949548
9177 55949548 57423447 59772809 61952280 65531530 69341295 72667805 76079411 79728837
9169 79728837 83724841 88204345 92622680 95677788 98216827 100716971 103204798 105169580
9161A05169580K576700K964662K956918M683376N432454P010669R119824J0641805
9153A50555988Q368886P456522O620005N158309M449870J569352j372200k877259
9145A79929473m813618n859342o839083p018054n578543l807586l273001j368029
9137A41372217r20084O22516L195246L020423M823283N516601P218168R265959
9129A74114329J2894165J3485060J6409177J8984709K0587162K4667509K4406008
9122C05548119K5631065K4222910K1530456J9542110J3255581Q866161M443373
9115D23039775j148049o264105j1503775j6229864j9000555j8539178k1049994
9108C29304255k0732025j9654757j8488718j4467011j2744100j0370604p574504
$$ plain form
9161 105169580 107746280 110710942 113667860 118351236 123783690 130794359 139914183 150555988
9153 150555988 158924874 166381396 173001401 178159710 182609580 184178932 182806732 179929473
9145 179929473 175115855 169256513 162417430 155399376 149820833 146013247 142740246 141372217
9137 141372217 140452133 141074649 144269895 147290318 152113601 157630202 164848370 174114329
9129 174114329 187008494 200493554 216902731 235887440 256474602 281142111 305548119
9122 305548119 331179184 355402094 376932550 396474660 409730241 418596402 423039775
9115 423039775 421891726 415627621 404123846 387893982 368893427 350354249 329304255
9108 329304255 308572230 288917473 270428755 255961744 243217644 232847040 225272536
9101B25272536m832729j631783K9047J727609N710077P992066J0375272J2922028
9093B57564123J5811112J7643573J9516277J9612148J8883975J7089280J6669028
9086C82789516J4084054J1675100P733438K969963j740822p197614j1085808j5321445
9078C83906382j7058111j9741092k2201793k4142265k2944882k1677094j9019808
9071B37121337j5727534j5243567j2197369r095676p202984n565161l760415j845396
9063A66483235p72771J172773O63906J517448L001739N813809N230684O753015
9055A89863838P441388O834162O893813N458562L531646J05781j547331l661114
9047B14920745o908205q020300j0144236j2229804j2555357j2298064j1050804
$$ plain form
9101 225272536 220439807 218808024 218837071 220564680 226274757 234266823 244642095 257564123
9093 257564123 273375235 291018808 310535085 330147233 349031208 366120488 382789516
9086 382789516 396873570 408548670 416282108 419252071 417511249 410313635 399227827 383906382
9078 383906382 366848271 347107179 324905386 300763121 277818239 256141145 237121337
9071 237121337 221393803 206150236 193952867 184857191 177654207 172089046 168328631 166483235
9063 166483235 165710464 166883237 167547143 169064591 172066330 177880139 183110823 189863838
9055 189863838 197305226 204139388 211033201 216491763 220023409 220129190 218581859 214920745
9047 214920745 208012540 199992240 189848004 177618200 165062843 152764779 141713975
9040A41713975j0096397q633826o991334n745950m092633m283571k983307j472714
9032I7414243j250116o72508j207907j334001j371513p92349j573590k712814
9024H6499445k276468k328711k790753l105736k490555k874350j926699k452267
9016F6253906k976996k521983j417124q21975j291106r89751j502842l15769j350491
9007E3065869j008973k10881P8269J96687O49260L32379N00686R3854O91449J053888
8997E5442487J770788P83734J247856k59153J030918J761185N57147Q29465r5844
8988F3068583L72229J197182J032102N87837J228570J477979J819806J959864
8980G2744152K040948K027705M255613L710677L308341K491703J974919J866889
$$ plain form
9040 141713975 131617578 122983752 115992418 110246468 106153835 101870264 98886957 97414243
9032 97414243 96164127 95491619 94283712 92949711 91578198 90785849 89212259 86499445
9024 86499445 84222977 81894266 79103513 75997777 73507222 70632872 68706173 66253906
9016 66253906 63276910 60754927 59337803 58515828 57224722 56234971 54732129 54416360 53065869
9007 53065869 52056896 51846015 51924284 52120971 52770231 53102610 53603296 53697150 54388599 55442487
8997 55442487 57213275 57997009 59244865 58985712 60016630 61777815 62334962 63164427 63068583
8988 63068583 63440812 64637994 65670096 66257933 67486503 68964482 70784288 72744152
8980 72744152 74785100 76812805 81068418 84779095 88087436 90579139 92554058 94420947
8972I4420947Q88900O85889j494651r13875j886399k951633l909888k460912j231167
8963H1147211q42163j825648j417126j698672O20821N01644O46281J139201J397965
8954G9669514J748346K233246J732036O67393J465641Q18798M92152p8143o52511
8945H8096472K23211J075544O15148J236311K96056J237823J914988L337227J510500
8936I9543280J659466K54830N21274J187920M31524O26727J13980J53520J860294
8927A06352815J054158K719876K965575M336368M902025N934174N703068O108075
8919A40076134O581712P786396P340594P729892P391595R396325J0397754J2264838
8911B08965240J3232307J1526367J2854000J0775336P956495M894487R07540l139625
$$ plain form
8972 94420947 95309847 95995736 94501085 93587210 91700811 88749178 84839290 82378378 81147211
8963 81147211 80305048 78479400 77062274 75363602 75984423 76486067 77132348 78271549 79669514
8954 79669514 81417860 83651106 85383142 86050535 87516176 88334974 88827126 88748983 88096472
8945 88096472 88319683 89395227 90010375 91246686 91542742 92780565 94695553 98032780 99543280
8936 99543280 101202746 101457576 101978850 103166770 103598294 104225021 104339001 104492521 106352815
8927 106352815 107406973 110126849 113092424 117428792 122330817 128264991 133968059 140076134
8919 140076134 146657846 154444242 161784836 169514728 176906323 186302648 196700402 208965240
8911 208965240 222197547 233723914 246577914 257353250 265309745 270204232 271111772 267972147
8903B67972147n024880q590358p732153o927254m731059j832742J025195M379654
8895B38538550P754789J0591747J2285741J2109846J3605095J1946586Q099861
8888C14932215N744710J868363r2220j695730l931304l452619o20289L025577
8880C15778703O198408R584180J1868278J5046355J6753637J5565333J3442579
8873D04237473Q804480L335961m13336n844847r315398j1810516j2392018j0540645
8865C66061154q944323n757790j739021K410633P426677J0556042J0878640J0291050
8857C91183062P741042N931250J579606k273405p956758j1385545j4550864j6588839
8849C53679549j5067555j5379717j2811088r603980q123571n042381l098215o45896
$$ plain form
8903 267972147 262947267 254356909 246624756 239697502 234966443 233133701 234158896 238538550
8895 238538550 246293339 256885086 269170827 281280673 294885768 306832354 314932215
8888 314932215 320676925 322545288 322453068 320757338 316826034 313373415 312753126 315778703
8880 315778703 321977111 331561291 343429569 358475924 375229561 390794894 404237473
8873 404237473 413041953 416377914 415964578 410119731 400804333 388993817 376601799 366061154
8865 366061154 357116831 351359041 349620020 352030653 359457330 370013372 380892012 391183062
8857 391183062 398924104 404855354 406434960 404161555 396204797 384819252 370268388 353679549
8849 353679549 338611994 323232277 310421189 300817209 292693638 287651257 284553042 283907146
8841B83907146O96767L79001q23132k539002m575035n815594o113479o679002
8833B58437670n122734n398683l545525j761499o76069R53525K301304K922700
8825B48110689K901026K452386J469211j474088k918451m805131q291033r441009
8817B28003600j0976430j0050716r299990q481307p579035q215029o971235o639982
8809A59789876p485531p284240o322607p074947m362686m755846l971496j178891
8801A17353632j400992m24054K55880q47805J052142N88148M49282n98234j168572
8792A15259427j057411k137580p07767j467944j602715j343047k098739p40315
8784A04103909J85619j9905P25507L87138l55213j159147j022537j580579k775452
$$ plain form
8841 283907146 284603913 284982914 284159782 281620780 277045745 271230151 265116672 258437670
8833 258437670 253314936 247916253 244370728 242609229 241933160 242886685 245187989 248110689
8825 248110689 251011715 253464101 254933312 253459224 250540773 245735642 237444609 228003600
8817 228003600 217027170 206976454 197676464 189195157 181616122 173401093 166429858 159789876
8809 159789876 152304345 145020105 138697498 131622551 127259865 122504019 118532523 117353632
8801 117353632 115952640 115528586 115784466 114936661 115988803 116576951 117026233 116427999 115259427
8792 115259427 114202016 112064436 111356669 109888725 108286010 106942963 104844224 104103909
8784 104103909 104289528 104269623 104995130 105382268 105027055 103867908 102845371 101264792 98489340
8775I8489340l405374l043817n019710m208153l954547m734913l646166l207095
8767F7269565k746384l679872k577540k414921j487826k58879p85910j077278
8759E2240955p41310R19380J29912P65497J86567J260555J504210J641824J518049
8750E9425639J251076K369908K622690K002208J034502K87558N4338k77986q64689
8741F7905244k362765k422951l600101l653538k664080l950019k390289l293042
8733D3568459l065953j390045j439067j319203j679052q47202l10200l54663k38765
8724C2924309q59370j020801L25618l59982l11072Q6171N56278L24176R56754
8715C2622081J203492l73702M15534J10437q09647m59325m50637k389408j363758
$$ plain form
8775 98489340 95083966 92040149 87020439 82812286 78857739 74122826 70476660 67269565
8767 67269565 64523181 60843309 58265769 55850848 54363022 54104143 53318233 52240955
8759 52240955 51499645 52419025 52548937 53314434 53501001 54761556 56265766 57907590 59425639
8750 59425639 60676715 63046623 65669313 67671521 68706023 68993581 69047919 68769933 67905244
8741 67905244 65542479 63119528 59519427 55865889 53201809 49251790 46861501 43568459
8733 43568459 40502506 39112461 37673394 36354191 34675139 33827937 33517737 33163074 32924309
8724 32924309 32064939 31044138 31369756 31009774 30698702 30784873 31341151 31665327 32622081
8715 32622081 33825573 33451871 33867405 33977842 33168195 32708870 32258233 29868825 28505067
8706B8505067j926884j395920j347448j223798j624394j329924k40452p37882
8698A8678365j366869o99746o53864j17323M05770q20072m43052j123355l6056
8689A3823798K24988p47251k95847n58659k02678L84166r7927n13151j091306
8680A0926133O58995l19182K86350r80688J71303J36653m12359K98078j421488
8671I343795n77285M36607K95728J57281J46234m53177k57535k34290m59207J51796
8661H549947N0750q889l41117k54546p39117l90867M96595q92226R03157J42320
8651G516007k91383o66616l68408R36365O5491p87737Q17312j339717L05112K48131
8641F434557p98587J48850M92957K91888M66060o15918m12751Q79978j38127j69400
$$ plain form
8706 28505067 26578183 25182263 23834815 22611017 20986623 19656699 19416247 18678365
8698 18678365 17311496 16611750 15957886 15840563 16246333 15426261 14983209 13859854 13823798
8689 13823798 14048786 13301535 13005688 12447029 12244351 12628517 12530590 12017439 10926133
8680 10926133 11585128 11265946 11552296 10571608 10742911 10879564 10467205 10765283 9343795
8671 9343795 8766510 9203117 9498845 9656126 9802360 9349183 9091648 8857358 8398151 8549947
8661 8549947 8600697 8591808 8250691 7996145 7257028 6866161 7362756 6470530 7373687 7516007
8651 7516007 7224624 6558008 6189600 7125965 7191456 6403719 7221031 5881314 6186426 6434557
8641 6434557 5635970 5784820 6277777 6569665 7035725 6419807 6007056 6887034 6748907 6579507
8631F579507k25696k29618k11956N641J97023j77773l95820N45411p59871L67299
8621E694147J18876k14083L0292l9316o8655l05368q86269Q0769l14077J014938
8611E111254o45396p36462J125022j6197K83133K56342m25090k51443J363184
8602F064347q45324n28910O65975n43754N80776n61790o53827J3649O55056N70084
8592E416282o96076J15075m06267J85373L63024j91260m64324r6112Q26616r93463
8582D058868p3214J76928J44581k27668R09537o56187o85429L48513K23727O91579
8572D911235o58734R3735q10718K64923K74906M48730J89749L83079m14632l52953
8562D329320o86585O48462M99703n18380R09604j345961k7764K07191k68324J298059
$$ plain form
8631 6579507 6353811 6124193 5912237 5917878 6114901 5937128 5541308 6086719 5326848 5694147
8621 5694147 5813023 5598940 5629232 5589916 5521261 5215893 4329624 4410393 4096316 5111254
8611 5111254 4465858 3729396 4854418 4838221 5121354 5377696 4952606 4701163 6064347
8602 6064347 5219023 4690113 5356088 4812334 5393110 4831320 4177493 4191142 4846198 5416282
8592 5416282 4720206 4835281 4429014 4614387 4977411 4786151 4321827 4225715 5052331 4058868
8582 4058868 3985654 4162582 4307163 4079495 4989032 4332845 3647416 3995929 4219656 4911235
8572 4911235 4252501 4346236 3535518 3800441 4075347 4524077 4713826 5096905 4682273 4329320
8562 4329320 3642735 4291197 4790900 4272520 5182124 3836163 3808399 4015590 3747266 5045325
8552E045325k91622m2220L20932p31103J9350K0104m31457L30263p9231M343O4027
8541D228711n6116j12960O44253K19994m31257N33849J85059P6158r2283m2699
8531E152709L96247J35009M49912m94820k73299P84248J009943o95775k53917
8522F210257N57401m28946J019325k7404p72723M09821l23114R90917O0195k22943
8512G472786O7909L80563k16015J94663k5048M80720J25023J39604k64748J9305
8502H374762J312481L44735J56324N3668L81609k1062P43139J76303M54992N45247
8492A2522198J166973j86557Q05470J382773Q58650J726384J337572M40818J996812
8483B2051093J940484J800490K168806K120699K038738L008320K440043K820287
$$ plain form
8552 5045325 4753703 4711483 5032415 4301312 4320662 4340766 3909309 4239572 4160341 4164684 4228711
8541 4228711 4172595 4059635 4703888 4923882 4492625 5026474 5211533 5287691 5195408 5152709
8531 5152709 5548956 5683965 6133877 5639057 5365758 6150006 7159949 6464174 6210257
8522 6210257 6767658 6338712 7358037 7330633 6557910 6967731 6644617 7635534 7695729 7472786
8512 7472786 7540695 7921258 7705243 7899906 7874858 8355578 8480601 8620205 8355457 8374762
8502 8374762 9687243 10031978 10188302 10241970 10623579 10602517 11345656 11521959 11976951 12522198
8492 12522198 13689171 13502614 14308084 15690857 16549507 18275891 19613463 20054281 22051093
8483 22051093 23991577 25792067 27960873 30081572 32120310 35128630 37568673 40388960
8475D0388960K089583K690901J592661R15022Q72033j302623r53417j741390j551563
8466D3000167j337823k140113l125661k359686j864068k011988j201225j547052
8458B7412551o94326j83770j106906j168934n16968o60118J25140N46091k66554
8449B3486206Q46149M07736J191344Q80762J209525J762218J567796J983300J631696
8440C4966732J273651J105024J936133K55709Q71146n25303j413249j253350j312278
8431C5904215m79744k458799k164698k908230k664910j982456j968508j534092
8423A9742778j734065r80519j204442k015389j300371q46607q30523K80560j453289
8414I658133l26126j045155m14732j36544m95098J90154j374464N81150M37264
$$ plain form
8475 40388960 42478543 45169444 46762105 47677127 48549160 47246537 46293120 44551730 43000167
8466 43000167 41662344 39522231 36396570 34036884 32172816 30160828 28959603 27412551
8458 27412551 26718225 26534455 25427549 24258615 23741647 23081529 23206669 23752760 23486206
8449 23486206 24332355 24740091 25931435 26812197 28021722 29783940 31351736 33335036 34966732
8440 34966732 36240383 37345407 39281540 39537249 40408395 39883092 38469843 37216493 35904215
8431 35904215 35424471 32965672 30800974 27892744 25227834 23245378 21276870 19742778
8423 19742778 18008713 17028194 15823752 13808363 12507992 11661385 10830862 11111422 9658133
8414 9658133 9332007 8286852 7872120 7735576 7240478 7430632 6056168 6637318 7074582
8405G074582p28603o56650J70100k98904K93139k62072r63962k19921N19466O38829
8395E566004l75597r83362k81023J645k37649J14987K55360r25877J032751n58083
8385C609156q06631L04170J87135L68607j80128p30620j45575M37394l72368N22843
8375C193983l70690N71401p2417j226045P00334k62264K22774K35866o07771p64883
8365A620288Q91648m53749q68884M37758K32121M01640j23592L43077r12539N48654
8355B116422N16015N8263k27930l18160J26938k99548P63282M95581O0364j247080
8345B044147r8267J87154N41848P52042j476086n0555Q9812M26200k37368j177947
8335A000980J60648J023775Q84040o19797j153410n19447Q12365J233840o78394
$$ plain form
8405 7074582 6345979 5689329 5859429 5560525 5853664 5591592 4627630 4407709 4927175 5566004
8395 5566004 5190407 4207045 3926022 3927667 3690018 3805005 4060365 3134488 4167239 3609156
8385 3609156 2802525 3106695 3293830 3662437 3482309 2751689 2606114 3043508 2671140 3193983
8375 3193983 2823293 3394694 3322277 2096232 2796566 2534302 2757076 2992942 2385171 1620288
8365 1620288 2511936 2058187 1189303 1627061 1859182 2260822 2137230 2480307 1567768 2116422
8355 2116422 2632437 2690700 2462770 2144610 2271548 1972000 2735282 3230863 3291227 2044147
8345 2044147 1945880 2133034 2674882 3426924 1950838 1900283 1990095 2416295 2178927 1000980
8335 1000980 1161628 2185403 3069443 2449646 1296236 776789 1589154 2822994 2144600
8326B144600j145077m05671O60952P07048k73367m1550p27878O38275N82610j244454
8316H95488o4389p37562Q94144R34102m88701m63777j108186J489869Q37559j35855
8306B052692l0414o08031p30601J500952l14688j108432j60373m5216Q54810k73701
8296A136998k42499o87592O56074M15777N9495O05631r72123P01135k83942k59617
8286A129337l46967m90691P45616O13633J63307r0192l34013n64865R68089k87988
8276A505266J56652j305394Q91913q93710M78862l81190j019751R09888o01149
8267b58613O69685j44686K83761O28196q6600q63717p68211N33850j06971R30839
8257H17533K57849m50259J41358n35354j20312K13209J41498J011357K46468j266939
$$ plain form
8326 2144600 999523 593852 1254804 1961852 1688485 1646935 919057 1557332 2139942 895488
8316 895488 831099 93537 987681 1921783 1433082 969305 -138881 1350988 2188547 2052692
8306 2052692 2022278 1414247 683646 2184598 1869910 761478 601105 555889 1410699 1136998
8296 1136998 894499 206907 862981 1278758 1338253 1943884 971761 1672896 1388954 1129337
8286 1129337 782370 291679 1037295 1650928 1814235 1724043 1390030 825165 1793254 1505266
8276 1505266 1661918 356524 1248437 354727 833589 452399 -567352 342536 -258613
8267 -258613 411072 266386 550147 1178343 1091743 228026 -540185 -6335 -113306 817533
8257 817533 1075382 625123 766481 231127 110815 324024 465522 1476879 1723347 456408
8247D56408q76773k03360L33327J160553o71113O77612o17484m26978O75094p21337
8237b14051Q53929l04251j87682K72285m55177J038862k34427m48424Q49179r24494
8227B45749J39501n15579Q66538q6720J049264j193067j013736J34160K47659
8218a26231J298623j438055K85436P32006o06402N90506n36886N81520R3159O58931
8208A532607j861056q17508J068557Q31786l93052k90986k85621j38679K58303
8199i5649r08745J81548o918J839187k040156k223399l356199K975494P895304
8190D260467R7190l067267j2687P71587l94862L14772q08883N09186O14298j018365
8180A265436q7247j216910J199236K59949j66224n55863K89993k39212k31469
$$ plain form
8247 456408 -420365 -623725 -290398 870155 199042 876654 259170 -167808 507286 -214051
8237 -214051 639878 335627 147945 420230 -34947 1003915 769488 321064 1170243 245749
8227 245749 385250 -130329 736209 649489 1698753 505686 -508050 -373890 -126231
8218 -126231 1172392 -265663 19773 751779 145377 735883 198997 780517 873676 1532607
8208 1532607 -328449 -1145957 -77400 754386 361334 70348 -215273 -353952 -95649
8199 -95649 -1004394 -822846 -829764 1009423 -1030733 -3254132 -6610331 -3634837 4260467
8190 4260467 4357657 1290390 1277703 2049290 1654428 1969200 1160317 1669503 2283801 1265436
8180 1265436 1178189 -38721 1160515 1420464 1254240 698377 988370 749158 517689
8171E17689J211521j070738N41433n87755j125433J40284K91307J40332j46312
8162h7672o63498P64192N90901k84162M04343J79372r5850R21408k99047j170940
8152B59047m54893m5328J146288K95958N0353n61053n29164K93494k0122O86016
8142A120596o40731J016221k40432p86468r1679r13226J205025L15862J05517
8133A090685L48040p33572K12389L8582o4080M28309J18739K97668P85618q76540
8123A645838l19091J87094k86819L78696m97529K87963o01742j3031P92655p60187
8113H13847k78326n76446m32244R76113Q66576r1730k06981n6509J18276L06406
8103A438982q09005j82624O82456J49615p73858n1553l28984L79174J276212o14545
$$ plain form
8171 517689 1729210 658472 1199905 612150 -513283 -372999 -81692 58640 -87672
8162 -87672 -751170 13022 603923 319761 724104 903476 807626 1729034 1429987 259047
8152 259047 -195846 -241174 905114 1201072 1251425 690372 161208 454702 434580 1120596
8142 1120596 479865 1496086 1255654 469186 377507 -535719 669306 985168 1090685
8133 1090685 1438725 705153 917542 956124 892044 1320353 1439092 1736760 2522378 1645838
8123 1645838 1326747 1513841 1227022 1605718 1108189 1396152 794410 781379 1574034 813847
8113 813847 535521 -40925 -473169 502944 1369520 1277790 1070809 1014300 1132576 1438982
8103 1438982 629977 447353 1129809 1279424 505566 454013 125029 504203 1780415 1165870
8093A165870j77852q94801k69549J471845l03271k19303o03765n92426P00703
8084B77451j84993l02236L37484M88995L09213L03917r69818l1567M30128P0018
8074G28592J136373o93003j280464P27833m28487Q53786J22477o72040K20776
8065G15843L65016n89586k64157L99824L41160O60060o10310j36240j209722J490522
8055A162410M22318k72371l25736j65112j46138j37530K64691N03463l6309j14627
8045A155059p27379o53189R3877R11631j24552l57129L28557o07084O2254n63873
8035d81828j92363M78868O12210P25789q91548r56243J77648L60056N98940J60233
8025E91762j006063M67400J41808l67220L72648M83981j79010j47169k92892k60702
$$ plain form
8093 1165870 988018 93217 -176332 1295513 992242 772939 169174 -423252 277451
8084 277451 92458 -209778 127706 616701 925914 1229831 260013 228446 658574 728592
8074 728592 1864965 1171962 -108502 619331 190844 1044630 1167107 495067 715843
8065 715843 1080859 491273 227116 626940 968100 1628160 1017850 881610 -328112 1162410
8055 1162410 1584728 1312357 986621 821509 675371 537841 802532 1305995 1269686 1155059
8045 1155059 427680 -225509 -131632 779999 655447 298318 626875 19791 82045 -481828
8035 -481828 -674191 -195323 416887 1142676 251128 -705115 -527467 -167411 431529 591762
8025 591762 -414301 53099 194907 -172313 200335 684316 505306 358137 65245 -195457
8015a95457K12721K68110R3259k8860J25412j49818j85933o05690J006354J55628
8005F95726L63784o87094q3407K6729k90846M1066N8823r03043P40345R24293
7995H86376o89750m87476N59636j31225N9569P68173q79277l77735L24830L69281
7985D02402j56943j61252J65655k28034M48147Q36637j34397m77010M64627J00089
7975A259921j89929o95591n59501j36030J101122q9712k89264n29838N09441j76696
7965B03923j52566k49356p53459J889125j96373J8599r53717l07212J245013M54339
7955A198316N66021o81664j177495O92489L44610K17704q2195j19516p271m95210
7945D55789L14440k7210k8010O74778L38355l5345r39965p66464N83153J79906
$$ plain form
8015 -195457 17264 285374 378633 349773 475185 325367 139434 -466256 540098 695726
8005 695726 1059510 372416 289009 315738 24892 65958 124781 -778262 -37917 886376
7995 886376 196626 -290850 268786 137561 197130 965303 86026 -291709 33121 402402
7985 402402 245459 84207 249862 21828 469975 1306612 1172215 695205 1159832 1259921
7975 1259921 1069992 374401 -185100 -321130 779992 690280 401016 -128822 380619 203923
7965 203923 51357 -197999 -951458 937667 741294 759893 -193824 -501036 743977 1198316
7955 1198316 1764337 1082673 -94822 597667 942277 1159981 1077786 958270 950999 455789
7945 455789 770229 743019 715009 1389787 1728142 1692797 752832 -13632 569521 749427
7935G49427j16652N81933j704848M55784O70446j98556J178899p91258N62857
7926A388032K92111j37719k10718o69484n03803l21983N96815l62204l3524n04640
7916d67117P14470J078981j093954O34022l57704J09523O88007j63774j500908
7907c58454J73611M87671O70354k50076r71947O92124k3669K0402N35550k22972
7897G52594n87248L56204m81511p51203o08869J045928K35449N22551m10224l10273
7887b36602n47376M13940O75126k9813l34636k24228p36864P72721P7106P55912
7877E85286M59415k70102m79500r8077m10678N5419Q23689j71674m27021j465271
7867a398514Q15066J88671J86824J204110n88393J69256L19939o92476m54413
$$ plain form
7935 749427 632775 1214708 -490140 -34356 636090 437534 1616433 825175 1388032
7926 1388032 1680143 1542424 1331706 662222 158419 -163564 433251 71047 37523 -467117
7916 -467117 247353 1326334 232380 866402 508698 618221 1306228 1142454 -358454
7907 -358454 -184843 302828 973182 723106 -248841 443283 419614 440016 975566 752594
7897 752594 165346 521550 40039 -711164 -1320033 -274105 -38656 483895 73671 -236602
7887 -236602 -783978 -370038 305088 275275 -59361 -283589 -1020453 -247732 -170626 585286
7877 585286 1044701 774599 295099 197022 -213656 -158237 665452 493778 66757 -1398514
7867 -1398514 -583448 -394777 -207953 996157 407764 577020 896959 204483 -249930
7858b49930J53277O46828L16159j08719j484654P35000K05728L84132L84192p1946
7848I10067j11542J55801j19988j59176n77594l54348Q61734m82140L94097O06212
7838A123123q91501P27067j97690l08971J36693o49254L77820N01807m03122k26289
7828A89683k26844k03169Q14710J206764q00629k45015l84950k73849N18363M3465
7818F38529m89202r28408J52713K75891O73658k15876M20899o69517m7928J083803
7808H94562p50565J255491n94132j72023Q10261J71450m75567j69925J005139
7799A974691q63775R48113o46332q44964n6113J46505J028275j263336N81535
7790A004599r50035n70857P22812J31693M33458m82884K62857K99707J8657j402910
$$ plain form
7858 -249930 -96653 550175 866334 757615 -727039 7961 213689 597821 982013 910067
7848 910067 798525 954326 834338 675162 97568 -256780 604954 122814 516911 1123123
7838 1123123 231622 958689 760999 452028 588721 -60533 317287 819094 415972 189683
7828 189683 -37161 -240330 574380 1781144 980515 735500 350550 76701 595064 638529
7818 638529 149327 -779081 -626368 -350477 323181 107305 528204 -141313 -189241 894562
7808 894562 143997 1399488 805356 633333 1443594 1615044 1139477 969552 1974691
7799 1974691 1110916 2059029 1412697 567733 511620 658125 1686400 423064 1004599
7790 1004599 54564 -516293 206519 338212 771670 288786 551643 851350 870007 -532903
7780e32903J37736M18201L66194O88657j519112J61302k15018J224674k0484j142113
7770d32866M99191Q889R38501q48004P5834n82546o27515R25830j5558O09820
7760E51576Q29J83586K50460q68290R20498r23837P49912m71176K4974J51398
7750E69930n39994k59999r5607J006917K62248J3469j47887k02229J44673j28610
7740F22911m24020o80347Q36049l48571O01704m40904p27185J362085m44535J134187
7730A491374j335434L40571p5112M57954O01601p67046L20344k07432p11499k5767
7720H9554K521J64917O97672k4921n99728j50846k33586Q52401j149598O7417
7710b84197P72890k04697M29149n49427p0962K73665L93876l16769o85884q55815
$$ plain form
7780 -532903 -395167 23034 389228 1077885 -441227 -279925 -494943 729731 709247 -432866
7770 -432866 66325 75214 1013715 165711 241545 -341001 -968516 -42686 -58244 551576
7760 551576 552405 735991 986451 118161 1038659 114822 864734 393558 418532 569930
7750 569930 29936 -230063 -325670 681247 943495 956964 809077 606848 751521 622911
7740 622911 198891 -481456 354593 6022 607726 166822 -560363 801722 357187 1491374
7730 1491374 155940 496511 421399 879353 1480954 713908 1034252 826820 115321 89554
7720 89554 92075 256992 954664 929743 330015 179169 -54417 797984 -351614 -284197
7710 -284197 488693 283996 713145 163718 92756 366421 760297 443528 -242356 -1098171
7700a098171L08252J418976o36993K79694o68503m29099J695062k26573k18233
7691D24412J39267j98031L38442o50575n64229k78466O24625N14039O27293L37849
7681A314626p52811J91464j26346P17263p29123M55759p08983j83132m29218K02747
7671d7754J00544k90680L67133Q2252R19538k49462p32889N21708m82520L67079
7661E54949L09416l51858m53078J93211j32654L22598n35831R12341n469l47436
7651D66189L62843j219224K64673M03072l89070K68647j42040Q8558M04897n90957
7641h2412O17540r9860J65215l71252p22885J91968Q41252l54338K59433n08518
7631f3857K03773L71643J127874j08665m68782k87554l15124N7965Q92795m24649
$$ plain form
7700 -1098171 -789919 629057 -7936 271758 -396745 -825844 869218 642645 424412
7691 424412 563679 365648 704090 53515 -510714 -789180 -164555 349484 976777 1314626
7681 1314626 561815 753279 626933 1344196 615073 1070832 361849 178717 -250501 -47754
7671 -47754 52790 -237890 129243 211495 1131033 881571 148682 670390 187870 554949
7661 554949 864365 512507 59429 252640 119986 442584 -93247 819094 813625 466189
7651 466189 829032 -390192 -125519 277553 -111517 157130 15090 103648 508545 -82412
7641 -82412 535128 435268 600483 229231 -493654 -301686 539566 185228 444661 -63857
7631 -63857 139916 511559 1639433 1530768 1061986 774432 459308 517273 1410068 985419
7621I85419j17767m97519k53060J24949q055R4999K18249j65339M80946m18034
7611D44788p3366R9851M45581K76831k43426j054370L95455L6064O01536P99530
7601A728474o21547j66779l06707K58480m48004R10844o65205N26121m01129m23927
7591C90621j05571Q2294P66694k82451r28237P8380k89974R98499R15026o37888
7581I87393k7194m74861n78822J064279k87719K99743L40094r17621k12567m43041
7571b50316K57633J079159l65361j57056r9794l09029p6601k36809O39072M37657
7561I18555p4096L66067j135037j69637R42871L93456k77562r60530N73336m12046
7551A65377K72806J420643j582854j84923k81918j86180J093518O03440Q97071
$$ plain form
7621 985419 867652 370133 117073 242022 233967 328966 547215 381876 862822 444788
7611 444788 371422 471273 916854 1193685 950259 -104111 291344 327408 928944 1728474
7601 1728474 1106927 940148 633441 891921 443917 1354761 689556 1215677 814548 390621
7591 390621 285050 367344 1134038 851587 -76650 1730 -288244 710255 1625281 987393
7581 987393 960199 485338 -93484 970795 683076 982819 1322913 405292 192725 -250316
7571 -250316 7317 1086476 721115 564059 464265 155236 78635 -158174 480898 918555
7561 918555 844459 1210526 75489 -94148 848723 1242179 964617 4087 577423 165377
7551 165377 438183 1858826 275972 91049 -190869 -377049 716469 1319909 2216980
7542B216980L02405j727Q2510j9749q652P02262j82855o31221r71434j177650
7532C10869R37975L44790K62331l0851l51801j66766L23572J91154j044913R21805
7522A698165q35812l84707j01541q28726Q00415N30980P49878m89638p66992L68778
7512G40800k24448J31247M71524m67709k22602O73136o33295k18743K25632J89084
7502F64626L90172K13376K61051J18462m07430J36451j230966O54010k11745j62306
7492D25701M04006m06176N77120o30475r2005o91171O02420K92025p9535J34937
7482E36847m24156M88074R46079n89781j013053O14920Q1720R69425M85860j123091
7472I72844K48679p08882L72436j23834n37917J316991p10784J055403j05184
$$ plain form
7542 2216980 2519385 2517658 2600168 2580419 2571767 3274029 3091174 2459953 1488519 310869
7532 310869 1248844 1593634 1855965 1825114 1473313 1306547 1630119 1821273 776360 1698165
7522 1698165 862353 477646 376105 -452621 347794 878774 1628652 1139014 372022 740800
7512 740800 516352 647599 1119123 651414 428812 1101948 468653 249910 475542 664626
7502 664626 1054798 1268174 1529225 1647687 1240257 1376708 145742 799752 588007 425701
7492 425701 829707 423531 1000651 370176 278171 -413000 189420 481445 401910 536847
7482 536847 112691 600765 1546844 957063 -55990 558930 640650 1610075 2095935 972844
7472 972844 1221523 512641 885077 761243 223326 1540317 829533 1884936 1779752
7463A779752j354155K71694j02577J028944L14624q6283q98611r06886P25388
7454G71890O03942m24570L34107m58352M78275L70554l2175n50648m64876O41890
7444A270037J47638p89433o91415j82105j80796J336039J46008n60281J56907
7435F52599o5721N77005J49915n18617J53135L12367L15878j33472k45468n62908
7425F34713O01273L5692l5294m936k38716Q46311k21210J86687r38506j59903
7415G06111N45137j223300J114277o79074K12539K66163l58337N23547m05690
7406G01373Q63922J34647p16028O12203j83339p68366R60617N22923j429120J355234
7396B054066o22821o50463J282072j17943j98937m95066L78775m35604R41012
$$ plain form
7463 1779752 425597 697291 594714 1623658 1938282 1851999 953388 46502 771890
7454 771890 1375832 951262 1285369 827017 1305292 1675846 1643671 1093023 628147 1270037
7444 1270037 1417675 628242 -63173 -245278 -426074 909965 1055973 495692 652599
7435 652599 586878 1163883 1313798 795181 948316 1260683 1576561 1443089 1197621 634713
7425 634713 1235986 1271678 1236384 1231448 992732 1839043 1617833 1804520 866014 706111
7415 706111 1251248 27948 1142225 463151 675690 941853 583516 1107063 701373
7406 701373 1565295 1699942 983914 1596117 1412778 644412 1605029 2127952 698832 2054066
7396 2054066 1431245 780782 2062854 1944911 1745974 1250908 1629683 1194079 2135091
7387B135091k71428m43238N8434n12444J244283j337134M26013J22844n29424
7378H92997J97186k79603j13153m3645P16738m30879M38563l97095l01504O91643
7368A371248n74330L63692K17771j12436j96014q87121P53440j22459J340623
7359B154414R398q6913p66221k31837Q96720o02053J35621R1520j35904M88925
7349A953670j66214p5393o70701Q07679k10773N08527j33813m03807R41419p89826
7339A760768k16445j074340j68143L32495J155511M7583r72385J30313Q0377J03338
7329A179072R2645j60241P98822Q7844l98673q68823j72917L10942R109M39430
7319A317210j77409j54996L74058Q89752n81700n278M93241o28020n11587K98660
$$ plain form
7387 2135091 1863663 1420425 1478859 966415 2210698 873564 1299577 1422421 892997
7378 892997 1090183 810580 697427 653782 1370520 939641 1378204 981109 679605 1371248
7368 1371248 796918 1160610 1378381 1265945 1069931 182810 936250 813791 2154414
7359 2154414 2163812 2076899 1310678 1078841 1975561 1373508 1509129 1600649 1464745 1953670
7349 1953670 1787456 1712063 1041362 1849041 1638268 2146795 2012982 1609175 2550594 1760768
7339 1760768 1544323 469983 301840 634335 1789846 1837429 865044 995357 1075734 1179072
7329 1179072 1271717 1111476 1910298 1998142 1599469 730646 557729 868671 877780 1317210
7319 1317210 1139801 984805 1358863 2248615 1666915 1661637 2154878 1526858 1015271 1313931
7309A313931l99097O44938Q47385j172859p66438M55262j92621P47665L41774
7300A819940K36478J54605r09987j91378j34065M45791Q94573p12250r55663j31349
7290E16695N57499Q93522k87055p39822L5135k45843J402652o68882l28428J139470
7280B274943P0460O32380j311371p86450K42267J200287Q97468q54479q36091
7271A529414Q0765O5439j33833L32936L2711l4053R97535l21213K922o35294m04149
7260A513180j51447L81114J50016N22274k00551j17057O63427j61574o55384m8234
7250A895764N03187R00418l00491q15250n25448L54607M93011R1185o86460j5384
7240A895139M25439M16165o34674K69138j58716L01304k26022l01486k60797J026852
$$ plain form
7309 1313931 914834 1559772 2407157 1234298 467860 923122 730501 1478166 1819940
7300 1819940 2056418 2211023 1301036 1109658 975593 1421384 2315957 1603707 648044 516695
7290 516695 1074194 1967716 1680661 940839 975974 730131 2132783 1463901 1135473 2274943
7280 2274943 2345403 2977783 1666412 879962 1122229 2322516 3219984 2365505 1529414
7271 1529414 1610179 1675618 1541785 1874721 1907432 1873379 2870914 2549701 2552623 1917329 1513180
7260 1513180 1361733 1742847 1892863 2415137 2214586 2097529 2760956 2599382 1943998 1895764
7250 1895764 2398951 3299369 2998878 2183628 1658180 2012787 2505798 2596983 1910523 1895139
7240 1895139 2320578 2736743 2102069 2371207 2212491 2513795 2287773 1986287 1725490 2752342
7230B752342L46892j16213m62562p16278R76744P18925L8664o88454j64232J25998
7220B811826J4754j97406J2274j32690N4572j93088p74895J13524J385067p98544
7210B295394J228593k89495l73936Q544J75581N19971l16881L35924k01972n97295
7200B784428O35172q33K79130O07428k22878n8408N8644m28970J77844o17040
7190C214517L44034l8154m07679L8520K93054n9705R35480n6721o40888O41083
7180D263541J36314P25471L74852o17390Q4188j19994j39360k84764K39762Q54830
7170E517450J30328o21724J7567m73963O16578L63587Q31295m26207l58421P7216
7160E673706k15121O86518P0603Q32351O273p50026J42228k64644J372605J48284
$$ plain form
7230 2752342 3099234 2983021 2520459 1804181 2780925 3499850 3538514 2850060 2685828 2811826
7220 2811826 2826580 2629174 2641448 2508758 2563330 2370242 1595347 1708871 3093938 2295394
7210 2295394 3523987 3234492 2860556 2869100 3044681 3564652 3247771 3583695 3381723 2784428
7200 2784428 3419600 3418767 3697897 4305325 4082447 4024039 4082683 3653713 3831557 3214517
7190 3214517 3558551 3520397 3112718 3151238 3444292 3384587 4320067 4263346 3622458 4263541
7180 4263541 4399855 5125326 5500178 4882788 4966976 4846982 4707622 4422858 4662620 5517450
7170 5517450 5647778 5026054 5043621 4569658 5186236 5549823 6381118 5954911 5596490 5673706
7160 5673706 5458585 6145103 6215706 7048057 7054330 6304304 6446532 6181888 7554493 7702777
7150G702777L24055K78637m67830J486714j267409N86316K65853J021378M82193
7141A0412684L6631j45680l89677J504087R61131j85075J045064l7187R15184
7132A4117162M24660J233855L46015J075952P24607J05654J317575L94609R01083
7123B0641172K75907J164021P52860j70599J061918J0098J650938J449435O58839
7114B7494589k88899R58821J154224R50659J323634R21631J025310J840907J607076
7105C6987952J61523J076958J874658J507748Q17443J407269J28315J031603R60411
7096D5953880K53151J062423J957436Q91919J213665J081414K117764J735303
7088E6266955J719972J214520J254967J533957J540473J507046Q62388q5158J064428
$$ plain form
7150 7702777 8026832 8305469 7837639 9324353 8056944 8643260 8909113 9930491 10412684
7141 10412684 10449315 10303635 9913958 11418045 12379176 12194101 13239165 13201978 14117162
7132 14117162 14541822 15775677 16121692 17197644 17922251 18027905 19345480 19740089 20641172
7123 20641172 20917079 22081100 22833960 22663361 23725279 23735377 25386315 26835750 27494589
7114 27494589 27205690 28164511 29318735 30269394 31593028 32514659 33539969 35380876 36987952
7105 36987952 37149475 38226433 40101091 41608839 42426282 43833551 43961866 44993469 45953880
7096 45953880 46207031 47269454 49226890 50118809 51332474 52413888 54531652 56266955
7088 56266955 57986927 59201447 60456414 61990371 63530844 65037890 65900278 65815120 66879548
7079F6879548K6827J397007J34793Q8440J006523k30121J424464O1572J1822k24058
7069G0576817n72059Q18341P21345M56410M68316Q93288N51092N57064J43289
7060G4613903l08801L66210P06511j45800p127k1945n84723l626m32106p6059
7050G4106437l07583m7470j26577j067251j684093p13202j284489j615224j011646
7041F6248902j413642j186618j437064j530699o41155j276015p9614k057949k168412
7032E4457734j167972p38352m35226j430113j662708j517696o79535q0203k060057
7023D4685872l66291q05377m60593J04836k275073j198558q81112J91546k18740
7014C8776510j484084j277010j223010j67062j013685j353641j504437p51403
$$ plain form
7079 66879548 66906375 68303382 68438175 68526615 69533138 69303017 70727481 70789053 70800875 70576817
7069 70576817 70004758 70823099 71544444 72000854 72469170 73362458 73913550 74470614 74613903
7060 74613903 74305102 74671312 75377823 75232023 75224896 75202951 74618228 74614602 74182496 74106437
7050 74106437 73798854 73751384 73624807 72557556 70873463 70160261 68875772 67260548 66248902
7041 66248902 64835260 63648642 62211578 60680879 60039724 58763709 58684095 56626146 54457734
7032 54457734 53289762 52551410 52116184 50686071 49023363 47505667 46826132 46745929 44685872
7023 44685872 44319581 43514204 43053611 43158447 40883374 39684816 38803704 38995250 38776510
7014 38776510 37292426 36015416 34792406 34625344 33611659 32258018 30753581 30002178
7006C0002178o77272j898885j338046j367718m68881n59734r39630k078632n95616
6997B0077764J56066n82453k11927o52889j357192p46393m49661k97631m25387
6988A5510297m61059L60653j534981J38266Q44147r75717o676k1215o44664L35433
6978A3544484N06808r26815j70699P0457J85743J61426m24954J85952j23482M04493
6968A3413413k09430r19214L96390j037977k72044J27086M44144n6089M50375
6959A2336654j067602r7427P33503K17378m73664J43647j32364J9927n52551n67486
6949A0560015K06480J93640P84155n79708K23048K98207N45411M24585O2351k49461
6939A2468723p873L78107k44841m36211Q74327n81352K24943l6521m07466N17102
$$ plain form
7006 30002178 29324906 27426021 26087975 24720257 24251376 23691642 22752012 20673380 20077764
6997 20077764 20233830 19651377 19439450 18786561 17429369 16682976 16233315 15935684 15510297
6988 15510297 15049238 15409891 13874910 14013176 14857323 13881606 13874930 13853715 13209051 13544484
6978 13544484 14051292 13124477 12953778 13024235 13209978 13371404 12946450 13132402 13008920 13413413
6968 13413413 13203983 12284769 12681159 11643182 11371138 11498224 11942368 11886279 12336654
6959 12336654 11269052 11171625 11905128 12122506 11648842 11792489 11660125 11680052 11127501 10560015
6949 10560015 10766495 10960135 11744290 11164582 11387630 11685837 12231248 12655833 12718184 12468723
6939 12468723 12460850 12838957 12594116 12157905 13032232 12450880 12675823 12639302 12231836 12748938
6929A2748938N83341L3030o1324Q8940N40647m50792N7359k4412n50634P24587
6919A3689680K80809k55938M1697l38765M73277P27624L16654n9931k99574Q04382
6909A5379915N38034j5971M91029K78188q5873J191678j44845q4228J270227M42517
6899A9260671J164114M83676k49474O23859O84985J254067P4555O04486Q76395
6890B4777334L46496J174228Q26938R51876J892725J467493R95569J974897K549530
6881C6957086K527328K034149P14840K252782O80504J437583K39755j12881J038168
6872D7769314j258235k69529k014603j517346l74795n219m36693j591190m98267
6863C9803437j9427l4816L65502j34793l55879J597538N03667L70038P48566Q34337
$$ plain form
6929 12748938 13332279 13365309 13303985 13392925 13933572 13482780 13540139 13515727 12965093 13689680
6919 13689680 13970489 13714551 13756248 13417483 13890760 14618384 14935038 14875107 14575533 15379915
6909 15379915 15917949 15901978 16393007 16671195 16585322 17777000 17632155 17547927 18818154 19260671
6899 19260671 20424785 20908461 20658987 21282846 21967831 23221898 23296453 23900939 24777334
6890 24777334 25123830 26298058 27124996 28076872 29969597 31437090 32432659 34407556 36957086
6881 36957086 39484414 41518563 42233403 44486185 45166689 46604272 46844027 46731146 47769314
6872 47769314 46511079 46241550 44226947 42709601 42334806 42329587 41892894 40301704 39803437
6863 39803437 39784010 39749194 40114696 39979903 39624024 41221562 41725229 42095267 42843833 43678170
6853D3678170K329479n50754N70045K20585q98902J857394J2825J1501j29521
6844D7100822j13239N56224O73351R63948Q17889J289115R92866J599372K97685
6835E4178033Q24527Q25901M8269R51218Q56153N58562Q78322J1454J602826J109963
6825F1845228K128173J965963K095217K857684K940126L357277J570341L788713
6817H2548722L702735L570654M395530L668089M489512M825444N203965L384494
6809A15789145L838565M349346M037283K752722J728390J242913L45745J658776
6801A35742885n48568r63825P42838M19843J907839J643152J697924K904036L778313
6792A47324437M149821M700671N597550O276861N666963N624954O636339N085559
$$ plain form
6853 43678170 46007649 45456895 46026940 46247525 45348623 47206017 47218842 47230343 47100822
6844 47100822 46987583 47543807 48217158 49181106 49998995 51288110 52280976 53880348 54178033
6835 54178033 55002560 55828461 55876730 56827948 57684101 58242663 59120985 59132439 60735265 61845228
6825 61845228 63973401 65939364 68034581 70892265 73832391 77189668 78760009 82548722
6817 82548722 86251457 89822111 94217641 97885730 102375242 107200686 112404651 115789145
6809 115789145 119627710 123977056 128014339 130767061 132495451 133738364 134084109 135742885
6801 135742885 135194317 134230492 134973330 135393173 137301012 138944164 140642088 143546124 147324437
6792 147324437 151474258 156174929 161772479 168049340 173716303 179341257 185977596 191063155
6784A91063155O322264N402221N098111M115878M226179M562743L628037M435693
6776B28854281M298320L694126L607018L179157M435764K469001K359230K253097
6768B55149994K49092Q69732k22299o26356p75647j036162o27946j005533N01781
6759B52476656J086973J982551J698666K502947L778677L800761M370855L389952
6751B75088038L430723K349183J488561J492143j471312k492217l596755n337227
6743B70951137o180865p745472p554663p945473p690962p354029o652611o773696
6735B13053366o260599o134566m756343l995066m729324n046049n209037n536380
6727A71386002n419488n648332o765568o361129o900311o381787n821495n915818
$$ plain form
6784 191063155 197385419 202787640 207885751 212001629 216227808 220790551 224418588 228854281
6776 228854281 233152601 236846727 240453745 243632902 248068666 250537667 252896897 255149994
6768 255149994 255399086 256268818 256046519 255420163 254644516 253608354 252980408 251974875 252476656
6759 252476656 253563629 255546180 257244846 259747793 263526470 267327231 271698086 275088038
6751 275088038 278518761 280867944 282356505 283848648 282377336 279885119 276288364 270951137
6743 270951137 264770272 257024800 249470137 241524664 233833702 226479673 219827062 213053366
6735 213053366 206792767 200658201 195901858 191906792 187177468 182131419 176922382 171386002
6727 171386002 165966514 160318182 153552614 147191485 140291174 133909387 128087892 122172074
6719A22172074m838785n259298l970146m304862m050151k588722k963805k029538
6711I2166767k545994j988665k576432j869361r15664j090443o81876j240672
6703G9257660j262962j156328j116271j034473j425790j978183j393686j520251
6695F8369716j634201n55734k423012q44020k92506o00762j4499n44933M68818
6686F1928867O9316J449939N71391Q3250N57078J805036K048094O89676N2851
6677F9255498l94452j146103j29659o38352j945334j053590j419729j747537j420984
6668E9359758k723475r90660o24708l80218m65678j985452j315306j397447o24529
6659D8852285j068052j599172j435597k434941o50222j518401k063186m43827
$$ plain form
6719 122172074 117333289 112073991 108103845 103798983 99748832 97160110 94196305 92166767
6711 92166767 89620773 87632108 85055676 83186315 82270651 81180208 80498332 79257660
6703 79257660 77994698 76838370 75722099 74687626 73261836 71283653 69889967 68369716
6695 68369716 66735515 66179781 63756769 62912749 62620243 62019481 62004982 61460049 61928867
6686 61928867 61998183 63448122 64019513 64102763 64659841 66464877 68512971 69202647 69255498
6677 69255498 68861046 67714943 67585284 66946932 65001598 63948008 62528279 60780742 59359758
6668 59359758 56636283 55645623 55020915 54640697 54175019 52189567 50874261 49476814 48852285
6659 48852285 47784233 46185061 44749464 42314523 41664301 40145900 38082714 37638887
6651C7638887k730400j447982j210503j713379j090437r31237o77227j412419
6643B6425303o72171j051813l72150o24081Q0667p83998j344664m57638r00250
6634B0299205j131556k5256n46653q08983J68957q50674J13030J52384o98458
6625A6671996K47965N45608p81723R9867j275382j69800J88236O0409L9023m13556
6615A5212643l73180R10013N62933M10017L13801q62920j082196l51743j363419
6606A3375949J465r4062l60720r66262j675777J076538K41360R0219j40319k65402
6596A1282989Q3488M72800k00005j228217r6501J62160M34270r37149j202703
6587H771132K53676J84887J095325o81487q23287n21754N37485L23856m78209
$$ plain form
6651 37638887 34908487 33460505 32250002 30536623 29446186 28514949 27837722 26425303
6643 26425303 25753132 24701319 24329169 23705088 23785755 23001757 21657093 21199455 20299205
6634 20299205 19167649 19142393 18595740 17786757 17955714 17105040 17218070 17370454 16671996
6625 16671996 16919961 17465569 16683846 16783713 15508331 15338531 15526767 15587176 15626199 15212643
6615 15212643 14839463 15749476 16312409 16722426 17036227 16173307 15091111 14739368 13375949
6606 13375949 13377414 13283352 12922632 11956370 10280593 11357131 11598491 11688710 11548391 11282989
6596 11282989 11366477 11839277 11639272 10411055 10314554 10476714 10910984 9973835 8771132
6587 8771132 9024808 9209695 10305020 9623533 8800246 8278492 8815977 9139833 8661624
6578H661624J00448m57352j50215L60183r07463l58304J56497J100698R7269k33791
6568H369594n49151r63157L48487J490897M62133j652591L55657m63687K94126
6559G692308J744223j348066j26347j2406L46415K82967q91345q19018j60544
6550F708187P84970l03111k31714K98407J74345M91480n21869j7036j012166j7157
6540F354336M07731o45973J36327L33712m09599j14373P11426r8318N39476j86152
6530G028593O53935l76781o18899r6153k85473L13607J024288o69205m01451o89256
6520E883205J142542O79485L00356j94051j258543K29946o74399L36234K14473
6511F659248q8280M12079p54745K6774k53177N47245M06867k53184M45307L51240
$$ plain form
6578 8661624 8762072 8304720 8154505 8514688 7607225 7248921 7405418 8506116 8603385 8369594
6568 8369594 7820443 6857286 7205773 8696670 9158803 7506212 7861869 7398182 7692308
6559 7692308 9436531 8088465 7962118 7949712 8296127 8579094 7687749 6868731 6708187
6550 6708187 7493157 7190046 6958332 7256739 7431084 7922564 7400695 7383659 6371493 6354336
6540 6354336 6762067 6116094 6252421 6586133 6176534 6062161 6773587 6675269 7214745 7028593
6530 7028593 7682528 7305747 6686848 6590695 6305222 6618829 7643117 6973912 6572461 5883205
6520 5883205 7025747 7705232 8005588 7811537 6552994 6782940 6108541 6444775 6659248
6511 6659248 6570968 6983047 6228302 6255076 6001899 6549144 6956011 6702827 7148134 7499374
6501G499374n04965j98993K2371n39646N91357P09669q80331Q7927L31693J88843
6491G307299J279660J35709j35211J15621n46758M11313o01859K36968L37966
6482H540708k52985Q70167p23154M71950Q50961K77836K34769O47343r98840K36059
6472A0154814P16695L45613L33127N88896K15312k73368J09730k27613O11035
6463A2574241J019346K36671Q08451l80019K35854j79061k1401J658814L36331
6454A6289227J389506j53338r67107R72356P76426J043794M58701J149934K33721
6445B1193220M64208N07289l5642J219077P72762O02710K5778N07918J110494
6436B6367814l2931J289216J27204K23423J470653R21569Q8660R91221J003649
$$ plain form
6501 7499374 6994409 6795416 6817787 6278141 6869498 7579167 6698836 6786763 7118456 7307299
6491 7307299 8586959 8722668 8587457 8703078 8156320 8567633 7965774 8202742 8540708
6482 8540708 8287723 9157890 8434736 8906686 9757647 10035483 10270252 10917595 9918755 10154814
6472 10154814 10871509 11217122 11550249 12139145 12354457 12081089 12190819 11963206 12574241
6463 12574241 13593587 13830258 14638709 14258690 14494544 14315483 14294082 15952896 16289227
6454 16289227 17678733 17525395 16558288 17530644 18307070 19350864 19809565 20959499 21193220
6445 21193220 21657428 22164717 22129075 23348152 24120914 24723624 24749402 25257320 26367814
6436 26367814 26334883 27624099 27751303 27974726 29445379 30366948 30455608 31446829 32450478
6427C2450478p1766Q21866j077608q52837J2783O06437j444863j825511q90899
6418B7728080j239730j16185r32110k389427o26733p29326M71247j570455j563596
6409A9031765o17820p64348P21932j331844p77290j03009L96044j51382k06205
6400A6197843p66066j084273N12237R9483O8051o2498j86299l1398q15944k45546
6390A3685590m98007m72311O87916L69504n87037q77267l18312L8612j41775J34525
6380A2021438l77605r71349N62081K85822K07490N6364l92859p59510j59453M93394
$$ plain form
6427 32450478 32378712 33200578 32122970 31270133 31282916 31889353 30444490 28618979 27728080
6418 27728080 26488350 26372165 25440055 23050628 22423895 21694569 22165816 20595361 19031765
6409 19031765 18413945 17649597 18371529 17039685 16262395 16159386 16555430 16404048 16197843
6400 16197843 15431777 14347504 14859741 14959224 15027275 14964777 14778478 14747080 13931136 13685590
6390 13685590 13187583 12715272 13403188 13772692 13185655 12308388 11990076 12028688 11886913 12021438
6380 12021438 11643833 10672484 11234565 11520387 11727877 11784241 11391382 10631872 10472419 10965813
$$ [...]
##END NTUPLES=NMR SPECTRUM
##END=
