##TITLE=1H_DE-80H_X3
 200.13MHz, d2o
 8 sc
 
 19ns.26.2.2025
##JCAMPDX= 6.0         $$ Bruker NMR JCAMP-DX V2.0
##DATA TYPE= NMR SPECTRUM
##DATA CLASS= NTUPLES
##ORIGIN= UXNMR, Bruker Analytische Messtechnik GmbH
##OWNER= pz
$$ XWIN-NMR		Version 3.5
$$ Mon Dec 29 10:46:03 2025 Russian Standard Time (UT+4h)  Yarkov@DPX200
##.OBSERVE FREQUENCY= 200.1313
##.OBSERVE NUCLEUS= ^1H
##.ACQUISITION MODE= SIMULTANEOUS
##.ACQUISITION SCHEME= undefined
##.AVERAGES= 8
##.DIGITISER RES= 18
##SPECTROMETER/DATA SYSTEM= spect
##.PULSE SEQUENCE= zg30
##.SOLVENT NAME= CDCl3
##.SHIFT REFERENCE= (INTERNAL, CDCl3, 0, 15.4483)
##AUDIT TRAIL= $$ (NUMBER, WHEN, WHO, WHERE, WHAT)
$$ ##TITLE= Audit trail, XWIN-NMR		Version 3.5
$$ ##JCAMPDX= 5.01
$$ ##ORIGIN= Bruker BioSpin GmbH
$$ ##OWNER= Yarkov
$$ C:/Bruker/XWIN-NMR/data/yarkov2/nmr/H-C/1/pdata/1/auditp.txt
$$ ##AUDIT TRAIL=  $$ (NUMBER, WHEN, WHO, WHERE, WHAT)
(   1,<2025-12-29 10:45:00.10 +0400>,<Yarkov>,<DPX200>,
      <created by zg, POWCHK disabled, PULCHK disabled
       configuration hash MD5:
       00 E9 B6 7A A2 85 ED C7 34 08 36 98 17 FE 4E 26
       data hash MD5: 16K
       D0 DA C4 23 6B BA 22 1A F9 C6 2F 8F CD E1 27 EA>)
(   2,<2025-12-29 10:45:04.43 +0400>,<Yarkov>,<DPX200>,
      <Start of raw data processing
       efp BC_mod = 2 LB = 0.25 FT_mod = 6 PKNL = 1 PHC0 = -5303.476 PHC1 = 17.22193 SI = 16K 
       data hash MD5: 16K
       E3 A2 6A D4 35 0E E6 B1 D2 C2 1F 23 D3 8F 92 7E>)
(   3,<2025-12-29 10:45:29.67 +0400>,<Yarkov>,<DPX200>,
      <pk PHC0 = 1.578712 PHC1 = -9.599999 
       data hash MD5: 16K
       D1 56 60 44 AE 32 10 33 26 E9 90 B8 E9 1F F4 C9>)
$$ ##END=
$$ 
$$ hash MD5
$$ 1C 38 86 BB 7A CE 6D F4 74 A1 79 A0 65 7D E4 D3
##$RELAX= 
##$RELAX= 
##$RELAX= 
##$RELAX= 
##$RELAX= 
##$RELAX= 
$$ Bruker specific parameters
$$ --------------------------
##$DU= <C:/Bruker/XWIN-NMR>
##$EXPNO= 1
##$NAME= <H-C>
##$PROCNO= 1
##$TYPE= <nmr>
##$USER= <yarkov2>
##$AMP= (0..31)
100 100 100 100 100 100 100 100 100 100 100 100 100 100 100 100 100 100 
100 100 100 100 100 100 100 100 100 100 100 100 100 100 
##$AQSEQ= 0
##$AQ_mod= 1
##$AUNM= <au_zg>
##$AUTOPOS= <>
##$BF1= 200.13
##$BF2= 200.13
##$BF3= 200.13
##$BF4= 200.13
##$BF5= 200.13
##$BF6= 200.13
##$BF7= 200.13
##$BF8= 200.13
##$BYTORDA= 1
##$CFDGTYP= 0
##$CFRGTYP= 5
##$CHEMSTR= <none>
##$CNST= (0..31)
1 1 145 1 1 1 1 1 1 1 1 1 1 1 1 1 1 1 1 1 1 1 1 1 1 1 1 1 1 1 1 1 
##$CPDPRG= <>
##$CPDPRG1= <>
##$CPDPRG2= <>
##$CPDPRG3= <>
##$CPDPRG4= <mlev>
##$CPDPRG5= <mlev>
##$CPDPRG6= <mlev>
##$CPDPRG7= <mlev>
##$CPDPRG8= <mlev>
##$CPDPRGB= <>
##$CPDPRGT= <>
##$D= (0..31)
0 0.7 0 0 0 0 0 0 0 0 0 0.03 0 0 0 0 0 0 0 0 0 0 0 0 0 0 0 0 0 0 0 0 
##$DATE= 1766990699
##$DBL= (0..7)
120 120 120 120 120 120 120 120 
##$DBP= (0..7)
150 150 150 150 150 150 150 150 
##$DBP07= 0
##$DBPNAM0= <>
##$DBPNAM1= <>
##$DBPNAM2= <>
##$DBPNAM3= <>
##$DBPNAM4= <>
##$DBPNAM5= <>
##$DBPNAM6= <>
##$DBPNAM7= <>
##$DBPOAL= (0..7)
0.5 0.5 0.5 0.5 0.5 0.5 0.5 0.5 
##$DBPOFFS= (0..7)
$$ [...]
##$SUBNAM2= <"">
##$SUBNAM3= <"">
##$SUBNAM4= <"">
##$SUBNAM5= <"">
##$SUBNAM6= <"">
##$SUBNAM7= <"">
##$SUBNAM8= <"">
##$SUBNAM9= <"">
##$SW= 18.0517328524113
##$SWIBOX= (0..15)
0 0 2 0 0 0 0 0 0 0 0 0 0 0 0 0 
##$SW_h= 3612.71676300578
##$TD= 16384
##$TD0= 1
##$TE= 0
##$TE2= 300
##$TE3= 300
##$TEG= 300
##$TL= (0..7)
0 120 120 120 120 120 120 120 
##$TP= (0..7)
150 150 150 150 150 150 150 150 
##$TP07= 0
##$TPNAME0= <>
##$TPNAME1= <>
##$TPNAME2= <>
##$TPNAME3= <>
##$TPNAME4= <>
##$TPNAME5= <>
##$TPNAME6= <>
##$TPNAME7= <>
##$TPOAL= (0..7)
0.5 0.5 0.5 0.5 0.5 0.5 0.5 0.5 
##$TPOFFS= (0..7)
0 0 0 0 0 0 0 0 
##$TUNHIN= 0
##$TUNHOUT= 0
##$TUNXOUT= 0
##$USERA1= <user>
##$USERA2= <user>
##$USERA3= <user>
##$USERA4= <user>
##$USERA5= <user>
##$V9= 5
##$VALIST= <valist>
##$VCLIST= <CCCCCCCCCCCCCCC>
##$VD= 0
##$VDLIST= <DDDDDDDDDDDDDDD>
##$VPLIST= <PPPPPPPPPPPPPPP>
##$VTLIST= <TTTTTTTTTTTTTTT>
##$WBST= 1024
##$WBSW= 4
##$XGAIN= (0..3)
0 0 0 0 
##$XL= 0
##$YL= 0
##$YMAX_a= 111384
##$YMIN_a= -81621
##$ZGOPTNS= <>
##$ZL1= 120
##$ZL2= 120
##$ZL3= 120
##$ZL4= 120
##$ABSF1= 0
##$ABSF2= 0
##$ABSG= 0
##$ABSL= 0
##$ALPHA= 0
##$AQORDER= 0
##$ASSFAC= 0
##$ASSFACI= 0
##$ASSFACX= 0
##$ASSWID= 0
##$AUNMP= <proc_1d>
##$AZFE= 0.1
##$AZFW= 0.1
##$BCFW= 0
##$BC_mod= 2
##$BYTORDP= 0
##$COROFFS= 0
##$CY= -3
##$DATMOD= 1
##$DC= 0
##$DFILT= <>
##$DTYPP= 0
##$F1P= 0
##$F2P= 0
##$FCOR= 1
##$FTSIZE= 16384
##$FT_mod= 6
##$GAMMA= 0
##$GB= 0
##$INTBC= 1
##$INTSCL= 3.241238e-09
##$ISEN= 128
##$LB= 0.25
##$LEV0= 0
##$LPBIN= 0
##$MAXI= 10000
##$MC2= 0
##$MEAN= 0
##$ME_mod= 0
##$MI= 1.114404
##$NCOEF= 0
##$NC_proc= -8
##$NLEV= 6
##$NOISF1= 3.799351
##$NOISF2= 2.8
##$NSP= 0
##$NTH_PI= 0
##$NZP= 0
##$OFFSET= 15.4483
##$PC= 1
##$PHC0= -5301.897
##$PHC1= 7.62193
##$PH_mod= 1
##$PKNL= yes
##$PPARMOD= 0
##$PSCAL= 0
##$PSIGN= 0
##$REVERSE= no
##$SF= 200.130014689376
##$SI= 16384
##$SIGF1= 3
##$SIGF2= 2
##$SINO= 0.751879
##$SIOLD= 32768
##$SREGLST= <19F.Aceton>
##$SSB= 0
##$STSI= 16384
##$STSR= 0
##$SW_p= 3612.71676300578
##$SYMM= 0
##$S_DEV= 0
##$TDeff= 16384
##$TDoff= 0
##$TI= <>
##$TILT= no
##$TM1= 0
##$TM2= 0
##$TOPLEV= 0
##$USERP1= <user>
##$USERP2= <user>
##$USERP3= <user>
##$USERP4= <user>
##$USERP5= <user>
##$WDW= 1
##$XDIM= 16384
##$YMAX_p= 298105670
##$YMIN_p= -1659109
$$ End of Bruker specific parameters
$$ ---------------------------------
##NTUPLES= NMR SPECTRUM
##VAR_NAME=  FREQUENCY,     SPECTRUM/REAL,   SPECTRUM/IMAG
##SYMBOL=    X,             R,               I
##VAR_TYPE=  INDEPENDENT,   DEPENDENT,       DEPENDENT
##VAR_FORM=  AFFN,          ASDF,            ASDF
##VAR_DIM=   16384,         16384,           16384
##UNITS=     HZ,            ARBITRARY UNITS, ARBITRARY UNITS
##FACTOR=    0.220516191357247, 1,           1
##FIRST=     3091.66857829957, 0,            0
##LAST=      -521.048184706215, 0,           0
##MIN=       -521.048184706215, -1659109,    0
##MAX=       3091.66857829957, 298105670,    0
$$ Real data points
##PAGE= N=1
##DATA TABLE= (X++(R..R)), XYDATA
$$ [...]
$$ plain form
11797 112377 468268 483691 349625 385346 298050 329119 386628 405520 696435 484503 286558
11786 286558 719432 1028920 599455 497220 814206 460011 204844 274175 9813 478761
11776 478761 535281 205064 809860 787446 361121 535916 615333 504767 672546 583306
11766 583306 640856 896870 741473 404453 93481 254148 69339 220345 411731 593874
11756 593874 491314 678347 498964 54823 325871 622779 567723 662788 711577 290064
11746 290064 263980 190988 164026 485039 226769 116332 417394 484632 457950 674566
11736 674566 517822 390248 651881 844451 912494 739856 782900 250790 103428 157900
11726 157900 267113 310348 298669 870145 794471 486237 303914 69974 23412 -204351
$$ packed form
11797A12377L55891J5423j34066L5721q7296L1069N7509J8892K90915k11932j97945
11786B86558M32874L09488m29465j02235L16986l54195k55167O9331k64362M68948
11776D78761N6520l30217O04796k2414m26325J74795P9417j10566J67779q9240
11766E83306N7550K56014j55397l37020l10972J60667j84809J51006J91386J82143
11756E93874j02560J87033j79383m44141K71048K96908n5056R5065M8789m21513
11746B90064k6084p2992k6962L21013k58270j10437L01062O7238k6682K16616
11736F74566j56744j27574K61633J92570O8043j72638M3044n32110j47362N4472
11726A57900J09213M3235j1679N71476p5674l08234j82323k33940m6562k27763
$$ plain form
11716 -204351 -319788 184533 270466 287284 115453 144195 402177 373717 722617 859092
11706 859092 683112 430379 176554 82232 308097 157833 401782 461484 428762 699374
11696 699374 832248 657129 604602 644838 415469 535947 565331 323746 249899 224675
11686 224675 -39449 -18821 598738 529444 223495 368456 490122 378576 648750 802528
11676 802528 452183 512693 331933 244413 393089 103024 -70658 282403 526250 714504
11666 714504 860982 675420 794267 758796 295688 179408 270376 375383 559623 524215
11656 524215 651879 649738 296411 482804 502230 365427 462169 587011 382582 175487
11646 175487 26740 250500 418272 259659 339644 526072 550510 553628 1070169 1083720
$$ packed form
11716b04351j15437N04321Q5933J6818j71831K8742K57982k8460L48900J36475
11706H59092j75980k52733k53825r4322K25865j50264K43949N9702l2722K70612
11696F99374J32874j75119n2527M0236k29369J20478K9384k41585p3847k5224
11686B24675k64124K0628O17559o9294l05949J44961J21666j11546K70174J53778
11676H02528l50345O0510j80760q7520J48676k90065j73682L53061K43847J88254
11666G14504J46478j85562J18847l5471m63108j16280R0968J05007J84240l5408
11656E24215J27664k141l53327J86393J9426j36803R6742J24842k04429k07095
11646A75487j48747K23760J67772j58613P9985J86428K4438L118N16541J3551
$$ plain form
11636 1083720 670381 809712 862351 575938 453756 207131 278627 640714 752639 558357
11626 558357 649865 536775 471354 629107 755604 383940 647457 857560 462678 249556
11616 249556 225536 453885 321168 462358 496535 351552 354798 238172 179196 460614
11606 460614 122581 10778 510373 615762 151827 544270 718840 772957 770024 917139
11596 917139 774981 811873 771353 273827 433883 305257 506289 744008 878620 490872
11586 490872 593082 424219 102248 486816 780938 540646 640544 564605 262322 329651
11576 329651 358831 172710 122448 245650 520097 760008 613007 549909 435357 446817
11566 446817 287581 537269 857416 709017 747498 626269 546600 374990 804100 1020649
$$ packed form
11636A083720m13339J39331N2639k86413j22182k46625P1496L62087J11925j94282
11626E58357R1508j13090o5421J57753J26497l71664K63517K10103l94882k13122
11616B49556k4020K28349j32717J41190L4177j44983L246j16626n8976K81418
11606D60614l38033j11803M99595J05389m63935L92443J74570N4117k933J47115
11596I17139j42158L6892m0520m97526J60056j28626K01032K37719J34612l87748
11586D90872J02210j68863l21971L84568K94122k40292R9898p5939l02283O7329
11576C29651K9180j86121n0262J23202K74447K39911j47001o3098j14552J1460
11566D46817j59236K49688L20147j48399L8481j21229p9669j71610M29110K16549
$$ plain form
11556 1020649 879646 679545 526496 208793 378317 513826 189401 492004 443264 277011
11546 277011 755896 582271 66722 217589 343690 433425 254228 477165 113114 107577
11536 107577 474742 349818 344760 579590 638169 669556 789039 808000 581275 574957 616671
11525 616671 321871 489216 604569 230471 469626 714630 513069 789239 830720 342234
11515 342234 454064 553573 363031 384199 363377 387029 397626 437222 445635 689924 842591
11504 842591 412496 548581 773730 707230 445796 193542 387614 456805 618297 698001
11494 698001 337980 622451 665196 429001 675550 903438 723571 908407 803487 480732
11484 480732 830160 497714 -78000 271161 207495 322265 901537 697220 469756 581340
$$ packed form
11556A020649j41003k00101j53049l17703J69524J35509l24425L02603m8740j66253
11546B77011M78885j73625n15549J50867J26101Q9735j79197K22937l64051n537
11536A07577L67165j24924n058K34830N8579L1387J19483J8961k26725o318M1714
11525F16671k94800J67345J15353l74098K39155K45004k01561K76170M1481m88486
11515C42234J11830R9509j90542K1168k0822K3652J0597L9596Q413K44289J52667
11504H42591m30095J36085K25149o6500k61434k52254J94072O9191J61492P9704
11494F98001l60021K84471M2745k36195K46549K27888j79867J84836j04920l22755
11484D80732L49428l32446n75714L49161o3666J14770N79272k04317k27464J11584
$$ plain form
11474 581340 356691 363679 504771 374597 500271 460580 85370 212511 192336 365023
11464 365023 933406 720766 609857 703587 640205 741636 780192 155086 278533 419645
11454 419645 345298 528363 775724 509934 700400 776123 269236 608758 783230 667706
11444 667706 1234351 1069109 676817 624793 476596 265154 540164 511492 605750 797084
11434 797084 326429 443530 680451 382974 519182 604526 674007 991698 924312 765328
11424 765328 918842 480135 459116 799014 705217 900008 970269 765874 676421 473232
11414 473232 64138 575019 439463 160040 389679 351846 148214 545732 109149 50607
11404 50607 485840 274522 249376 414065 428169 679477 518530 12330 242991 257986
$$ packed form
11474E81340k24649O988J41092j30174J25674l9691l75210J27141k0175J72687
11464C65023N68383k12640j10909R3730o3382J01431L8556o25106J23447J41112
11454D19645p4347J83065K47361k65790J90466P5723n06887L39522J74472j15524
11444F67706N66645j65242l92292n2024j48197k11442K75010k8672R4258J91334
11434G97084m70655J17101K36921k97477J36208Q5344O9481L17691o7386j58984
11424G65328J53514m38707k1019L39898r3797J94791P0261k04395q9453k03189
11414D73232m09094N10881j35556k79423K29639l7833k03632L97518m36583n8542
11404E0607M35233k11318k5146J64689J4104K51308j60947n06200K30661J4995
$$ plain form
11394 257986 355167 492050 648354 620863 475691 190345 367116 385062 322821 820194
11384 820194 830966 791162 1080912 917450 347925 674386 495068 -39087 523872 638647
11374 638647 205426 653555 365135 166038 796671 593949 648715 1052949 896276 390581
11364 390581 435108 314609 170871 284828 304192 455615 653159 539121 600693 394168
11354 394168 545520 789344 631446 1295003 1017477 342195 513392 183791 -555110 60176
11344 60176 347258 141060 815736 706558 265113 749825 274067 21063 499641 261377
11334 261377 262901 369557 15365 -121582 400493 140943 188166 505081 438205 585217
11324 585217 535736 585136 368584 196066 401503 642415 282343 525491 656912 76211
$$ packed form
11394B57986R7181J36883J56304k7491j45172k85346J76771J7946o2241M97373
11384H20194J0772l9804K89750j63462n69525L26461j79318n34155N62959J14775
11374F38647m33221M48129k88420j99097O30633k02722N4766M04234j56673n05695
11364C90581M4527j20499j43738J13957J9364J51423J97544j14038O1572k06525
11354C94168J51352K43824j57898O63557k77526o75282J71197l29601p38901O15286
11344F0176K87082k06198O74676j09178m41445M84712m75758k53004M78578k38264
11334B61377J524J06656l54192j36947N22075k59550M7223L16915o6876J47012
11324E85217m9481M9400k16552j72518K05437K40912l60072K43148J31421n80701
$$ plain form
11314 76211 570180 914145 464611 906745 922517 560290 998239 864996 441405 630223
11304 630223 463779 68813 594253 731770 426319 653635 613528 424290 403691 346017
11294 346017 192329 222492 403955 411505 455121 353507 351598 258184 576399 568662 238528
11283 238528 679205 1009484 641085 797942 625763 256460 338745 305719 104832 504150
11273 504150 911319 911963 976603 1058235 521627 295248 310875 521123 898559 611836 405438
11262 405438 326799 360993 364118 474372 779453 891768 844903 885225 1001487 432330 194192
11251 194192 552107 464277 490943 845177 656041 674787 717046 458975 644636 523749
11241 523749 607040 1121815 1040486 815350 758126 225002 507254 614712 309929 485559
$$ packed form
11314G6211M93969L43965m49534M42134J5772l62227M37949j33243m23591J88818
11304F30223j66444l94966N25440J37517l05451K27316m0107j89238k0599n7674
11294C46017j53688L0163J81463P550M3616j01614j909r3414L18215p737l30134
11283B38528M40677L30279l68399J56857j72179l69303Q2285l3026k00887L99318
11273E04150M07169O44O4640Q1632n36608k26379J5627K10248L77436k86723k06398
11262D05438p8639L4194L125J10254L05081J12315m6865M0322J16262n69157k38138
11251A94192L57915q7830K6666L54234j89136J8746M2259k58071J85661j20887
11241E23749Q3291N14775q1329k25136n7224n33124K82252J07458l04783J75630
$$ plain form
11231 485559 656224 607979 675195 384823 120679 137918 41305 128182 476622 656360
11221 656360 894175 704179 471393 495004 495104 377286 563408 730965 759037 841760 606412
11210 606412 278562 530416 552904 680231 867327 1022382 893099 647401 693465 744506
11200 744506 746339 764329 885328 858427 632198 649988 406865 231898 276975 367308 572693
11189 572693 717249 659285 698592 816969 559125 603631 813140 642051 795946 881293
11179 881293 763797 899320 721001 743694 840015 983673 774412 556228 722800 628683
11169 628683 758677 457952 418570 705484 506008 800063 992332 410875 306454 581634
11159 581634 254449 284578 366790 295143 346590 707383 469020 679949 468880 275841
$$ packed form
11231D85559J70665m8245O7216k90372k64144J7239r6613Q6877L48440J79738
11221F56360K37815j89996k32786K3611J00j17818J86122J67557K8072Q2723k35348
11210F06412l27850K51854K2488J27327J87096J55055j29283k45698M6064N1041
11200G44506J833J7990J20999k6901k26229J7790k43123j74967M5077R0333K05385
11189E72693J44556n7964L9307J18377k57844M4506K09509j71089J53895Q5347
11179H81293j17496J35523j78319K2693R6321J43658k09261k18184J66572r4117
11169F28683J29994l00725l9382K86914j99476K94055J92269n81457j04421K75180
11159E81634l27185L0129Q2212p1647N1447L60793k38363K10929k11069j93039
$$ plain form
11149 275841 230542 134901 391551 641321 767003 734497 698329 856639 748348 359136
11139 359136 153602 593235 551560 723520 572906 453133 499169 730034 456917 444877
11129 444877 712549 502825 724854 662054 266147 59276 218783 283436 448768 391285
11119 391285 468702 468200 944188 1028654 727560 532671 292813 333258 782421 661365 191028
11108 191028 684472 997918 761069 938893 941594 799872 1049648 1175430 653886 936724
11098 936724 1106324 467338 244496 504422 508721 562556 969230 733348 605444 650402
11088 650402 535487 325761 566268 648647 507087 740973 937114 554857 610704 843252
11078 843252 421523 676748 987087 839046 952753 1332714 728087 643380 795754 88663
$$ packed form
11149B75841m5299r5641K56650K49770J25682l2506l6168J58310j08291l89212
11139C59136k05534M39633m1675J71960j50614j19773M6036K30865k73117j2040
11129D44877K67672k09724K22029o2800l95907k06871J59507O4653J65332n7483
11119C91285P7417n02M75988Q4466l01094j94889k39858M0445M49163j21056m70337
11108A91028M93444L13446k36849J77824K701j41722K49776J25782n21544K82838
11098I36724J69600o38986k22842K59926M299N3835M06674k35882j27904M4958
11088F50402j14915k09726K40507Q2379j41560K33886J96141l82257N5847K32548
11078H43252m21729K55225L10339j48041J13707L79961o04627q4707J52374p07091
$$ plain form
11068 88663 288311 745714 259748 302566 810348 673596 452702 429242 266078 676390
11058 676390 902847 586920 862276 943481 560762 243674 -1170 230379 349297 288830
11048 288830 455823 422995 433415 748403 497284 398079 862911 650227 342654 965704
11038 965704 543730 298724 520774 107576 8413 472156 429116 555849 837466 897927
11028 897927 641938 724163 408332 370384 928537 691234 698841 742577 447134 341267
11018 341267 530069 614664 308435 231062 530528 519962 603779 805372 767795 616252
11008 616252 760851 606225 734028 953644 563855 557874 1031452 431538 149101 655713
10998 655713 423656 786269 1186645 912164 914443 834274 487863 411798 724455 538271
$$ packed form
11068H8663J99648M57403m85966M2818N07782j36752k20894k3460j63164M10312
11058F76390K26457l15927K75356Q1205l82719l17088k44844K31549J18918o0467
11048B88830J66993l2828J0420L14988k51119r9205M64832k12684l07573O23050
11038I65704m21974k45006K22050m13198r9163M63743m3040J26733K81617O0461
11028H97927k55989Q2225l15831l7948N58153k37303P607M3736k95443j05867
11018C41267J88802Q4595l06229p7373K99466j0566Q3817K01593l7577j51543
11008F16252J44599j54626J27803K19616l89789n981M73578n99914k82437N06612
10998F55713k32057L62613M00376k74481K279q0169l46411p6065L12657j86184
$$ plain form
10988 538271 613665 631763 603725 295579 366834 341511 286551 588358 948040 853212 1018834
10977 1018834 1081284 683047 413311 451628 397795 424619 943622 1027211 1243121 1041380
10967 1041380 580574 513250 941991 721501 936458 1287034 967794 1082111 1111411 695582
10957 695582 326684 572772 486714 624839 1000966 932818 898223 869267 734258 475586
10947 475586 283773 211105 453259 667068 624084 719632 652551 809678 765485 945805
10937 945805 1191632 1168524 1474150 1183264 623777 530619 440153 225809 650627 763852
10927 763852 391864 488173 371893 352210 774019 792124 443852 1001808 967828 691946
10917 691946 629156 516177 562782 290437 258744 655242 669891 765963 1065330 849115
$$ packed form
10988E38271P5394J8098k8038l08146P1255k5323n4960L01807L59682r4828J65622
10977A018834O2450l98237k69736L8317n3833K6824N19003Q3589K15910k01741
10967A041380m60806o7324M28741k20490K14957L50576l19240J14317K9300m15829
10957F95582l68898K46088q6058J38125L76127o8148l4595k8956j35009k58672
10947D75586j91813p2668K42154K13809m2984R5548o7081J57127m4193J80320
10937I45805K45827k3108L05626k90886n59487r3158r0466k14344M24818J13225
10927G63852l71988R6309j16280j9683M21809J8105l48272N57956l3980k75882
10917F91946o2790j12979M6605k72345l1693L96498J4649R6072K99367k16215
$$ plain form
10907 849115 950905 1014681 598807 631995 661389 151426 185397 611941 677626 678735 777911
10896 777911 645570 1115700 1403982 944129 1075743 1063666 531562 281861 222122 413762
10886 413762 469953 695152 677420 687774 903970 682933 431670 544419 847039 773904
10876 773904 949972 981012 647077 622763 477979 168800 513796 957662 552180 839894
10866 839894 1195584 1089733 932619 943872 674978 736413 675934 591316 661142 811907
10856 811907 707246 667970 653170 632406 1007200 1175217 980768 922005 1142070 848961
10846 848961 728056 555526 491959 576843 683683 599820 745253 788863 751636 652504 525357
10835 525357 857619 886877 1020668 1404324 833605 448097 396720 138154 345947 745929
$$ packed form
10907H49115J01790O3776m15874L3188K9394n09963L3971M26544O5685J109R9176
10896G77911j32341M70130K88282m59853J31614j2077n32104k49701n9739J91640
10886D13762N6191K25199j7732J0354K16196k21037k51263J12749L02620p3135
10876G73904J76068L1040l33935k4314j44784l09179L44996M43866m05482K87714
10866H39894L55690j05851j57114J1253k68894O1435o0479q4618O9826J50765
10856H11907j04661l9276j4800k0764L74794J68017j94449n8763K20065k93109
10846H48961j20905j72530o3567Q4884J06840q3863J45433M3610l7227r9132j27147
10835E25357L32262K9258J33791L83656n70719l85508n1377k58566K07793L99982
$$ plain form
10825 745929 748846 820069 917600 825335 693049 446474 445756 519120 632853 700095 747151
10814 747151 750696 854218 612215 514391 536774 413868 663312 1034537 885474 714553
10804 714553 898685 411430 433762 657566 258885 535148 662461 418880 450106 873552
10794 873552 805225 1124162 1111885 982691 1289998 1087548 975595 892092 503499 284552
10784 284552 396851 560428 667253 730981 881890 725319 295069 141209 512082 614648
10774 614648 653953 936099 798175 1111884 1294011 757480 668079 706396 592485 823382
10764 823382 922069 750890 1019580 826869 524614 715348 766102 601723 986663 954301
10754 954301 645529 806488 940315 251805 423130 541738 678775 887873 545119 594675
$$ packed form
10825G45929K917P1223R7531r2265j32286k46575p18P3364J13733O7242M7056
10814G47151L545J03522k42003r7824K2383j22906K49444L71225j49063j70921
10804G14553J84132m87255K2332K23804l98681K76263J27313k43581L1226M23446
10794H73552o8327L18937j2277j29194L07307k02450j11953q3503l88593k18947
10784B84552J12299J63577J06825O3728J50909j56571m30250j53860L70873J02566
10774F14648L9305K82146j37924L13709J82127n36531q9401L8317j13911K30897
10764H23382R8687j71179K68690j92711l02255J90734N0754j64379L84940l2362
10754I54301l08772J60959J33827o88510J71325J18608J37037K09098l42754M9556
$$ plain form
10744 594675 823592 494560 429783 746025 744654 1112658 915404 746642 1007085 495155
10734 495155 194908 608422 625380 866547 1281854 900227 1114654 1258600 597921 655708
10724 655708 799413 655348 1007827 895285 720167 1098762 980904 815605 1060224 598465
10714 598465 940238 1443869 1021289 971733 1018383 560168 579412 604734 240346 734039
10704 734039 940742 885462 1075685 1085786 1222488 1269687 742986 944093 713514 683390
10694 683390 759396 827791 376920 861077 935192 433692 1118168 969163 599895 1038731
10684 1038731 965472 524074 1046908 743577 427660 865108 736850 776430 1074655 947556
10674 947556 1026611 1225044 814386 789112 822608 516185 544341 583516 876956 763001
$$ packed form
10744E94675K28917l29032o4777L16242j371L68004j97254j68762K60443n11930
10734D95155l00247M13514J6958K41167M15307l81627K14427J43946o60679N7787
10724F55708J43705j44065L52479j12542j75118L78595j17858j65299K44619m61759
10714E98465L41773N03631m22580m9556M6650m58215J9244K5322l64388M93693
10704G34039K06703n5280J90223J0101J36702M7199n26701K01107k30579l0124
10694F83390P6006O8395m50871M84157P4115n01500O84476j49005l69268M38836
10684A038731p3259m41398N22834l03331l15917M37448j28258L9580K98225j27099
10674I47556P9055J98433m10658k5274L3496l06423K8156L9175K93440j13955
$$ plain form
10664 763001 207435 524665 973231 889441 939215 1144321 824677 1304822 1395563 673557
10654 673557 1151160 995286 376792 880636 1154356 494224 935738 981591 754777 1156407
10644 1156407 973568 644601 987754 795396 937698 1144183 861531 676618 723581 590473
10634 590473 544235 470509 523350 837621 307737 664022 952808 634206 679301 1197254
10624 1197254 524223 659796 945716 357622 607535 602754 392399 1085307 1603633 1040204
10614 1040204 1748034 1563499 928175 1004040 826950 506976 896127 997518 778593 879805
10604 879805 485902 692840 467964 589344 1025314 934453 1037049 1240080 599779 976324
10594 976324 1128747 440146 698119 1196423 837373 920042 1093897 462430 800337 864957
$$ packed form
10664G63001n55566L17230M48566q3790M9774K05106l19644M80145R0741p22006
10654F73557M77603j55874o18494N03844K73720o60132M41514M5853k26814M01630
10644A156407j82839l28967L43153j92358J42302K06485k82652j84913M6963j33108
10634E90473m6238p3726N2841L14271n29884L56285K88786l18602M5095N17953
10624A197254o73031J35573K85920n88094K49913m781k10355O92908N18326n63429
10614A040204P07830j84535o35324P5865j77090l19974L89151J01391k18925J01212
10604H79805l93903K06938k24876J21380M35970r0861J02596K03031o40301L76545
10594I76324J52423o88601K57973M98304l59050Q2669J73855o31467L37907O4620
$$ plain form
10584 864957 776660 1134459 1122987 923633 906715 899503 463696 514047 701595 475966 802628
10573 802628 787706 849809 1162462 1058046 787854 653538 402895 966337 1006847 901139
10563 901139 1175382 847958 666303 642426 648353 698636 1190124 1088878 1201743 1091607
10553 1091607 774049 1011046 1069392 762614 823747 841876 877236 1242064 882672 464045
10543 464045 721221 483038 159778 330938 237440 763520 838437 688969 873307 878358
10533 878358 616449 873337 809563 555803 688546 519946 400483 851840 593857 457601
10523 457601 755075 621163 1201101 1160812 776898 880658 915986 706988 871630 711127
10513 711127 702669 1071538 1148170 847135 874608 518582 657825 1106988 618675 681258
$$ packed form
10584H64957q8297L57799j1472j99354j6918p212m35807N0351J87548k25629L26662
10573H02628j4922O2103L12653j04416k70192j34316k50643N63442M0510j05708
10563I01139K74243l27424j81655k3877N927N0283M91488j01246J12865j10136
10553A091607l17558K36997N8346l06778O1133J8129L5360L64828l59392m18627
10543D64045K57176k38183l23260J71160r3498N26080P4917j49468J84338N051
10533H78358k61909K56888o3774k53760J32743j68600j19463M51357k57983j36256
10523D57601K97474j33912N79938m0289l83914J03760L5328k08998J64642j60503
10513G11127q458L68869P6632l01035K7473l56026J39243M49163m88313O2583
$$ plain form
10503 681258 841205 561863 437261 599328 589761 783863 849806 709344 779891 1026465
10493 1026465 1097857 901942 734679 1077438 1303087 1095458 1030817 1167428 1089274 1058409
10483 1058409 1065723 789418 892056 824198 730653 1020699 1266361 918831 1218484 988151
10473 988151 600688 1104008 1065646 915029 1279497 1044911 526716 667790 473860 400078
10463 400078 969291 1242933 1027015 1223600 1093549 1166027 1202076 1151362 813331 933958
10453 933958 1108307 902561 530672 772317 1166002 831684 1246428 1381039 1081286 1262116
10443 1262116 1316525 1090710 1157071 947787 652476 1156418 1008415 882377 1651373 1215878
10433 1215878 847710 1351923 1345804 995460 1182465 1054718 904809 1266293 979234 893557
$$ packed form
10503F81258J59947k79342j24602J62067r567J94102O5943j40462P0547K46574
10493A026465P1392j95915j67263L42759K25649k07629o4641J36611p8154l0865
10483A058409P314k76305J02638o7858r3545K90046K45662l47530K99653k30333
10473I88151l87463N03320l8362j50617L64468k34586n18195J41074j93930p3782
10463D00078N69213K73642k15918J96585j30051P2478L6049n0714l38031J20627
10453I33958J74349k05746l71889K41645L93685l34318M14744J34611k99753J80830
10443A262116N4409k25815O6361k09284k95311N03942j48003j26038P68996m35495
10433A215878l68168N04213o119l50344J87005j27747j49909L61484k87059q5677
$$ plain form
10423 893557 823107 649003 652302 884372 976877 1034405 1179984 1535308 1644479 1265650
10413 1265650 869641 398260 523847 1010338 1176379 1226088 1095091 1214045 1094645 1302282
10403 1302282 1273317 800494 1114790 1131852 1158182 955471 752209 73715 19400 545453
10393 545453 571878 977219 1233595 1051175 1162425 1227293 1065941 785499 769898 856807
10383 856807 839602 890443 763318 833476 844634 1098874 967204 1337443 1253532 1077750
10373 1077750 1379879 1266546 932249 629436 914875 660632 927044 1063038 1203342
10364 1203342 1115765 1012518 515347 670895 776968 644969 978988 1273861 1222484 788826
10354 788826 524348 403309 367409 585928 854348 1013425 1432268 1282509 922299 1012794
$$ packed form
10423H93557p0450j74104L299K32070R2505N7528J45579L55324J09171l78829
10413A265650l96009m71381J25587M86491J66041M9709j30997J18954j19400K07637
10403A302282k8965m72823L14296J7062K6330k02711k03262o78494n4315N26053
10393E45453K6425M05341K56376j82420J11250O4868j61352k80442j5601Q6909
10383H56807j7205N0841j27125P0158J1158K54240j31670L70239q3911j75782
10373A077750L02129j13333l34297l02813K85439k54243K66412J35994J40304
10364A203342q7577j03247m97171J55548J06073j31999L34019K94873n1377m33658
10354G88826k64478j21039l5900K18519K68420J59077M18843j49759l60210R0495
$$ plain form
10344 1012794 962926 826371 1034702 1270476 1413258 1390771 1055464 930292 926866 562308
10334 562308 802030 1245129 1328094 1265588 1349563 936168 788008 760122 515765 671751
10324 671751 972916 1064755 1251987 1404905 1186816 1009224 1131783 1207953 1079875 1089348
10314 1089348 1437418 1270027 950180 964430 666144 793342 1399744 1252311 1298696 1458179
10304 1458179 1044024 821390 942190 1187658 1055395 1145317 1029082 781067 879330 841301
10294 841301 785788 819627 965691 1127254 1139460 1122856 793931 933262 740024 812177
10284 812177 946634 1057486 951418 1118065 1169935 938401 1061010 1294768 1531709 1241387
10274 1241387 1263140 1313946 1167420 1051292 1239062 1375342 1515572 1398876 1536404 1394917
$$ packed form
10344A012794m9868j36555K08331K35774J42782k2487l35307j25172l426l64558
10334E62308K39722M43099Q2965o2506Q3975m13395j48160k7886k44357J55986
10324F71751L01165R1839J87232J52918k18089j77592J22559P6170j28078R473
10314A089348L48070j67391l19847J4250k98286J27198O06402j47433M6385J59483
10304A458179m14155k22634J20800K45468j32263Q9922j16235k48015R8263l8029
10294H41301n5513L3839J46064J61563J2206j6604l28925J39331j93238P2153
10284H12177J34457J10852j06068J66647N1870k31534J22609K33758K36941k90322
10274A241387K1753N0806j46526j16128J87770J36280J40230j16696J37528j41487
$$ plain form
10264 1394917 1351216 1271229 1582216 1418026 1160130 862496 741727 950573 1277989 1005315
10254 1005315 835118 1214048 1101129 982341 1236286 1331460 1105373 1214510 1195138 1191324
10244 1191324 1106021 856168 575550 1163256 1636414 1395687 1462220 1517538 1187972 1372487
10234 1372487 1556122 1054589 1010038 942069 987972 920979 949117 1059809 1204983 1340053
10224 1340053 967626 1200911 1110695 790092 916224 1021837 1170870 1085172 1098376 1416570
10214 1416570 1549340 1222771 1505938 1424854 1360864 1627926 1314877 1263903 1605218 1353732
10204 1353732 1021444 1252154 1085529 1249578 1602501 1379580 1382278 1462917 1076235 1075390
10194 1075390 1291913 1000265 844784 1217398 980483 681037 1078485 940119 887630 1388539
$$ packed form
10264A394917m3701p9987L10987j64190k57896k97634j20769K08846L27416k72674
10254A005315j70197L78930j12919j18788K53945R5174k26087J09137j9372l814
10244A191324q5303k49853k80618N87706M73158k40727O6533N5318l29566J84515
10234A372487J83635n01533m4551o7969M5903o6993K8138J10692J45174J35070
10224A340053l72427K33285r0216l20603J26132J05613J49033q5698J3204L18194
10214A416570J32770l26569K83167q1084o3990K67062l13049n0974L41315k51486
10204A353732l32288K30710j66625J64049L52923k22921K698Q0639l86682q45
10194A075390K16523k91648j55481L72614k36915k99446L97448j38366n2489N00909
$$ plain form
10184 1388539 1426275 1478127 1695524 1724493 1445112 1483137 1468920 1006459 936544 1152754
10174 1152754 808244 1020814 1375275 1433427 1408898 1860437 1521055 1139795 1536667 1491567
10164 1491567 1118728 1484448 1372749 845942 1110030 1079196 1055304 1638210 1552683 1456643
10154 1456643 1666050 1426926 1430231 1512397 1376965 1312743 1205789 1387597 1262556 1084328
10144 1084328 1328156 1431632 1158993 1548443 1820187 2041091 2272907 1912728 1566719
10135 1566719 1945330 1818598 1146118 1466079 1479586 1290698 1778076 1576072 1309403 1662057
10125 1662057 1674612 1511154 1745830 1889459 1293781 1357729 1068563 868766 768844 1209028
10115 1209028 1155544 1375092 1681906 1737453 1671666 1847085 1579250 1398153 1512664 1434861
$$ packed form
10184A388539L7736N1852K17397K8969k79381L8025j4217m62461o9915K16210
10174A152754l44510K12570L54461N8152k4529M51539l39382l81260L96872m5100
10164A491567l72839L65720j11699n26807K64088l0834k3892N82906q5527r6040
10154A456643K09407k39124L305Q2166j35432o4222j06954J81808j25041j78228
10144A084328K43828J03476k72639L89450K71744K20904K31816l60179l46009
10135A566719L78611j26732o72480L19961J3507j88888M87378k02004k66669L52654
10125A662057J2555j63458K34676J43629n95678O3948k89166j99797r9922M40184
10115A209028n3484K19548L06814N5547o5787J75419k67835j81097J14511p7803
$$ plain form
10105 1434861 1325802 1879646 2415036 1697771 1749219 1819339 1676177 1906878 2128112 1504292
10095 1504292 1525837 1228928 1056614 1474441 1335543 1255710 1287280 1422641 1398020 1792635
10085 1792635 1729192 1735023 2005901 2176834 2015379 1892478 1945003 1839589 1590842 1799980
10075 1799980 1800636 1557086 1851512 1986694 1943387 2266337 2279098 2037471 2465229 2186793
10065 2186793 1942418 2386305 2559777 2682828 2890907 2898668 2669409 2886977 3141602 2835004
10055 2835004 2528033 2397388 2307350 2279396 2487272 2512960 2289073 2180583 2128990 1768911
10045 1768911 2045722 2559904 2485430 2449874 2580133 1927457 2090692 2336789 1916079 1863364
10035 1863364 2161464 2184669 2592341 2492737 2359458 2486479 2445275 2652642 2683490 2834678
$$ packed form
10105A434861j09059N53844N35390p17265N1448P0120j43162K30701K21234o23820
10095A504292K1545k96909j72314M17827j38898p9833L1570J35361k4621L94615
10085A792635o3443N831K70878J70933j61455j22901N2525j05414k48747K09138
10075A799980O56k43550K94426J35182m3307L22950J2761k41627M27758k78436
10065B186793k44375M43887J73472J23051K08079P761k29259K17568K54625l06598
10055B835004l06971j30645r0038k7954K07876K5688k23887j08490n1593l60079
10045A768911K76811N14182p4474l5556J30259o52676J63235K46097m20710n2715
10035A863364K98100K3205M07672r9604j33279J27021m1204K07367L0848J51188
$$ plain form
10025 2834678 3335098 3375099 2841252 2671143 2488392 2489103 2671921 2523755 2414478 2709729
10015 2709729 2479898 2068423 2003956 1963972 1679774 2106190 2143849 2204814 2248811 2284162
10005 2284162 2035699 2024171 1848511 2099809 2329565 2709693 2972693 2354262 2118842 2096452
9995 2096452 1519119 1559183 2183467 1964064 2132988 2517299 1949817 1866404 2078137 1797065
9985 1797065 1947705 2232929 2077384 2158663 2100999 1808887 2025764 1974322 1742863 1709275
9975 1709275 1725507 2182074 2445485 2386090 2523817 2103749 1892540 2298692 2188353 2104470
9965 2104470 2501856 2181624 1985361 2133261 1867623 2137130 2866512 2722523 2771694 2725957
9955 2725957 2477086 2497524 2487977 2217270 2150490 2312573 2328759 2328225 2311374 2098933 2333821
$$ packed form
10025B834678N00420M0001n33847j70109j82751P11J82818j48166j09277K95251
10015B709729k29831m11475o4467l9984k84198M26416L7659O0965M3997L5351
10005B284162k48463j1528j75660K51298K29756L80128K63000o18431k35420k2390
9995B096452n77333M0064O24284k19403J68924L84311n67482q3413K11733k81072
9985A797065J50640K85224j55545Q1279n7664k92112K16877n1442k31459l3588
9975A709275J6232M56567K63411n9395J37727m20068k11209M06152j10339q3883
9965B104470L97386l20232j96263J47900k65638K69507P29382j43989M9171m5737
9955B725957k48871K0438r547k70707o6780J62083J6186n34j6851k12441K34888
$$ plain form
9944 2333821 2546908 2564498 2577871 2358319 2249929 2063491 1735252 2238931 2475423 2140911
9934 2140911 2468998 2678333 2617295 2914806 2673078 2689616 2976761 2875855 2672699 2839662
9924 2839662 2706902 2830733 2795519 2504635 2368932 2529256 2720903 2878876 3005839 2946615
9914 2946615 2775689 2757730 2715116 2630061 2416465 2558314 2543195 2501659 2952716 2848502
9904 2848502 2816989 2859102 2621748 2645338 2900933 3088613 3043911 3242772 3151323 2946249
9894 2946249 3034449 3109159 3149542 3087916 3326581 3197757 3462633 3627250 3337410 3231352
9884 3231352 2913734 2927655 2788063 2682474 2625885 2702739 2609492 2739207 2903165 2959960
9874 2959960 3087915 2903748 2798743 3166751 3225867 3133701 3424904 3311229 3409169 3324018
$$ packed form
9944B333821K13087J7590J3373k19552j08390j86438l28239N03679K36492l34512
9934B140911L28087K09335o1038K97511k41728J6538K87145j00906k03156J66963
9924B839662j32760J23831l5214k90884j35703J60324J91647J57973J26963n9224
9914B946615j70926j7959m2614q5055k13596J41849j5119m1536M51057j04214
9904B848502l1513M2113k37354K3590K55595J87680m4702J98861r1449k05074
9894B946249Q8200P4710M0383o1626K38665j28824K64876J64617k89840j06058
9884C231352l17618J3921j39592j05589n6589P6854r3247J29715J63958N6795
9874B959960J27955j84167j05005L68008N9116r2166K91203j13675R7940q5151
$$ plain form
9864 3324018 3575718 3623072 3661703 3695579 3773938 3764556 3946860 3658726 3745327 3874034 3446847
9853 3446847 3467793 3811701 3625782 3804677 3879197 3856242 3719824 3605101 3323731 3337800
9843 3337800 3593313 3680784 3676837 4034528 3741980 3430984 3658666 3845505 3923162 3964009
9833 3964009 4350599 4395516 4075023 4094760 3748607 3855359 4324384 4260527 4384093 4891791
9823 4891791 4770704 4454633 4696357 4476886 4518182 4897240 5068286 5279852 5172780 5010816
9813 5010816 4942648 4925229 5014546 4963450 5169394 5359501 5105253 5145174 5227113 5399607 5254684
9802 5254684 5317245 5475673 5556081 5590634 5620758 5892558 6092929 5948654 5892935 6457775
9792 6457775 6610736 6613525 6951441 6905553 6405356 6469958 6384283 6703407 7188997 7092074 6853573
$$ packed form
9864C324018K51700M7354L8631L3876P8359r382J82304k88134Q6601J28707m27187
9853C446847K0946L43908j85919J78895P4520k2955j36418j14723k81370J4069
9843C337800K55513Q7471l947L57691k92548l10996K27682J86839P7657M0847
9833C964009L86590M4917l20493J9737l46153J06752M69025o3857J23566N07698
9823D891791j21087l16071K41724k19471M1296L79058J71046K11566j07072j61964
9813E010816o8168j7419Q9317n1096K05944J90107k54248L9921Q1939J72494j44923
9802E254684O2561J58428Q0408L4553L0124K71800K00371j44275n5719N64840
9792F457775J52961K789L37916m5888n00197O4602q5675L19124M85590r6923k38501
$$ plain form
9781 6853573 7194969 7120010 7256628 7426895 7426231 7696655 8105554 7841243 8052394 8420814
9771 8420814 8233611 8168272 8450593 8287057 8576017 9028246 9149175 9342529 9321123 9231011
9761 9231011 9363560 9346224 9617696 10227448 10236306 10729361 10923530 10688015 11245879 11376573
9751 11376573 11563521 11964413 12260724 12125433 12560965 12529678 12382345 12793614 13294487 13557181
9741 13557181 13966569 14289211 14467800 15048714 15564724 16237122 16426899 16584474 17207947
9732 17207947 17675444 18270252 18910490 19700078 20460767 21322252 22323145 23629343 24655917
9723 24655917 25779210 27456438 28649059 29647578 31306377 33164512 34987233 37309031
9715 37309031 39435994 42083476 45628865 49643058 54410285 60836583 69194409 79270720
$$ packed form
9781F853573L41396p4959J36618J70267o64K70424M08899k64311K11151L68420
9771H420814j87203o5339K82321j63536K88960M52229J20929J93354k1406r0112
9761I231011J32549j7336K71472O09752Q858M93055J94169k35515N57864J30694
9751A1376573J86948M00892K96311j35291M35532l1287j47333M11269N00873K62694
9741A3557181M09388L22642J78589N80914N16010O72398J89777J57575O23473
9732A7207947M67497N94808O40238P89588P60689Q61485J000893J306198J026574
9723B4655917J123293J677228J192621R98519J658799J858135J822721K321798
9715C7309031K126963K647482L545389M014193M767227O426298Q357826J0076311
$$ plain form
9707 79270720 92229948 107246178 123054811 139298645 154342384 168267091 180701670
9700 180701670 190072422 194592079 194586029 190559532 182314514 169860038 154427086 137544339
9692 137544339 121339678 106776344 93901410 83099255 75252602 69189164 64742871
9685 64742871 61713349 59597038 58139397 57837239 58153282 58600355 60328882 63036019 65850556
9676 65850556 70516256 77081406 85155674 96160830 110153631 125781141 141781281 157804569
9668 157804569 172167552 184785687 195293234 202174519 204936070 203289576 197651635 187445785
9660 187445785 172820936 155632347 137033986 118808127 102028489 86956138 74354207
9653 74354207 64480680 56794162 50470988 45224310 41225145 38219837 35496538 32974428
$$ packed form
9707G9270720J2959228J5016230J5808633J6243834J5043739J3924707J2434579
9700A80701670R370752M519657o050m026497q245018j2454476j5432952j6882747
9692A37544339j6204661j4563334j2874934j0802155p846653o063438m446293
9685F4742871l029522k116311j457641l02158L16043M47073J728527K707137K814537
9676F5850556M665700O565150Q074268J1005156J3992801J5627510J6000140J6023288
9668A57804569J4362983J2618135J0507547O881285K761551j646494n637941j0205850
9660A87445785j4624849j7188589j8598361j8225859j6779638j5072351j2601931
9653G4354207r873527p686518o323174n246678l999165l005308k723299k522110
$$ plain form
9645 32974428 30721042 29036478 27435053 25656857 24422712 22918638 21545480 20751617
9637 20751617 19880496 19208473 18330826 17722544 16865202 16405894 15675859 15055205 14767357
9628 14767357 14698565 14142804 13557167 13039649 12565612 12341291 12142508 12031038 11706443 11577020
9618 11577020 11435517 10732262 10210215 9781444 8853667 8571889 8636207 8585919 8639919 8683471
9608 8683471 8134852 7889902 7849678 7728997 7828170 7561734 7474491 7810537 7286962 6845384
9598 6845384 6718690 6391848 5998849 6087711 6222312 6300794 6148816 5906547 5636577 5113390
9588 5113390 4934512 5119413 5168364 5046795 5304709 5038620 4857948 5242075 4801103 4659476
9578 4659476 5066673 4980603 4765496 4755740 4321111 4121017 3868701 3499569 3207539 3511097
$$ packed form
9645C2974428k253386j684564j601425j778196j234145j504074j373158p93863
9637B0751617q71121o72023q77647o08282q57342m59308p30035o20654k87848
9628A4767357o8792n55761n85637n17518m74037k24321j98783j11470l24595j29423
9618A1577020j41503p03255n22047m28771r27777k81778O4318n0288N4000M3552
9608H683471n48619k44950m0224j20681R9173k66436q7243L36046n23575m41578
9598F845384j26694l26842l92999Q8862J34601P8482j51978k42269k69970n23187
9588E113390j78878J84901M8951j21569K57914k66089j80672L84127m40972j41627
9578D659476M07197q6070k15107r756m34629k00094k52316l69132k92030L03558
$$ plain form
9568 3511097 3458604 3689764 4034478 3765124 3706933 3401544 3368101 3436010 3556184 3932578
9558 3932578 3913639 3447363 3282498 3139770 3041926 3269498 3520710 3356950 3623199 3583782
9548 3583782 3171254 3358561 3493835 2966252 2868652 3287702 3021682 3144870 3395042 2753112
9538 2753112 2947927 3333673 3107672 3248647 3352019 3305021 3008224 2871279 2580537 2502762
9528 2502762 2559670 2980226 2811599 2978349 3093091 3221460 2783418 2650002 2243042 2214675
9518 2214675 2795499 2646442 2741261 2939887 2607959 2426366 2845138 2513365 2407143 2869033
9508 2869033 3099493 2922562 2808982 2524340 2072710 2057835 2156643 2085684 2461803 2608621
9498 2608621 2405569 2453564 2496477 2301629 2480705 2773314 2446071 2081594 2336090 2564021
$$ packed form
9568C511097n2493K31160L44714k69354n8191l05389l3443O7909J20174L76394
9558C932578j8939m66276j64865j42728r7844K27572K51212j63760K66249l9417
9548C583782m12528J87307J35274n27583r7600M19050k66020J23188K50172o41930
9538B753112J94815L85746k26001J40975J03372m6998k96797j36945k90742p7775
9528B502762N6908M20556j68627J66750J14742J28369m38042j33416m06960k8367
9518B214675N80824j49057R4819J98626l31928j81593M18772l31773j06222M61890
9508B869033K30460j76931j13580k84642m51630j4875R8808p0959L76119J46818
9498B608621k03052M7995M2913j94848J79076K92609l27243l64477K54496K27931
$$ plain form
9488 2564021 2352741 2139739 2348566 2392481 2671192 2681171 2585494 2877194 2865637 2427896
9478 2427896 2312382 2369714 2072611 2142602 2382605 2069712 2206531 2399004 2372668 2615618
9468 2615618 2751356 2536494 2748970 2745636 2377503 2393528 2492098 2159202 2104732 2416659
9458 2416659 2431424 2486655 2539884 2541888 2297116 2198966 2410491 2605910 2334969 2333248 2125090
9447 2125090 2132312 2410051 2344219 2478752 2642568 2514489 2707996 3069288 2514040 2684008
9437 2684008 2955373 2862168 2795554 2920961 2635283 2866291 3022566 2882686 2897220 3364303
9427 3364303 3053359 3206527 3414942 3176570 3074052 2578230 2476596 2575417 2603768 2687963
9417 2687963 2711042 2379714 2472005 2726380 2625646 2826027 2784542 2633197 3004111 3031236
$$ packed form
9488B564021k11280k13002K08827M3915K78711R979r5677K91700j1557m37741
9478B427896j15514N7332k97103O9991K40003l12893J36819J92473k6336K42950
9468B615618J35738k14862K12476l334l68133J6025R8570l32896n4470L11927
9458B416659J4765N5231N3229K004k44772r8150K11525J95419k70941j721k08158
9447B125090P222K77739o5832J34533J63816j28079J93507L61292n55248J69968
9437B684008K71365r3205o6614J25407k85678K31008J56275j39880J4534M67083
9427C364303l10944J53168K08415k38372j02518m95822j01634R8821K8351Q4195
9417B687963K3079l31328R2291K54375j00734K00381m1485j51345L70914K7125
$$ plain form
9407 3031236 2569801 2819758 2498134 2273164 2862756 2856511 2646803 2975882 3098689 2862728
9397 2862728 3166713 3162591 3360335 3680114 3214838 2995992 2907190 2901193 2990678 2593214 2594893
9386 2594893 3214696 3322841 2812456 2843486 2742757 2795639 2910385 2895328 2981714 3115009
9376 3115009 2797647 2636268 2716611 2771946 2737286 2999105 3117016 3156561 3198109 3488970
9366 3488970 3701840 3487479 3154646 3130668 3004960 3101711 3339101 3113048 3124683 3080241
9356 3080241 2713396 2934567 3098641 2973903 3278052 3452389 3252842 3420899 3205598 3147733
9346 3147733 3245858 3383667 3630160 3966702 4315711 4590686 4612656 4676467 4372321 4606689
9336 4606689 4665996 4800138 4951915 4991402 4844543 4952975 4742865 4478065 4759875 4677073
$$ packed form
9407C031236m61435K49957l21624k24970N89592o245k09708L29079J22807k35961
9397B862728L03985m122J97744L19779m65276k18846q8802n997Q9485l97464J679
9386B594893O19803J08145n10385L1030j00729N2882J14746j5057Q6386J33295
9376C115009l17362j61379Q0343N5335l4660K61819J17911L9545M1548K90861
9366C488970K12870k14361l32833k3978j25708R6751K37390k26053J1635m4442
9356C080241l66845K21171J64074j24738L04149J74337j99547J68057k15301n7865
9346C147733R8125J37809K46493L36542L49009K74975K1970O3811l04146K34368
9336D606689N9307J34142J51777L9487j46859J08432k10110k64800K81810q2802
$$ plain form
9326 4677073 4654826 4661192 4458108 4338382 4282038 4289604 4288435 3973595 4028302 4284107 4308370
9315 4308370 4255736 4639516 4562397 4876908 5095725 5102146 5184624 5497245 5607799 5840273
9305 5840273 5923371 5444058 5522810 5738033 5933224 6247739 6211506 6034357 5965593 5908463
9295 5908463 5926078 5892498 5721574 5893412 5836144 5735881 5659991 5726652 5568107 5633783 5568023
9284 5568023 5319193 5128435 5201956 5708294 5720750 5904010 5820852 5861545 5768980 5192110
9274 5192110 5371265 5700198 5561605 5389670 5411841 5183595 5302705 5398422 5204672 5218749
9264 5218749 5351789 5351687 5234402 5247145 5200395 5340834 5228106 5198823 5020278 4945394 5367273
9253 5367273 5493781 5513843 5513785 5480420 5236407 5433898 5449466 5734917 5933003 5672183 5747123
$$ packed form
9326D677073k2247O366k03084j19726n6344P566j169l14840N4707K55805K4263
9315D308370n2634L83780p7119L14511K18817O421Q2478L12621J10554K32474
9305E840273Q3098m79313P8752K15223J95191L14515l6233j77149o8764n7130
9295E908463J7615l3580j70924J71838n7268j00263p5890O6661j58545O5676o5760
9284E568023k48830j90758P3521N06338J2456J83260q3158M0693r2565n76870
9274E192110J79155L28933j38593j71935K2171k28246J19110R5717j93750J4077
9264E218749J33040j02j17285J2743m6750J40439j12728k9283j78545p4884M21879
9253E367273J26508K0062n8l3365k44013J97491J5568K85451J98086k60820P4940
$$ plain form
9242 5747123 6343009 6423867 6436837 6387718 6186448 6113125 5948957 5620830 5743494 6120325
9232 6120325 6375457 6456702 6579440 6338223 6145759 6351623 6439763 6120672 6102520 6099327
9222 6099327 6154214 6295843 6222920 6445661 6620297 6644051 6707441 6839729 6884102 6897424 6948209
9211 6948209 6791936 7009394 6932901 7100085 7076435 6776326 7047926 7228625 7625123 7886592
9201 7886592 7980267 7649886 7821792 7537152 7586609 7825251 7757080 7795588 8151120 8015586
9191 8015586 7641791 8357430 8569925 8446067 8607720 8800944 8999970 8919270 8837823 8859303
9181 8859303 8948527 9071805 9055952 9033919 9517129 9792221 9597319 9684818 9806207 9835630
9171 9835630 10403594 10532468 10349047 10592233 10759057 10525749 11039820 11115643 11008602 11597425
$$ packed form
9242E747123N95886Q0858J2970m9119k01270p3323j64168l28127J22664L76831
9232F120325K55132Q1245J22738k41217j92464K05864Q8140l19091j8152l193
9222F099327N4887J41629p2923K22741J74636K3754O3390J32288M4373J3322N0785
9211F948209j56273K17458p6493J67184k3650l00109K71600J80699L96498K61469
9201G886592R3675l30381J71906k84640M9457K38642o8171L8508L55532j35534
9191H015586l73795P15639K12495j23858J61653J93224J99026q0700q1447K1480
9181H859303Q9224J23278j5853k2033M83210K75092j94902Q7499J21389K9423
9171I835630N67964J28874j83421K43186J66824k33308N14071P5823j07041N88823
$$ plain form
9161 11597425 11716211 11893737 12462357 12109862 11818619 11984968 12133181 12238831 12551212
9152 12551212 12805049 12700347 12909270 13208323 13249092 13647668 14163580 14644883 14681274 14614231
9142 14614231 14611376 14800372 15187485 15447224 15595560 16667796 17247597 17482934 18068006 18608681
9132 18608681 18994290 19817977 20404460 20824796 21685820 22229615 22412748 23159337 24127596
9123 24127596 24888646 26189675 27561856 29000817 31105697 33327472 35614845 38981442
9115 38981442 42859462 47920730 53804233 59897338 65059975 68768355 72011885 74599517
9107 74599517 76283471 77440563 76361300 73742861 70585381 66995312 62363776 58330202
9099 58330202 54858936 51605316 49594725 48647976 47911741 47859321 48209619 48822288 49635823
$$ packed form
9161A1597425J18786J77526N68620l52495k91243J66349J48213J05650L12381
9152A2551212K53837j04702K08923K99053M0769L98576N15912M81303L6391o7043
9142A4614231k855J88996L87113K59739J48336J072236N79801K35337N85072N40675
9132A8608681L85609Q23687N86483M20336Q61024N43795J83133P46589R68259
9123B4127596P61050J301029J372181J438961K104880K221775K287373L366597
9115C8981442L878020N061268N883503O093105N162637L708380L243530K587632
9107G4599517J683954J157092j079263k618439l157480l590069m631536m033574
9099E8330202l471266l253620k010591r46749p36235n2420L50298O12669Q13535
$$ plain form
9090 49635823 50730235 52541830 54814688 57744662 61706616 66710981 73067662 80741568
9082 80741568 89993554 100231984 109698667 118072449 126818889 136135389 146153745 157162856
9074 157162856 166194417 170359728 171756281 170657659 167931265 164160303 157426611 147925840
9066 147925840 137236984 125929832 114560930 104302426 95095532 87461203 81671476
9059 81671476 77621177 74612248 72205563 70588945 69602348 69264031 69792124 70687116 72631028
9050 72631028 75171089 79424181 85057021 92553025 102690818 115151071 129775585 144337172
9042 144337172 155673151 163837749 169259806 172466307 174570895 173657053 167984232 158568153
9034 158568153 146896299 133346523 119233764 106018528 93620183 83335702 75125423
$$ packed form
9090D9635823J094412J811595K272858K929974L961954N004365O356681P673906
9082H0741568R251986J0238430R466683Q373782Q746440R316500J0018356J1009111
9074A57162856R031561M165311J396553j098622k726394l770962o733692r500771
9066A47925840j0688856j1307152j1368902j0258504r206894p634329n789727
9059H1671476m050299l008929k406685j616618r86597l38317N28093Q94992J943912
9050G2631028K540061M253092N632840P496004J0137793J2460253J4624514J4561587
9042A44337172J1335979Q164598N422057L206501K104588r13842n672821r416079
9034A58568153j1671854j3549776j4112759j3215236j2398345j0284481q210279
$$ plain form
9027 75125423 67967266 62930755 58926501 55770395 53306151 51015718 49321190 47944225
9019 47944225 46632861 45361584 44444393 43614862 42874486 42114937 41423243 41043930 40670036
9010 40670036 40583484 41126787 41435934 41230565 41542531 41469179 41592352 42315656 42597053 42916939
9000 42916939 43687646 44319648 45357066 46521068 47286876 48681391 50022855 51022992 52229212
8991 52229212 54003207 55736589 57978958 60369234 62960767 66280755 69251968 72340159
8983 72340159 76411072 81277214 86794586 92564789 98888375 106799184 116119129 127036209
8975 127036209 140446004 156281983 173969893 193848187 215143406 237255970 258497278
8968 258497278 276746655 289346736 295825851 296272221 290026803 278152201 261848740 243181026
$$ packed form
9027G5125423p158157n036511m004254l156106k464244k290433j694528j376965
9019D7944225j311364j271277r17191q29531p40376p59549o91694l79313l73894
9010D0670036q6552N43303L09147k05369L11966p3352J23173P23304K81397L19886
9000D2916939P70707O32002J037418J164002P65808J394515J341464J000137J206220
8991E2229212J773995J733382K242369K390276K591533L319988K971213L088191
8983G2340159M070913M866142N517372N770203O323586P910809R319945J0917080
8975A27036209J3409795J5835979J7687910J9878294K1295219K2112564K1241308
8968B58497278J8249377J2600081O479115M46370o245418j1874602j6303461j8667714
$$ plain form
8960 243181026 223830428 206358193 191782923 180098220 172915264 170516403 172425940
8953 172425940 178826788 189513100 201854195 213320399 221921601 226782299 228483500 227886137
8945 227886137 224929806 218775312 211194168 203143965 195285981 188874153 184598288 182809412
8937 182809412 184306087 188986208 195724198 202993902 210775875 218363029 224459848 228060051
8929 228060051 229258872 229201175 228575156 227520980 227823326 231045719 235702210 238956424 242518661
8920 242518661 247890074 255944938 265845431 276117718 286242128 294382694 298105670 295981322
8912 295981322 288775774 276076075 258185254 236300694 213183103 190212016 168722510
8905 168722510 149806912 133750134 120584231 110176279 101851979 95594675 90956678
$$ packed form
8960B43181026j9350598j7472235j4575270j1684703p182956k398861J909537
8953A72425940O400848J0686312J2341095J1466204Q601202M860698J701201n97363
8945B27886137k956331o154494p581144q050203p857984o411828m275865j788876
8937A82809412J496675M680121O737990P269704P781973P587154O096819L600203
8929B28060051J198821n7697o26019j054176L02346L222393M656491L254214L562237
8920B42518661N371413Q054864R900493J0272287J0124410Q140566L722976k124348
8912B95981322p205548j2699699j7890821k1884560k3117591k2971087k1489506
8905A68722510j8915598j6056778j3165903j0407952q324300o257304m637997
$$ plain form
8898 90956678 87684534 85343851 84262524 83882102 84240803 86043675 88588290 92165588
8890 92165588 97471946 104058331 113192042 124698390 137066032 150765647 164402812 174755519
8882 174755519 181975919 185692656 185858610 182456751 174240471 162108478 147598653 132240144
8874 132240144 117025422 102703896 90625796 81086955 73189608 66974405 62775621 59228914
8866 59228914 56214297 54723543 53231916 52228720 51972638 51224430 50785414 50669163 50384590
8857 50384590 50105265 50360706 50522651 50619749 51627997 52171166 52894064 53307915 53207979 52805071
8847 52805071 51773672 49833391 47646217 44939216 42297666 39116865 35638716 32693237
8839 32693237 29889298 27460415 25618823 23754781 22001704 20993624 20087493 19372409
$$ packed form
8898I0956678l272144k340683j081327l80422L58701J802872K544615L577298
8890I2165588N306358O586385R133711J1506348J2367642J3699615J3637165J0352707
8882A74755519P220400L716737J65954l401859q216280j2131993j4509825j5358509
8874A32240144j5214722j4321526j2078100r538841p897347o215203m198784l546707
8866E9228914l014617j490754j491627j003196k56082p48208m39016j16251k84573
8857E0384590k79325K55441J61945R7098J008248N43169P22898M13851r9936m02908
8847E2805071j031399j940281k187174k707001k641550l180801l478149k945479
8839C2693237k803939k428883j841592j864042j753077j008080r06131p15084
$$ plain form
8831 19372409 18810670 18552023 18357699 18130909 17515977 17156554 16623908 16082575 15651696
8822 15651696 15247817 14813030 14415264 14232538 13753250 14043924 13723236 13040199 12926818
8813 12926818 12630696 11721320 11333910 11016366 10147881 9932377 9590769 9161271 8819779
8804 8819779 8642765 8302658 7526925 7025478 6907365 6493663 6276305 6348541 6157927 5999813
8794 5999813 5860960 5279337 5245826 5313287 4672179 4778500 5212773 4680096 4606100 4447128
8784 4447128 3830233 3755949 3678855 3472713 3797087 3791207 3468198 3662615 3381523 2995719
8774 2995719 3071127 2936580 2944853 3008315 2865529 2711357 2440467 2224082 2014770 2114210
8764 2114210 2127373 2242951 2100999 2361920 2645165 2093848 1867349 1737715 1407092 1897895
$$ packed form
8831A9372409n61739k58647j94324k26790o14932l59423n32646n41333m30879
8822A5651696m03879m34787l97766j82726m79288K90674l20688o83037j13381
8813A2926818k96122r09376l87410l17544q68485k15504l41608m29498l41492
8804H819779j77014l40107p75733n01447j18113m13702k17358P2236j90614j58114
8794E999813j38853n81623l3511O7461o41108J06321M34273n32677p3996j58972
8784D447128o16895p4284p7094k06142L24374n880l23009J94417k81092l85804
8774B995719P5408j34547Q273O3462j42786j54172k70890k16385k09312R9440
8764B114210J3163J15578j41952K60921K83245n51317k26499j29634l30623M90803
$$ plain form
8754 1897895 2290965 2014299 1994410 1976090 1521852 1392049 1943421 1680129 2053079 2289205
8744 2289205 2108567 1869281 1683434 1336878 1162564 1460182 1606187 1719123 1835631 1764202
8734 1764202 1324242 1154408 1252480 1003434 1067005 1281391 1021865 997187 858907 614010
8724 614010 778539 971093 826970 1114938 1652810 1401078 1171927 953976 753682 817215
8714 817215 1273955 1383480 1276746 1713246 1726917 1644000 1582349 1365819 1420116 1820589
8704 1820589 1828674 1672422 1613109 1452003 1231882 697191 598720 466727 686464 1100889
8694 1100889 796121 841795 626874 126891 -195510 -104756 -373631 -485614 -207018 -3946
8684 -3946 -294531 -96218 -262482 -407473 -196886 22204 202094 321404 85226 -218406
$$ packed form
8754A897895L93070k76666j9889j8320m54238j29803N51372k63292L72950K36126
8744B289205j80638k39286j85847l46556j74314K97618J46005J12936J16508p1429
8734A764202m39960j69834R8072k49046O3571K14386k59526k4678j38280k44897
8724F14010J64529J92554j44123K87968N37872k51732k29151k17951k00294O3533
8714H17215M56740J09525j06734M36500J3671q2917o1651k16530N4297M00473
8704A820589Q085j56252n9313j61106k20121n34691r8471j31993K19737M14425
8694A100889l04768M5674k14921m99983l22401R0754k68875j11983K78596K03072
8684c946k90585J98313j66264j44991K10587K19090J79890J19310k36178l03632
$$ plain form
8674 -218406 -292233 -448952 -549366 -307348 -66331 -344629 -87416 -147263 -604077 -574662
8664 -574662 -543444 -897783 -960974 -735657 -1160178 -859340 -1063689 -1549581 -1260265 -1053846
8654 -1053846 -1224068 -756581 -413186 -716860 -618869 -627628 -1012523 -1229812 -1095567 -1410158
8644 -1410158 -1051864 -781789 -633800 -718857 -716178 -794060 -768565 -780348 -534917 -697197 -621512
8633 -621512 -532057 -1314463 -1397249 -1212700 -1154001 -1132810 -694897 -788369 -619625 -329909 -945382
8622 -945382 -1241869 -762002 -925000 -1244943 -717197 -836608 -1004701 -745003 -540982 -701009
8612 -701009 -616175 -417072 -28108 333106 256782 115869 -109884 -335714 -172813 -124443
8602 -124443 -150065 -452016 -405746 -75839 -266955 -376018 -394884 -556267 -851082 -418326
$$ packed form
8674b18406p3827j56719j00414K42018K41017k78298K57213n9847m56814K9415
8664e74662L1218l54339o3191K25317m24521L00838k04349m85892K89316K06419
8654a053846j70222M67487L43395l03674R7991q759l84895k17289J34245l14591
8644a410158L58294K70075J47989q5057K679p7882K5495j1783K45431j62280P5685
8633f21512Q9455p82406q2786J84549N8699K1191M37913r3472J68744K89716o15473
8622i45382k96487M79867j62998l19943N27746j19411j68093K59698K04021j60027
8612g01009Q4834J99103L88964L61214p6324j40913k25753k25830J62901M8370
8602a24443k5622l01951M6270L29907j91116j09063j8866j61383k94815M32756
$$ plain form
8592 -418326 -606295 -1001184 -600109 -882416 -1000926 -621158 -520136 -671328 -131742 329808
8582 329808 44515 449718 238659 -151565 -179124 -555080 -673837 -305238 -235393 -441920
8572 -441920 30843 141101 177751 468871 150304 104089 171258 -59310 -194973 -274462
8562 -274462 -238211 -494319 -730093 -461005 -176161 -211387 -1376 67245 65485 472474 353466
8551 353466 -104868 -140129 -76566 -219817 29377 -75439 -173799 151779 9881 -416564
8541 -416564 -484849 -331553 -623927 -177323 87941 -265113 -573099 -980809 -900869 -573830
8531 -573830 -709573 -531600 -355141 -423270 -268681 -350492 -434158 -404001 -472437 -665267 -552851
8520 -552851 -774077 -698605 -320503 -312614 -436721 -137006 -191811 -10600 55193 -477118 -423094
$$ packed form
8592d18326j87969l94889M01075k82307j18510L79768J01022j51192N39586M61550
8582C29808k85293M05203k11059l90224k7559l75956j18757L68599O9845k06527
8572d41920M72763J10258L6650K91120l18567m6215O7169k30568j35663p9489
8562b74462L6251k56108k35774K69088K84844l5226K10011O8621j760M06989j19008
8551C53466m58334l5261O3563j43251K49194j04816r8360L25578j41898m26445
8541d16564o8285J53296k92374M46604K65264l53054l07986m07710P9940L27039
8531e73830j35743J77973J76459o8129J54589q1811q3666L0157o8436j92830J12416
8520e52851k21226P5472L78102P889j24107K99715n4805J81211O5793n32311N4024
$$ plain form
8509 -423094 -424100 -591056 -481132 -727051 -942536 -800693 -792653 -650306 -696883 -830730 -670302
8498 -670302 -467678 -888501 -804369 -711586 -1193273 -1046212 -1241973 -1506202 -1020765 -942318
8488 -942318 -881877 -639168 -774218 -844145 -765739 -873582 -955411 -895558 -896082 -1046099 -1160933
8477 -1160933 -1376411 -1248317 -1166951 -941731 -594063 -699219 -761209 -713013 -791549 -970105
8467 -970105 -973363 -1514343 -1354569 -912592 -1193379 -1356097 -923076 -776762 -757844 -756225 -1116197
8456 -1116197 -942164 -940922 -1004508 -965160 -942523 -1263461 -1418304 -1345866 -1367021 -1010262 -939374
8445 -939374 -664740 -429115 -152143 -70860 -657387 -1177246 -1084925 -1230467 -1504713 -1041716
8435 -1041716 -975412 -894406 -604499 -709095 -753256 -495755 -721036 -833003 -658922 -1017660
$$ packed form
8509d23094j006j66956J09924k45919k15485J41843Q040J42347m6577j33847J60428
8498f70302K02624m20823Q4132R2783m81687J47061j95761k64229M85437P8447
8488i42318O0441K42709j35050o9927P8406j07843q1829N9853n24j50017j14834
8477a160933k15478J28094Q1366K25220L47668j05156o1990M8196p8536j78556
8467i70105l258n40980J59774M41977k80787j62718M33021J46314J8918J619l59972
8456a116197J74033J242o3586L9348K2637l20938j54843P2438k1155L56759P0888
8445i39374K74634K35625K76972Q1283n86527n19859R2321j45542k74246M62997
8435a041716O6304Q1006K89907j04596m4161K57501k25281j11967J74081l58738
$$ plain form
8425 -1017660 -1121941 -885427 -1435632 -1659109 -1192012 -1225305 -876781 -466475 -714410 -701706
8415 -701706 -758710 -882245 -988742 -1078951 -934475 -1362484 -1625987 -1305178 -1375008 -1388063
8405 -1388063 -1081465 -1047223 -1009478 -750916 -841799 -1169541 -702752 -1148629 -1050079 -993941
8395 -993941 -1301316 -1513774 -1405091 -1357236 -1280762 -976527 -944789 -772543 -753012 -912787
8385 -912787 -1291587 -1342281 -1472795 -1286723 -1385064 -1073517 -947783 -1116220 -970719 -786502
8375 -786502 -1023511 -740011 -627892 -890092 -881584 -1024875 -1124321 -1127824 -1090235 -1171904 -885339
8364 -885339 -811595 -716622 -488432 -599214 -667260 -782624 -651252 -618499 -1045019 -1179359
8354 -1179359 -1005161 -1007363 -1054383 -909076 -618510 -731304 -563512 -768756 -1029146 -809048
$$ packed form
8425a017660j04281K36514n50205k23477M67097l3293L48524M10306k47935J2704
8415g01706n7004j23535j06497r0209J44476m28009k63503L20809o9830j3055
8405a388063L06598L4242L7745K58562r0883l27742M66789m45877R8550N6138
8395i93941l07375k12458J08683M7855P6474L04235L1738J72246J9531j59775
8385i12787l78800n0694j30514J86072r8341L11547J25734j68437J45501J84217
8375g86502k37009K83500J12119k62200Q508j43291r9446l503L7589q1669K86565
8364h85339P3744R4973K28190j10782o8046j15364J31372L2753m26520j34340
8354a179359J74198k202m7020J45307K90566j12794J67792k05244k60390K20098
$$ plain form
8344 -809048 -690791 -774008 -743830 -1186688 -1102989 -1114043 -1120643 -1043942 -873476 -432108 -44469
8333 -44469 -79750 -112473 -152189 -752158 -506092 -610402 -1063752 -1042479 -885671 -1447519 -1082531
8322 -1082531 -914233 -1152155 -804439 -712323 -661951 -328381 -801158 -926020 -804329 -730529
8312 -730529 -1109385 -1374408 -1448625 -1020603 -800303 -979663 -533699 -338827 -146418 -353527
8302 -353527 -389867 -496832 -752307 -1208355 -1162888 -887066 -1043836 -437325 -159761 -748075
8292 -748075 -360397 -263541 -674439 -630437 -770034 -1088007 -984795 -1085219 -1527043 -1620951
8282 -1620951 -1337621 -1105167 -871877 -551606 -525618 -369944 71829 -166878 -759963 -823585
8272 -823585 -1211370 -1360131 -963488 -1082693 -1264809 -755598 -546837 -1029270 -256634 -105573
$$ packed form
8344h09048J18257q3217L0178m42858Q3699j1054o600P6701J70466M41368L87639
8333d4469l5281l2723l9716n99969K46066j04310m53350K1273J56808n61848L64988
8322a082531J68298k37922L47716R2116N0372L33570m72777j24862J21691P3800
8312g30529l78856k65023p4217M28022K20300j79360M45964J94872J92409k07109
8302c53527l6340j06965k55475m56048M5467K75822j56770O06511K77564n88314
8292g48075L87678R6856m10898M4002j39597l17973J03212j00424m41824r3908
8282a620951K83330K32454K33290L20271K5988J55674M41773k38707n93085o3622
8272h23585l87785j48761L96643j19205j82116N09211K08761m82433P72636J51061
$$ plain form
8262 -105573 -542151 -301751 -249939 -1185231 -984834 -746288 -1186864 -980263 -1074736 -1163466
8252 -1163466 -1067455 -684559 -823483 -613825 -553655 -405574 -594242 -770530 -729651 -1267234
8242 -1267234 -1199241 -909016 -1265085 -699041 -374275 -1118397 -535174 124851 -523584 -404339
8232 -404339 -120496 -812319 -438683 -445471 -1206088 -931857 -765017 -1101881 -424339 -140873
8222 -140873 -230764 -286543 -437240 -589325 -423034 -498304 -837289 -698536 -897273 -358780
8212 -358780 -674058 -805312 -499361 -559209 -659546 -147418 -599109 -656766 -359308 -535850
8202 -535850 -464885 -153927 -717445 -594411 -239305 -538711 -54435 684889 251461 1039416
8192 1039416 711220 -1146354 -725713 -1146180 -1170796 -1066674 -1086266 -1250163 -717124 -777486
$$ packed form
8262a05573m36578K40400N1812r35292K00397K38546m40576K06601r4473q8730
8252a163466R6011L82896j38924K09658O0170J48081j88668j76288M0879n37583
8242a267234O7993K90225l56069N66044L24766p44122N83223O60025o48435J19245
8232d04339K83843o91823L73636o788p60617K74231J66840l36864O77542K83466
8222a40873q9891n5779j50697j52085J66291p5270l38985J38753j98737N38493
8212c58780l15278j31254L05951n9848j00337N12128m51691n7657K97458j76542
8202e35850P0965L10958n63518J23034L55106k99406M84276P39324m33428P87955
8192A039416l28196j857574M20641m20467k4616J04122j9592j63897N33039o0362
$$ plain form
8182 -777486 -742037 -559119 -722207 -677474 -557295 -726814 -579914 -665618 -954942 -433223
8172 -433223 -752847 -1306246 -834024 -839515 -692202 -265258 -735046 -685293 -102724 -900286
8162 -900286 -1161107 -683918 -1234737 -1017911 -517515 -1005121 -717578 51378 -355661 -378536
8152 -378536 -56824 -689180 -374820 -351195 -697622 -614825 -734205 -1007731 -892941 -832485
8142 -832485 -559020 -227663 -577003 -208866 -330050 -311550 -177632 -767693 -1256381 -821094
8132 -821094 -798482 -844335 -469144 -577395 -712427 -289789 -336404 -302880 -356256 -741580 -631015
8121 -631015 -543649 -1008148 -957415 -974684 -1338867 -1093072 -747203 -945579 -561390 -141401
8111 -141401 -582663 -584234 -811813 -1097011 -1050081 -869921 -801199 -739250 -865869 -849477 -466489
$$ packed form
8182g77486L5449J82918j63088M4733J20179j69519J46900q5704k89324N21719
8172d33223l19624n53399M72222n491J47313M26944m69788M9753N82569p97562
8162i00286k60821M77189n50819K16826N00396m87606K87543P68956m07039k2875
8152c78536L21712o32356L14360K3625l46427Q2797j19380k73526J14790O0456
8142h32485K73465L31357l49340L68137j21184J8500J33918n90061m88688M35287
8132h21094K2612m5853L75191j08251j35032M22638m6615L3524n3376l85324J10565
8121f31015Q7366m64499N0733j7269l64183K45795L45869j98376L84189M19989
8111a41401m41262j571k27579k85198M6930J80160O8722O1949j26619J6392L82988
$$ plain form
8100 -466489 -355394 -370185 -734386 -745250 -397669 -622544 -852016 -567773 -795320 -1105517
8090 -1105517 -821241 -964211 -830106 -391443 -582346 -766150 -399168 -244158 -251724 78002
8080 78002 -309049 -662829 -369452 -720438 -647522 -726705 -892828 -800342 -467223 -562110 -588892
8069 -588892 -459270 -594516 -1060831 -895919 -531224 -689091 -710528 -377338 -461785 -800378
8059 -800378 -553514 -754970 -631297 -313204 58823 -125868 88446 -411838 -826190 -789420
8049 -789420 -862506 -824127 -725484 -388508 -315772 -251411 -265730 -375571 -593898 -517412 -702509
8038 -702509 -512919 -481978 -498310 -618347 -623727 -584789 -567589 -424859 -286265 -295000 -23469
8027 -23469 141584 -64850 -225182 -138537 -237418 -628997 -816169 -748737 -325535 -232309 -145792
$$ packed form
8100d66489J11095j4791l64201j0864L47581k24875k29472K84243k27547l10197
8090a105517K84276j42970J34105M38663j90903j83804L66982J55010p566L29726
8080G8002l87051l53780K93377l50986P2916p9183j66123R2486L33119r4887k6782
8069e88892J29622j35246m66315J64912L64695j57867k1437L33190q4447l38593
8059h00378K46864k01456J23673L18093L72027j84691K14314n00284m14352L6770
8049g89420p3086L8379R8643L36976P2736O4361j4319j09841k18327P6486j85097
8038g02509J89590L0941j6332j20037n380L8938J7200J42730J38594q735K71531
8027b3469J65053k06434j60332Q6645r8881l91579j87172O7432M23202R3226Q6517
$$ plain form
8016 -145792 -145075 -329567 -548117 -495434 -465952 -473544 -349342 -640726 -540176 -662874 -703511
8005 -703511 -798214 -600427 -304022 -750316 -732630 -371043 -338083 -764271 -580517 -676916
7995 -676916 -734677 -894731 -617010 -629970 -160668 -172400 -536118 -608640 -667223 -440987 -495219
7984 -495219 -421028 -195196 -275514 -222572 16959 -12523 -444594 -285839 -425750 -515489 -523326
7973 -523326 -587241 -425235 -611134 -852624 -733146 -370385 -403462 -129231 -323167 -346023
7963 -346023 -295067 -148477 -218275 -422442 -829206 -632778 -684698 -908397 -732999 -325656
7953 -325656 -496018 -242813 -94061 -101503 102197 -71112 -317105 -102260 -110075 -458495
7943 -458495 -96745 -431725 -519232 -408285 -711537 -805655 -747819 -680499 -677838 -594645 -166412
$$ packed form
8016a45792P17j84492k18550N2683K9482p592J24202k91384J00550j22698m0637
8005g03511r4703J97787K96405m46294J7686L61587L2960m26188J83754r6399
7995f76916n7761j60054K77721j2960M69302j1732l63718p2522n8583K26236n4232
7984d95219P4191K25832q0318N2942K39531k9482m32071J58755j39911q9739p837
7973e23326o3915J62006j85899k41490J19478L62761l3077K74231j93936k2856
7963c46023N0956J46590o9798k04167m06764J96428n1920k23699J75398M07343
7953c25656j70362K53205J48752p442K03700j73309k45993K14845p815l48420
7943d58495L61750l34980q7507J10947l03252r4118N7836O7320K661Q3193M28233
$$ plain form
7932 -166412 69049 -142584 -408673 -594454 -590455 -389881 -280975 -506754 -386777 -55244
7922 -55244 -253121 -446488 -145081 -526636 -792082 -354214 -436427 -178706 -78054 -450894
7912 -450894 -456781 -272011 -577268 -440049 -542954 -184886 339197 298877 -153662 -307738
7902 -307738 -603903 -609199 -578522 -939004 -547434 -306572 -204636 -416028 -696025 -1028912
7892 -1028912 -845409 -854784 -876213 -261231 -132086 -449980 -296242 -585443 -529114 -421982
7882 -421982 -654850 -564039 -266052 -323249 -421775 -329782 -712499 -572458 -466052 -595595
7872 -595595 -481631 -235390 -22689 93835 -353426 -584504 -237035 -468360 -298494 -173185
7862 -173185 -452606 -373678 -263434 -378077 -146504 178478 -92196 168893 338546 26865
$$ packed form
7932a66412K35461k11633k66089j85781L999K00574J08906k25779J19977L31533
7922e5244j97877j93367L01407l81555k65446M37868q2213K57721J00652l72840
7912d50894n887J84770l05257J37219j02905L58068N24083m0320m52539j54076
7902c07738k96165n296L0677l60482L91570K40862J01936k11392k79997l32887
7892a028912J83503r375k1429O14982J29145l17894J53738k89201N6329J07132
7882d21982k32868R0811K97987n7197r8526R1993l82717J40041J06406j29543
7872e95595J13964K46241K12701J16524m47261k31078L47469k31325J69866J25309
7862a73185k79421P8928J10244j14643K31573L24982k70674K61089J69653l11681
$$ plain form
7852 26865 -59014 -391348 -588452 -647194 -568625 -455205 -468758 -219805 -18122 -31040 -204672
7841 -204672 -320326 -337285 -471997 -236758 -734099 -1017045 -800151 -864185 -674985 -188977
7831 -188977 -91792 -242914 -77324 -80339 -141923 66185 -220096 -802992 -615871 -470125
7821 -470125 -660116 -463615 -572451 -661354 -293155 -216394 -259799 157481 137532 171764 -164776
7810 -164776 -381401 -649778 -596215 -289551 -569745 -931941 -756886 -548182 -468625 -453820
7800 -453820 -50782 402879 188561 176075 -579544 -72590 -328496 -839859 -628246 -613433
7790 -613433 -1023684 -366406 7159 -126409 182125 491541 371129 121023 -144593 -232610
7780 -232610 -431535 -370540 -201116 -271812 -39510 -12390 -59248 28249 -59114 -571558 -245054
$$ packed form
7852B6865q5879l32334j97104n8742P8569J13420j3553K48953K01683j2918j73632
7841b04672j15654j6959j34712K35239m97341k82946K16894o4034J89200M86008
7831a88977R7185j51122J65590l015o1584K08108k86281n82896J87121J45746
7821d70125j89991J96501j08836q8903L68199P6761m3405M17280j9949L4232l36540
7810a64776k16625k68377N3563L06664k80194l62196J75055K08704P9557J4805
7800d53820M03038M53661k14318j2486p55619N06954k55906n11363K11613J4813
7790f13433m10251O57278L73565j33568L08534L09416j20412k50106k65616q8017
7780b32610j98925O0995J69424p0696K32302K7120m6858Q7497q7363n12444L26504
$$ plain form
7769 -245054 5759 -414826 -58205 -89709 -795644 -423829 -411727 -728096 -634430 -441027
7759 -441027 -274322 -41839 225947 -231610 -326418 -371376 -697379 -498656 -329469 -321763
7749 -321763 -353365 -242335 -155962 -524527 -182359 -90472 -515287 -24288 136677 62098
7739 62098 380677 384854 -324458 -168896 -11997 -413829 -237446 2642 -6302 127785 195370
7728 195370 -498265 -669211 -413045 -551565 -187712 112838 -236250 -237461 145368 -163775
7718 -163775 -394549 -420603 -510826 -261081 19879 -208316 -410123 38319 96770 -222795
7708 -222795 -42022 -144491 -86795 -74295 -66651 -412590 -14923 171734 -379599 -329463 -323531
7697 -323531 -620119 -498660 -34202 72053 23289 57776 25497 -85428 -62064 -217691
$$ packed form
7769b45054K50813m20585L56621l1504p05935L71815J2102l16369R3666J93403
7759d41027J66705K32483K67786m57557r4808m4958l26003J98723J69187P706
7749c21763l1602J11030Q6373l68565L42168R1887m24815M90999J60965p4579
7739F2098L18579M177p09312J55562J56899m01832J76383K40088q944J34087O7585
7728A95370o93635j70946K56166j38520L63853L00550l49088j211L82829l09143
7718a63775k30774k6054r0223K49745K80960k28195k01807M48442N8451l19565
7708b22795J80773j02469N7696J2500P644l45939L97667J86657n51333N0136N932
7697c23531k96588J21459M64458J06255m8764L4487l2279j10925K3364j55627
$$ plain form
7687 -217691 -492581 -523392 -481251 -772237 -520004 -139113 112191 205318 206753 -75031 -280328
7676 -280328 -39871 -121277 -184916 -395949 -325569 -171988 -387148 -313206 -247762 -85691 -178035
7665 -178035 235393 348368 -83264 49741 -304398 -730650 -629503 -518126 -388670 104
7655 104 -19063 29370 -27748 -113926 -186658 -415850 -444257 -161227 -278521 -311421 -436026
7644 -436026 -610069 -322517 -276808 -739706 -121514 114113 -218915 120141 -53112 -414952
7634 -414952 -98085 -86812 -466465 -329677 -183119 -13115 226758 214147 49410 -185555
7624 -185555 -303722 -180865 -18652 160426 45551 -118062 -479156 -397294 -712107 -876277
7614 -876277 -509490 -490687 -154484 280360 78749 168747 212633 -175952 -227246 71619
$$ packed form
7687b17691k74890l0811M2141k90986K52233L80891K51304R3127J435k81784k05297
7676b80328K40457q1406o3639k11033P0380J53581k15160P3942O5444J62071r2344
7665a78035M13428J12975m31632J33005l54139m26252J01147J11377J29456L88774
7655A04j9167M8433n7118q6178p2732k29192k8407K83030j17294l2900j24605
7644d36026j74043K87552M5709m62898O18192K35627l33028L39056j73253l61840
7634d14952L16867J1273l79653J36788J46558J70004K39873j2611j64737k34965
7624a85555j18167J22857J62213J79078j14875j63613l61094Q1862l14813j64170
7614h76277L66787J8803L36203M34844k01611Q9998M3886l88585n1294K98865
$$ plain form
7604 71619 -340016 -214479 167507 -115372 -120197 -259210 -392878 72871 182446 404
7594 404 132105 76556 -221583 -54695 -521001 -1022019 -639359 -681591 -444217 -272389 -560667
7583 -560667 -336584 -99884 -145083 -77733 86861 -352942 -72281 -90325 -509556 -226923
7573 -226923 -122507 -214606 84245 -89666 -259571 135483 -85272 -119265 365132 -12133
7563 -12133 4409 292668 -329007 -79327 98734 -482584 -348454 121318 -366414 -219212
7553 -219212 -165499 -684182 -419498 -400867 -421537 -20551 -42913 -158455 56346 -95567
7543 -95567 -209540 -305089 -468659 -451854 -522955 -344112 -97826 -150909 -120358 220225 113262
7532 113262 -248039 29037 -52528 -458907 47559 -263669 -704479 -221252 -372290 -409172
$$ packed form
7604G1619m11635J25537L81986k82879m825j39013j33668M65749J09575j82042
7594D04J31701n5549k98139J66888m66306n01018L82660m2232K37374J71828k88278
7583e60667K24083K36700m5199O7350J64594m39803K80661j8044m19231K82633
7573b26923J04416r2099K98851j73911j69905L95054k20755l3993M84397l77265
7563a2133J6542K88259o21675K49680J78061n81318J34130M69772m87732J47202
7553b19212N3713n18683K64684J8631k0670M00986k2362j15542K14801j51913
7543i5567j13973r5549j63570J6805p1101J78843K46286n3083L0551L40583j06963
7532A13262l61301K77076q1565m06379N06466l11228m40810M83227j51038l6882
$$ plain form
7522 -409172 107736 -264520 -202398 253655 110925 18551 198813 -276935 -191403 -93900
7512 -93900 -318632 -253186 -419214 -489225 -178520 -5646 22817 -108666 -78873 -121505 -63077
7501 -63077 -385805 -155362 236615 68859 -311456 -383314 -497782 -659746 -169895 -377490
7491 -377490 21234 276269 218090 145354 -90815 -201040 -34427 -375735 -711642 -290410
7481 -290410 -397214 -329365 61547 -91587 -48944 5897 -227610 -226828 401291 15084 -280857
7470 -280857 -169806 -587061 -317928 53244 -257699 -138459 226494 365207 317130 250535
7460 250535 421659 355079 -202871 -335505 -319264 -12618 203339 120874 -108943 -128227
7450 -128227 98177 -505689 -339541 -29167 -104295 -108157 -136897 -221716 65761 -65054 -525671
$$ packed form
7522d09172N16908l72256O2122M56053j42730r2374J80262m75748Q5532R7503
7512i3900k24732O5446j66028p0011L10705J72874K8463j31483K9793m2632N8428
7501f3077l22728K30443L91977j67756l80315p1858j14468j61964M89851k07595
7491c77490L98724K55035n8179p2736k36169j10225J66613l41308l35907M21232
7481b90410j06804O7849L90912j53134M2643N4841k33507P82O28119l86207k95941
7470b80857J11051m17255K69133L71172l10943J19240L64953J38713m8077o6595
7460B50535J71124o6580n57950j32634J6241L06646K15957q2465k29817j9284
7450a28227K26404o03866J66148L10374p5128l862k8740q4819K87477j30815m60617
$$ plain form
7439 -525671 -571213 -494105 -231319 109327 119665 68219 19100 -318520 -296338 30846 86954
7428 86954 -98428 -122732 -63089 -98390 -347084 -283267 -120028 -255384 63476 134411 -170474
7417 -170474 -407885 -114468 -365018 -313240 -346795 -417958 138962 149389 -137678 -157355 82613
7406 82613 -265767 -66944 277362 32082 -179621 -327549 -595354 -363883 31440 87812
7396 87812 43119 179846 786 133953 173658 -255947 -464000 -288713 -412155 -309607
7386 -309607 -36460 339654 528436 45885 -273045 -346923 -545612 -18376 164221 56500
7376 56500 209916 -244680 -593079 -674009 -819038 -527581 153734 201203 142638 -9731
7366 -9731 -91894 -90554 51054 -160418 11438 61898 186638 229176 -294426 111605 47775
$$ packed form
7439e25671m5542P7108K62786L40646J0338n1446m9119l37620K2182L27184N6108
7428H6954j85382k4304N9643l5301k48694O3817J63239j35356L18860P0935l04885
7417a70474k37411K93417k50550N1778l3555p1163N56920J0427k87067j9677K39968
7406H2613l48380J98823L44306k45280k11703j47928k67805K31471L95323N6372
7396H7812m4693J36727j79060J33167L9705m29605k08053J75287j23442J02548
7386c09607K73147L76114J88782m82551l18930p3878j98689N27236J82597j07721
7376E6500J53416m54596l48399q0930j45029K91457O81315M7469n8565j52369
7366i731q2163J340J41608k11472J71856N0460J24740M2538n23602M06031o3830
$$ plain form
7355 47775 -189347 -94702 116548 410191 351440 212558 -164266 -234822 -422539 -759296
7345 -759296 -171431 -23829 16598 734637 692684 433837 222006 -84785 -564693 -420201
7335 -420201 -202764 9802 38682 129320 79097 -231906 -378321 -143359 -38488 167424
7325 167424 524450 406358 368474 414513 43082 -206729 28089 -321966 -39978 323677
7315 323677 268982 101754 53413 39066 -15067 289456 339971 364964 152302 -224766 -343254
7304 -343254 -407812 -363765 12280 88140 193342 412101 219241 89750 -110560 -253380
7294 -253380 -147137 -54434 -291979 129539 92010 -20314 -124050 -183095 140715 281821
7284 281821 382180 335663 335754 414052 74192 -203479 -585571 -445772 -147240 -107183 -180197
$$ packed form
7355D7775k37122R4645K11250K93643n8751j38882l76824p0556j87717l36757
7345g59296N87865J47602M0427P18039m1953k58847k11831l06791m79908J44492
7335d20201K17437K12566K8880R0638n0223l11003j46415K34962J04871K05912
7325A67424L57026j18092l7884M6039l71431k49811K34818l50055K81988L63655
7315C23677n4695j67228m8341j4347n4133L04523N0515K4993k12662l77068j18488
7304c43254o4558M4047L76045P5860J05202K18759j92860j29491k00310j42820
7294b53380J06243R2703k37545M21518l7529j12324j03736n9045L23810J41106
7284B81821J00359m6517R1P8298l39860k77671l82092J39799K98532M0057p3014
$$ plain form
7273 -180197 139150 286475 134249 6247 215274 328915 207247 269848 20515 -326062
7263 -326062 -245128 -213251 -345235 132494 -9768 194525 354545 65628 -246155 131335
7253 131335 -73252 33614 363263 18446 299602 292508 214566 436337 223894 -4502
7243 -4502 -105478 -357110 -153218 108148 -68221 -95530 109303 11959 94398 -143811 -279756
7232 -279756 223854 447663 334041 185657 191147 -147279 34712 -267923 -429145 207372
7222 207372 578579 436057 581715 413750 -3303 -51890 -368314 -160186 85097 -23426
7212 -23426 -1454 -94865 55963 138303 -29502 -97580 533987 395955 379556 700291 118642
7201 118642 -294253 -277630 -446820 -177045 308015 135178 465778 523072 106122 114610
$$ packed form
7273a80197L19347J47325j52226j28002K09027J13641j21668O2601k49333l46577
7263c26062Q0934L1877j31984M77729j42262K04293J60020k88917l11783L77490
7253A31335k04587J06866L29649l44817K81156p094p7942K21771k12443k28396
7243d502j00976k51632K03892K61366j76369k7309K04833r7344Q2439k38209j35945
7232b79756N03610K23809j13622j48384N490l38426J81991l02635j61222O36517
7222B07372L71207j42522J45658j67965m17053m8587l16424K08128K45283j08523
7212b3426K1972r3411J50828Q2340j67805o8078O31567j38032j6399L20735n81649
7201A18642m12895J6623j69190K69775M85060j72837L30600N7294m16950Q488
$$ plain form
7191 114610 518694 463521 553320 325933 214525 342739 128282 85040 220930 63916
7181 63916 -153023 334388 331670 342124 493885 -97459 -81079 65052 -241971 -119364 -83740
7170 -83740 -374726 -34435 84502 -27980 267102 294442 169318 564025 305369 547592
7160 547592 443789 -62893 -9380 269409 74197 147189 604323 743226 681418 703974
7150 703974 666795 538843 885477 955473 1057730 975231 1355318 1210277 745859 665592
7140 665592 494983 154646 321846 232591 246694 496727 520841 287240 169109 -34143
7130 -34143 -59630 453679 392224 596138 596078 522388 -77567 -259966 -82393 33560 331025
7119 331025 672825 658571 592339 826728 618766 47353 -119360 78562 380395 607569
$$ packed form
7191A14610M04084n5173Q9799k27387j11408J28214k14457m3242J35890j57014
7181F3916k16939M87411k718J0454J51761n91344J6380J46131l07023J22607L5624
7170h3740k90986L40291J18937j12482K95082K7340j25124L94707k58656K42223
7160E47592j03803n06682N3513K78789j95212P2992M57134J38903o1808K2556
7150G03974l7179j27952L46634O9996J02257q2499L80087j45041m64418q0267
7140F65592j70609l40337J67200q9255J4103K50033K4114k33601j18131k03252
7130c4143k5487N13309o1455K03914o0p3690n99955j82399J77573J15953K97465
7119C31025L41800j4254o6232K34389k07962n71413j66713J97922L01833K27174
$$ plain form
7109 607569 142263 -16775 321348 291945 -41412 14208 354759 555491 870411 774758
7099 774758 535844 254592 32703 148013 -31831 106782 339979 495520 581480 248517
7089 248517 -27123 261873 753711 609719 473293 639867 334359 -70846 -2681 -226708
7079 -226708 -308158 188768 50373 24924 344040 179857 294385 481788 593062 878913
7069 878913 509528 490567 417896 215371 -201191 -153583 -99429 104552 485076 553944 426538
7058 426538 1006614 713191 406642 436467 271057 406801 269800 318654 367699 304672
7048 304672 51683 461791 400652 543341 792018 728349 505197 513333 177949 173844 140001
7037 140001 -291330 239987 303913 197936 192522 286564 345724 663658 451876 61295 414285
$$ packed form
7109F07569m65306j59038L38123k9403l33357N5620L40551K00732L14920r5653
7099G74758k38914k81252k21889J15310j79844J38613K33197J55541Q5960l32963
7089B48517k75640K88996M91838j43992j36426J66574l05508m05205O8165k24027
7079b26708q1450M96926j38395k5449L19116j64183J14528J87403J11274K85851
7069H78913l69385j8961p2671k02525m16562M7608N4154K03981L80524O8868j27406
7058D26538N80076k93423l06549K9825j65410J35744j37001M8854M9045o3027
7048C04672k52989M10108o1139J42689K48677o3669k23152Q136l35384m105l3843
7037A40001m31331N31317O3926j05977n414R4042N9160L17934k11782l90581L52990
$$ plain form
7026 414285 605401 758958 600391 326946 520585 432634 -36949 441716 834910 818591
7016 818591 887222 928573 561241 819356 516764 152782 459942 233954 54249 462039
7006 462039 447799 69067 379363 111326 165835 584256 461160 436069 441984 475109 436142
6995 436142 119851 118810 393676 171009 136989 1025495 945408 581361 831735 503770
6985 503770 488475 535082 235396 496171 881549 368720 248790 269261 197901 197192 372392
6974 372392 102420 271468 351474 198742 384574 384913 376354 264616 231913 304194 493509
6963 493509 279731 440013 623418 771734 874130 786123 621207 894010 430586 -74448
6953 -74448 219782 421867 550727 1098378 912111 651583 598841 347856 166390 645889
$$ packed form
7026D14285J91116J53557j58567k73445J93639q7951m69583M78665L93194j6319
7016H18591O8631M1351l67332K58115l02592l63982L07160k25988j79705M07790
7006D62039j4240l78732L10296k68037N4509M18421j23096k5091N915L3125l8967
6995D36142l16291j041K74866k22667l4020Q88506q0087l64047K50374l27965
6985E03770j5295M6607k99686K60775L85378n12829j19930K0471p1360p09J75200
6974C72392k69972J69048Q0006j52732J85832L39q559j11738l2703P2281J89315
6963D93509k13778J60282J83405J48316J02396q8007j64916K72803m63424n05034
6953g4448K94230K02085J28860N47651j86267k60528n2742k50985j81466M79499
$$ plain form
6943 645889 672683 297757 418670 138719 463509 697206 570594 660872 545231 407134
6933 407134 693545 547257 229671 149904 8406 116082 313506 392136 563147 979120
6923 979120 867237 1065590 1188732 678774 626396 566591 455204 504734 465130 599498
6913 599498 911553 714393 697710 1121293 874259 490189 991845 685733 808166 847538
6903 847538 457264 615528 510705 265018 501148 505210 358532 559636 986992 1089391
6893 1089391 984807 686153 598859 713833 473708 713152 833450 518965 720143 316732
6883 316732 178573 554623 576464 629352 1118778 1317212 1053522 1144744 723488 445675
6873 445675 434392 328003 521333 818168 530140 490025 722557 636933 730020 757208 764290
$$ packed form
6943F45889K6794l74926J20913k79951L24790K33697j26612R0278j15641j38097
6933D07134K86411j46288l17586p9767j41498J07676J97424P8630J71011M15973
6923I79120j11883J98353J23142n09958n2378n9805j11387M9530l9604J34368
6913E99498L12055j97160j6683M23583k47034l84070N01656l06112J22433L9372
6903H47538l90274J58264j04823k45687K36130M062j46678K01104M27356J02399
6893A089391j04584k98654q7294J14974k40125K39444J20298l14485K01178m03411
6883C16732j38159L76050K1841N2888M89426J98434k63690R1222m21256k77813
6873D45675j1283j06389J93330K96835k88028m0115K32532q5624R3087K7188P082
$$ plain form
6862 764290 581630 647658 477826 502493 574939 425730 784631 580469 684581 845829
6852 845829 1058036 930513 1233801 878961 1094583 1009622 841369 945494 891219 399708
6842 399708 666943 890892 927123 1481355 1175002 901544 1152586 858328 634657 733799
6832 733799 788408 1245072 1404538 1287179 1088341 897381 589243 858259 826171 1116710
6822 1116710 1397018 1283153 1230753 1165763 750438 864881 763781 826004 1430553 1497305
6812 1497305 1213811 1295112 1132482 714989 1158731 1286211 1017462 1136554 1253827 1106464
6802 1106464 1110986 978819 742368 689236 794559 1035238 1486481 1584673 1253611 1228034
6792 1228034 1127911 1107789 505154 735070 956919 757681 907303 1119641 780568 1032193
$$ packed form
6862G64290j82660O6028j69832K4667P2446j49209L58901k04162J04112J61248
6852H45829K12207j27523L03288l54840K15622q4961j68253J04125n4275m91511
6842C99708K67235K23949L6231N54232l06353k73458K51042k94258k23671R9142
6832G33799N4609M56664J59466j17359j98838j90960l08138K69016l2088K90539
6822A116710K80308j13865n2400o4990m15325J14443j01100O2223O04549O6752
6812A497305k83494Q1301j62630m17493M43742J27480k68749J19092J17273j47363
6802A106464M522j32167k36451n3132J05323K40679M51243R8192l31062k5577
6792A228034j00123k0122o02635K29916K21849j99238J49622K12338l39073K51625
$$ plain form
6782 1032193 1181347 1343411 1249656 1522883 1557939 1170492 1184490 1412624 1483036 1137384
6772 1137384 1083076 1191464 1307273 1018497 1041909 1276012 1658202 1474891 998157 1411128
6762 1411128 1508898 1179571 1358724 1509384 1505606 1585330 1492546 1202199 1623680 1610340 1562726
6751 1562726 1682664 1547120 1583547 1835547 1736815 1999864 1828655 1609037 1721752 1938207
6741 1938207 1948161 1968363 1904591 1915409 2075852 1811517 1732323 1843691 1533887 1541349 1523101
6730 1523101 1718734 2152498 2194779 2069016 2268395 1779105 1496296 2233826 2166934 2415415
6720 2415415 2558702 2419700 2368079 2452964 2277077 2303186 2458896 2531990 2626642 2411482
6710 2411482 2184577 2132790 2044604 2098542 2324900 2080979 2299830 2706146 2541036 2578805
$$ packed form
6782A032193J49154J62064r3755K73227L5056l87447J3998K28134P0412l45652
6772A137384n4308J08388J15809k88776K3412K34103L82190j83311m76734M12971
6762A411128R7770l29327J79153J50660l778P9724r2784k90347M21481j3340m7614
6751A562726J19938j35544L6427K52000r8732K63049j71209k19618J12715K16455
6741A938207R954K0202o3772J0818J60443k64335p9194J11368l09804P462j8248
6730A523101J95633M33764M2281j25763J99379m89290k82809P37530o6892K48481
6720B415415J43287j39002n1621Q4885j75887K6109J55710P3094R4652k15160
6710B411482k26905n1787q8186N3938K26358k43921K18851M06316j65110L7769
$$ plain form
6700 2578805 2706135 2479008 2700211 2793143 2633957 2763184 2590503 2522161 2824202 2755174
6690 2755174 2737337 3315381 3531060 3527600 3546150 3566992 3628311 3583908 3597288 3832384 3682884
6679 3682884 3959684 3982095 3528944 3719131 4377816 4467764 4511785 4715988 4631138 4709323
6669 4709323 4803412 5009524 5314461 5819029 6313281 6480104 6512985 6715356 6855160 7138431
6659 7138431 7925183 7978759 8182893 8551415 8636353 8874118 8750140 8398453 8063040 8295840
6649 8295840 8372795 8902718 9361043 9604918 9840797 10288302 10670779 11307076 12067002 13027562
6639 13027562 13764154 14518203 15384260 15859470 16338339 16352824 16510852 16647175 16826318 17237287
6629 17237287 17537764 17561270 17739411 17783177 17910716 18361651 18401506 18517869 18880766 19120671
$$ packed form
6700B578805J27330k27127K21203R2932j59186J29227j72681o8342L02041o9028
6690B755174j7837N78044K15679l460J8550K0842O1319m4403J3380K35096j49500
6679C682884K76800K2411m53151J90187O58685Q9948M4021K04203q4850P8185
6669D709323R4089K06112L04937N04568M94252J66823L2881K02371J39804K83271
6659G138431P86752N3576K04134L68522Q4938K37765j23978l51687l35413K32800
6649H295840P6955N29923M58325K43875K35879M47505L82477O36297P59926R60560
6639A3027562P36592P54049Q66057M75210M78869J4485J58028J36323J79143M10969
6629A7237287L00477K3506J78141M3766J27539M50935L9855J16363L62897K39905
$$ plain form
6619 19120671 19355906 19591800 19836310 20131391 20222000 20579863 21238233 21750755 22045669 22756515
6609 22756515 23409520 24125627 25222114 26080756 27058311 28101208 29028084 29573162 29728433
6600 29728433 29291992 28905750 28216265 27456722 26753681 25789620 25081113 24788271 23819825
6591 23819825 23887713 23958911 23425463 23724216 23418096 23252039 23199540 23230447 23205303 23613092
6581 23613092 24138017 24455237 24390980 24727713 24815896 24406379 24472199 24429449 24007588 23615591
6571 23615591 23948089 23839263 23587751 23059012 22147472 21451002 21033349 20197510 19513747
6562 19513747 18438705 17314788 16245307 15267291 14496164 14130260 14039116 13731758 13409870
6553 13409870 13367283 13470251 13308466 13691225 14061037 14092064 14144312 14368494 13779126 13562652
$$ packed form
6619A9120671K35235K35894K44510K95081R0609L57863O58370N12522K94914P10846
6609B2756515O53005P16107J096487Q58642R77555J042897R26876N45078J55271
6600B9728433m36441l86242o89485p59543p03041r64061p08507k92842r68446
6591B3819825O7888P1198n33448K98753l06120j66057n2499L0907k5144M07789
6581B3613092N24925L17220o4257L36733Q8183m09517O5820m2750m21861l91997
6571B3615591L32498j08826k51512n28739r11540o96470m17653q35839o83763
6562A9513747j075042j123917j069481r78016p71127l65904r1144l07358l21888
6553A3409870m2587J02968j61785L82759L69812L1027N2248K24182n89368k16474
$$ plain form
6543 13562652 13472386 12059776 11433991 11134188 10429448 10221270 10079091 9460853 8720519
6534 8720519 8564228 7945148 7709616 7536145 7033026 6722952 6583269 6341768 6120539 6160457
6524 6160457 6002763 5710593 5994504 6310177 5700209 5274889 5093839 4956871 4905566 5195679
6514 5195679 5071465 5172802 5696195 5219424 4867609 5468309 5619887 5385180 5797981 5524172
6504 5524172 5106691 5242923 5021778 4679321 5027606 4920910 5086536 5495488 5400663 5474528
6494 5474528 5697371 5390434 5225457 5191350 5313753 5673094 5538919 5797539 5680667 5398970
6484 5398970 5570887 6159313 5835472 6002892 6605460 6667540 6822200 6682544 5785443 6115090
6474 6115090 6603262 6548220 7165401 7169501 7020894 7641724 7850317 7850111 8486999 8594475 8798989
$$ packed form
6543A3562652r0266j412610o25785k99803p04740k08178j42179o18238p40334
6534H720519j56291o19080k35532j73471n03119l10074j39683k41501k21229L9918
6524F160457j57694k92170K83911L15673o09968m25320j81050j36968n1305K90113
6514E195679j24214J01337N23393m76771l51815O00700J51578k34707M12801k73809
6504E524172m17481J36232k21145l42457L48285j06696J65626M08952r4825P3865
6494E474528K22843l06937j64977l4107J22403L59341j34175K58620j16872k81697
6484E398970J71917N88426l23841J67420O02568O2080J54660j39656q97101L29647
6474F115090M88172n5042O17181M100j48607O20830K08593k06O36888J07476K04514
$$ plain form
6463 8798989 9177773 9357671 9514667 9608314 10001572 10704184 11291804 11925198 13001873 14125895
6453 14125895 15006263 16315542 17865960 19859694 21956495 24114405 26486728 29139743
6445 29139743 31757387 33910317 35541547 35779923 35397602 34139876 31502117 29146682
6437 29146682 26713668 24232577 22513717 20663380 18627815 17724309 16802719 15954453 15912337
6428 15912337 15497022 15046016 15124706 15161336 14984342 15449054 15348874 15181964 15817069 16079340
6418 16079340 17063758 17831143 18478076 19836649 20990104 22225101 24316886 25535618 26461858
6409 26461858 26876571 26630691 26140614 25792432 24809955 23865309 23154068 22037452 21574456
6400 21574456 21129452 20619093 20857834 20785783 20911499 21681048 21977403 22145778 22720411 23501890
$$ packed form
6463H798989L78784J79898J56996R3647L93258P02612N87620O33394J076675J124022
6453A4125895Q80368J309279J550418J993734K096801K157910K372323K653015
6445B9139743K617644K152930J631230K38376l82321j257726k637759k355435
6437B9146682k433014k481091j718860j850337k035565r03506r21590q48266m2116
6428A5912337m15315m51006P8690L6630j76994M64712j00180j66910O35105K62271
6418A6079340R84418P67385O46933J358573J153455J234997K091785J218732R26240
6409B6461858M14713k45880m90077l48182r82477r44646p11241j116616m62996
6400B1574456m45004n10359K38741p2051J25716P69549K96355J68375N74633P81479
$$ plain form
6390 23501890 24509106 26206232 28074341 30280712 33086522 35962164 38975680 42933864
6382 42933864 47322369 52516072 58214130 64996040 71173255 76977167 81578917 82847004
6374 82847004 81920844 79739793 75679489 70536184 65424070 59876495 54280232 49788575
6366 49788575 45460502 41795933 39335635 37183023 35500019 34400529 33380579 33090086
6358 33090086 32958023 32710824 33154118 33801087 34289147 34983298 36119137 38073647 40745452
6349 40745452 43498688 47108222 51335730 55184594 60020969 64641708 67909392 70564664
6341 70564664 71738869 70555419 68599161 65308129 60721892 56681151 51861328 47231657
6333 47231657 44415564 41415978 39011097 37406282 35429616 33823916 33003058 31853171
$$ packed form
6390B3501890J007216J697126J868109K206371K805810K875642L013516L958184
6382D2933864M388505N193703N698058O781910O177215N803912M601750J268087
6374H2847004r26160k181051m060304n143305n112114n547575n596263m491657
6366D9788575m328073l664569k460298k152612j683004j099490j019950k90493
6358C3090086j32063k47199M43294O46969M88060O94151J135839J954510K671805
6349D0745452K753236L609534M227508L848864M836375M620739L267684K655272
6341G0564664J174205j183450j956258l291032m586237m040741m819823m629671
6333D7231657k816093k999586k404881j604815j976666j605700q20858j149887
$$ plain form
6325 31853171 30979077 31020563 30945825 31585157 32661134 33402110 34893508 36802541 38893379
6316 38893379 41861616 45377698 49343377 54524707 59581008 65354142 72257897 77590949
6308 77590949 82977752 86465291 86818361 85726749 83178848 78510556 74007690 68896181
6300 68896181 63535938 60011954 56565182 53608981 52404414 51460051 51227582 52325499
6292 52325499 53463973 55769727 59388826 62546998 66338841 70233834 72608865 74230505
6284 74230505 74328753 72504952 69552218 65287520 59991739 55231920 49546807 44247132
6276 44247132 40499589 36294794 32872239 30215559 27289592 25063852 23641358 21566434
6268 21566434 20552763 19528533 18086253 17850249 17545665 16597286 16227043 15577375 15166660
$$ packed form
6325C1853171q74094M1486p4738O39332J075977P40976J491398J909033K090838
6316C8893379K968237L516082L965679N181330N056301N773134O903755N333052
6308G7590949N386803L487539L53070j091612k547901m668292m502866n111509
6300F8896181n360243l523984l446772k956201j204567r44363k32469J097917
6292E2325499J138474K305754L619099L158172L791843L894993K375031J621640
6284G4230505R8248j823801k952734m264698n295781m759819n685113n299675
6276D4247132l747543m204795l422555k656680k925967k225740j422494k074924
6268B1566434j013671j024230j442280k36004l04584r48379l70243o49668m10715
$$ plain form
6259 15166660 15259965 14877775 14534267 14664752 14145053 14046864 14447541 14521822 15138654 16037879
6249 16037879 16627111 18023309 19535769 20602837 22191883 24076217 26098218 28691946
6241 28691946 30928285 32694851 33700759 33204272 31938970 30579219 28395921 26060480
6233 26060480 24311791 22083210 20893205 19826374 18429150 17841372 17332846 16912976 17581694
6224 17581694 18222983 18589249 19902501 21572552 22708019 24339715 25063772 25062450 25213122
6215 25213122 24199064 22732218 21474372 19233617 17325921 15578164 13470344 11869565
6207 11869565 10893955 9934607 9689007 8848843 8042063 7497847 6441409 5764400 5429070
6198 5429070 5079362 5281441 5322358 4553763 4363768 4262919 3825024 3718395 4103291 3595203
$$ packed form
6259A5166660R3305l82190l43508J30485n19699r8189M00677P4281O16832Q99225
6249A6037879N89232J396198J512460J067068J589046J884334K022001K593728
6241B8691946K236339J766566J005908m96487j265302j359751k183298k335441
6233B6060480j748689k228581j190005j066831j397224n87778n08526m19870O68718
6224A7581694O41289L66266J313252J670051J135467J631696P24057j322J50672
6215B5213122j014058j466846j257846k240755j907696j747757k107820j600779
6207A1869565r75610r59348k45600q40164q06780n44216j056438o77009l35330
6198E429070l49708K02079M0917p68595j89995j00849m37895j06629L84896n08088
$$ plain form
6188 3595203 3519703 3784994 3473322 3274700 3134998 2751869 2699162 2931513 2712155 2805550
6178 2805550 2689298 2266714 2130117 2057054 1827507 1927881 2242507 2252236 1991972 1817077
6168 1817077 1706698 1446209 1353708 1674918 1757717 1914199 2140289 1890732 1717618 1606257
6158 1606257 1078089 1037721 1354056 1016610 1267718 1640005 1223703 829205 938741 637675
6148 637675 503708 970756 772208 534685 873250 706956 584110 519499 303319 602835
6138 602835 760074 850953 1109943 1072978 899865 542114 394323 625632 665374 687245
6128 687245 752026 806636 846139 944183 649305 329072 482941 577517 655235 628844 583841
6117 583841 417543 175365 97446 -82927 -70353 259416 204512 429206 460674 337493
$$ packed form
6188C595203p5500K65291l11672j98622j39702l83129n2707K32351k19358R3395
6178B805550j16252m22584j36597p3063k29547J00374L14626R729k60264j74895
6168A817077j10379k60489r2501L21210Q2799J56482K26090k49557j73114j11361
6158A606257n28168m0368L16335l37446K51108L72287m16302l94498J09536l01066
6148F37675j33967M67048j98548k37523L38565j66294j22846o4611k16180K99516
6138F02835J57239R0879K58990l6965j73113l57751j47791K31309L9742K1871
6128F87245O4781N4610L9503R8044k94878l20233J53869R4576P7718k6391m5003
6117E83841j66298k42178p7919j80373J2574L29769n4904K24694L1468j23181
$$ plain form
6107 337493 -162757 -93583 -191104 -352622 -7637 -10329 235449 313767 361160 174534 -24056
6096 -24056 -117897 -10414 26230 427408 732701 458321 330364 378190 1604 96295 187721
6085 187721 -38412 159973 40471 -111362 188763 -208354 -544607 -184225 75533 -170965
6075 -170965 174881 130365 -197127 67982 268891 255210 238462 356589 335313 403562 401837
6064 401837 301381 492433 438121 492665 350696 78985 465937 302449 24304 1855
6054 1855 -1534 70694 291678 4602 -146726 264854 -63229 -215282 134695 -11477 -197571
6043 -197571 73288 -227804 -142264 114279 -589592 -453126 -160075 59383 257171 441454
6033 441454 280972 351122 348263 112335 63910 24080 -117 75921 109264 198654 199902 7925
$$ packed form
6107C37493n00250O9174r7521j61518L44985k692K45778P8318M7393j86626j98590
6096b4056r3841J07483L6644M01178L05293k74380j27957M7826l76586R4691R1426
6085A87721k26133J98385j19502j51833L00125l97117l36253L60382K59758k46498
6075a70965L45846m4516l27492K65109K00909j3681j6748J18127k1276O8249j725
6064D01837j00456J91052n4312N4544j41969k71711L86952j63488k78145k2449
6054A855l389P2228K20984k87076j51328M11580l28083j52053L49977j46172j86094
6043a97571K70859l01092Q5540K56543p03871J36466K93051K19458J97788J84283
6033D41454j60482P0150k859k35928m8425l9830k4197P6038L3343Q9390J248j91977
$$ plain form
6021 7925 104724 -81819 -205338 198040 154342 -202176 189351 160324 -468832 -49995 -366612
6010 -366612 -396284 131596 -19900 -172256 417009 339389 22411 -87749 -114166 -498115
6000 -498115 108861 380970 -93788 -3982 -322010 -350457 -46713 -292628 42887 386281
5990 386281 263886 119378 -76208 -355125 -523921 -513922 -96415 375343 214100 314288
5980 314288 364883 94774 -244735 19125 -316900 -31111 286066 93617 8518 51377
5970 51377 -636370 -594762 -154235 -355264 85832 619931 224910 248101 -148750 -412241
$$ packed form
6021G925R6799j86543j23519M03378m3698l56518L91527k9027o29156M18837l16617
6010c66612k9672N27880j51496j52356N89265p7620l16978j10160k6417l83949
6000d98115O06976K72109m74758Q9806l18028k8447L03744k45915L35515L43394
5990C86281j22395j44508j95586k78917j68796R999M17507M71758j61243J00188
5980C14288N0595k70109l39509K63860l36025K85789L17177j92449q5099M2859
5970E1377o87747M1608M40527k01029M41096N34099l95021K3191l96851k63491
$$ [...]
##END NTUPLES=NMR SPECTRUM
##END=
