##TITLE=1H_DE-80H_X3
 200.13MHz, d2o
 8 sc
 
 19ns.26.2.2025
##JCAMPDX= 6.0         $$ Bruker NMR JCAMP-DX V2.0
##DATA TYPE= NMR SPECTRUM
##DATA CLASS= NTUPLES
##ORIGIN= UXNMR, Bruker Analytische Messtechnik GmbH
##OWNER= pz
$$ XWIN-NMR		Version 3.5
$$ Fri Dec 26 11:07:48 2025 Russian Standard Time (UT+4h)  Yarkov@DPX200
##.OBSERVE FREQUENCY= 200.1313
##.OBSERVE NUCLEUS= ^1H
##.ACQUISITION MODE= SIMULTANEOUS
##.ACQUISITION SCHEME= undefined
##.AVERAGES= 8
##.DIGITISER RES= 18
##SPECTROMETER/DATA SYSTEM= spect
##.PULSE SEQUENCE= zg30
##.SOLVENT NAME= CDCl3
##.SHIFT REFERENCE= (INTERNAL, CDCl3, 0, 15.413)
##AUDIT TRAIL= $$ (NUMBER, WHEN, WHO, WHERE, WHAT)
$$ ##TITLE= Audit trail, XWIN-NMR		Version 3.5
$$ ##JCAMPDX= 5.01
$$ ##ORIGIN= Bruker BioSpin GmbH
$$ ##OWNER= Yarkov
$$ C:/Bruker/XWIN-NMR/data/yarkov2/nmr/H-C/1/pdata/1/auditp.txt
$$ ##AUDIT TRAIL=  $$ (NUMBER, WHEN, WHO, WHERE, WHAT)
(   1,<2025-12-26 11:06:51.23 +0400>,<Yarkov>,<DPX200>,
      <created by zg, POWCHK disabled, PULCHK disabled
       configuration hash MD5:
       00 E9 B6 7A A2 85 ED C7 34 08 36 98 17 FE 4E 26
       data hash MD5: 16K
       CF E5 D9 4A E2 F8 C4 1B 5D 56 76 96 03 B0 C7 53>)
(   2,<2025-12-26 11:06:59.32 +0400>,<Yarkov>,<DPX200>,
      <Start of raw data processing
       efp BC_mod = 2 LB = 0.25 FT_mod = 6 PKNL = 1 PHC0 = -5303.476 PHC1 = 17.22193 SI = 16K 
       data hash MD5: 16K
       33 C6 33 26 C3 95 E0 65 52 DD 81 97 ED 77 13 4E>)
$$ ##END=
$$ 
$$ hash MD5
$$ 2E C8 2E C5 26 CA 6A 33 ED 24 82 33 5A 52 6D EA
##$RELAX= 
##$RELAX= 
##$RELAX= 
##$RELAX= 
##$RELAX= 
##$RELAX= 
$$ Bruker specific parameters
$$ --------------------------
##$DU= <C:/Bruker/XWIN-NMR>
##$EXPNO= 1
##$NAME= <H-C>
##$PROCNO= 1
##$TYPE= <nmr>
##$USER= <yarkov2>
##$AMP= (0..31)
100 100 100 100 100 100 100 100 100 100 100 100 100 100 100 100 100 100 
100 100 100 100 100 100 100 100 100 100 100 100 100 100 
##$AQSEQ= 0
##$AQ_mod= 1
##$AUNM= <au_zg>
##$AUTOPOS= <>
##$BF1= 200.13
##$BF2= 200.13
##$BF3= 200.13
##$BF4= 200.13
##$BF5= 200.13
##$BF6= 200.13
##$BF7= 200.13
##$BF8= 200.13
##$BYTORDA= 1
##$CFDGTYP= 0
##$CFRGTYP= 5
##$CHEMSTR= <none>
##$CNST= (0..31)
1 1 145 1 1 1 1 1 1 1 1 1 1 1 1 1 1 1 1 1 1 1 1 1 1 1 1 1 1 1 1 1 
##$CPDPRG= <>
##$CPDPRG1= <>
##$CPDPRG2= <>
##$CPDPRG3= <>
##$CPDPRG4= <mlev>
##$CPDPRG5= <mlev>
##$CPDPRG6= <mlev>
##$CPDPRG7= <mlev>
##$CPDPRG8= <mlev>
##$CPDPRGB= <>
##$CPDPRGT= <>
##$D= (0..31)
0 0.7 0 0 0 0 0 0 0 0 0 0.03 0 0 0 0 0 0 0 0 0 0 0 0 0 0 0 0 0 0 0 0 
##$DATE= 1766732810
##$DBL= (0..7)
120 120 120 120 120 120 120 120 
##$DBP= (0..7)
150 150 150 150 150 150 150 150 
##$DBP07= 0
##$DBPNAM0= <>
##$DBPNAM1= <>
##$DBPNAM2= <>
##$DBPNAM3= <>
##$DBPNAM4= <>
##$DBPNAM5= <>
##$DBPNAM6= <>
##$DBPNAM7= <>
##$DBPOAL= (0..7)
0.5 0.5 0.5 0.5 0.5 0.5 0.5 0.5 
##$DBPOFFS= (0..7)
0 0 0 0 0 0 0 0 
##$DE= 6
##$DECBNUC= <off>
##$DECIM= 32
##$DECNUC= <off>
##$DECSTAT= 4
##$DIGMOD= 1
##$DIGTYP= 9
##$DL= (0..7)
0 120 120 120 120 120 120 120 
##$DP= (0..7)
$$ [...]
##$SUBNAM2= <"">
##$SUBNAM3= <"">
##$SUBNAM4= <"">
##$SUBNAM5= <"">
##$SUBNAM6= <"">
##$SUBNAM7= <"">
##$SUBNAM8= <"">
##$SUBNAM9= <"">
##$SW= 18.0517328524113
##$SWIBOX= (0..15)
0 0 2 0 0 0 0 0 0 0 0 0 0 0 0 0 
##$SW_h= 3612.71676300578
##$TD= 16384
##$TD0= 1
##$TE= 0
##$TE2= 300
##$TE3= 300
##$TEG= 300
##$TL= (0..7)
0 120 120 120 120 120 120 120 
##$TP= (0..7)
150 150 150 150 150 150 150 150 
##$TP07= 0
##$TPNAME0= <>
##$TPNAME1= <>
##$TPNAME2= <>
##$TPNAME3= <>
##$TPNAME4= <>
##$TPNAME5= <>
##$TPNAME6= <>
##$TPNAME7= <>
##$TPOAL= (0..7)
0.5 0.5 0.5 0.5 0.5 0.5 0.5 0.5 
##$TPOFFS= (0..7)
0 0 0 0 0 0 0 0 
##$TUNHIN= 0
##$TUNHOUT= 0
##$TUNXOUT= 0
##$USERA1= <user>
##$USERA2= <user>
##$USERA3= <user>
##$USERA4= <user>
##$USERA5= <user>
##$V9= 5
##$VALIST= <valist>
##$VCLIST= <CCCCCCCCCCCCCCC>
##$VD= 0
##$VDLIST= <DDDDDDDDDDDDDDD>
##$VPLIST= <PPPPPPPPPPPPPPP>
##$VTLIST= <TTTTTTTTTTTTTTT>
##$WBST= 1024
##$WBSW= 4
##$XGAIN= (0..3)
0 0 0 0 
##$XL= 0
##$YL= 0
##$YMAX_a= 231844
##$YMIN_a= -172591
##$ZGOPTNS= <>
##$ZL1= 120
##$ZL2= 120
##$ZL3= 120
##$ZL4= 120
##$ABSF1= 0
##$ABSF2= 0
##$ABSG= 0
##$ABSL= 0
##$ALPHA= 0
##$AQORDER= 0
##$ASSFAC= 0
##$ASSFACI= 0
##$ASSFACX= 0
##$ASSWID= 0
##$AUNMP= <proc_1d>
##$AZFE= 0.1
##$AZFW= 0.1
##$BCFW= 0
##$BC_mod= 2
##$BYTORDP= 0
##$COROFFS= 0
##$CY= -3
##$DATMOD= 1
##$DC= 0
##$DFILT= <>
##$DTYPP= 0
##$F1P= 0
##$F2P= 0
##$FCOR= 1
##$FTSIZE= 16384
##$FT_mod= 6
##$GAMMA= 0
##$GB= 0
##$INTBC= 1
##$INTSCL= 3.241238e-09
##$ISEN= 128
##$LB= 0.25
##$LEV0= 0
##$LPBIN= 0
##$MAXI= 10000
##$MC2= 0
##$MEAN= 0
##$ME_mod= 0
##$MI= 1.114404
##$NCOEF= 0
##$NC_proc= -6
##$NLEV= 6
##$NOISF1= 3.799351
##$NOISF2= 2.8
##$NSP= 0
##$NTH_PI= 0
##$NZP= 0
##$OFFSET= 15.41304
##$PC= 1
##$PHC0= -5303.476
##$PHC1= 17.22193
##$PH_mod= 1
##$PKNL= yes
##$PPARMOD= 0
##$PSCAL= 0
##$PSIGN= 0
##$REVERSE= no
##$SF= 200.13002174612
##$SI= 16384
##$SIGF1= 3
##$SIGF2= 2
##$SINO= 0.751879
##$SIOLD= 32768
##$SREGLST= <19F.Aceton>
##$SSB= 0
##$STSI= 16384
##$STSR= 0
##$SW_p= 3612.71676300578
##$SYMM= 0
##$S_DEV= 0
##$TDeff= 16384
##$TDoff= 0
##$TI= <>
##$TILT= no
##$TM1= 0
##$TM2= 0
##$TOPLEV= 0
##$USERP1= <user>
##$USERP2= <user>
##$USERP3= <user>
##$USERP4= <user>
##$USERP5= <user>
##$WDW= 1
##$XDIM= 16384
##$YMAX_p= 312342575
##$YMIN_p= -283367
$$ End of Bruker specific parameters
$$ ---------------------------------
##NTUPLES= NMR SPECTRUM
##VAR_NAME=  FREQUENCY,     SPECTRUM/REAL,   SPECTRUM/IMAG
##SYMBOL=    X,             R,               I
##VAR_TYPE=  INDEPENDENT,   DEPENDENT,       DEPENDENT
##VAR_FORM=  AFFN,          ASDF,            ASDF
##VAR_DIM=   16384,         16384,           16384
##UNITS=     HZ,            ARBITRARY UNITS, ARBITRARY UNITS
##FACTOR=    0.220516191357247, 1,           1
##FIRST=     3084.61206262133, 0,            0
##LAST=      -528.104700384449, 0,           0
##MIN=       -528.104700384449, -283367,     0
##MAX=       3084.61206262133, 312342575,    0
$$ Real data points
##PAGE= N=1
##DATA TABLE= (X++(R..R)), XYDATA
$$ [...]
$$ plain form
12299 38920 37079 32238 30959 24718 37925 34065 13066 25639 -19904 -8120 54592 -26137 -26642
12286 -26642 -25135 -64847 -5691 30983 57237 75267 124791 36964 7772 59859 48108 -1619
12274 -1619 61245 59499 -15010 -51288 -5388 58972 76257 118781 96685 120758 49966 -37670
12262 -37670 2444 -79986 17340 59838 25589 19982 46920 49004 58742 15681 -17879 -25612
12250 -25612 28748 88070 60616 19573 15065 66689 76518 -19574 -65007 9292 49222 43384
12238 43384 42337 78052 92941 34634 21942 29164 67946 37820 15540 19129 64815 70445
12226 70445 79981 24527 -48816 9598 35469 59490 -785 -15093 -10616 19861 -56887 644
12214 644 -33039 -29240 -25445 37638 41984 42011 72288 30903 -84615 -149903 -64422 8288 44437
$$ packed form
12299C8920j841m841j279o241J3207l860k0999J2573m5543J1784O2712q0729n05
12286b6642J507l9712N9156L6674K6254J8030M9524q7827k9192N2087j1751m9727
12274a619O2864j746p4509l6278M5900O4360J7285M2524k2096K4073p0792q7636
12262c7670M0114q2430R7326M2498l4249n607K6938K084R738m3061l3560p733
12250b5612N4360N9322k7454m1043m508N1624R829r6092m5433P4299L9930n838
12238D3384j047L5715J4889n8307j2692P222L8782l0126k2280L589M5686N630
12226G0445R536n5454p3343N8414K5871K4021o0275j4308M477L0477p6748N7531
12214F44l3683L799L795O3083M346K7L0277m1385j15518o5288Q5481P2710L6149
$$ plain form
12201 44437 49212 32115 9468 715 45826 -70443 -38427 59035 73729 47793 28748 9818
12189 9818 4262 3216 -21475 13280 -25741 45130 91363 24048 4910 -36617 -46258 44758
12177 44758 57878 71644 63474 72492 91505 107755 38290 19788 15290 59521 64927 -13964
12165 -13964 25792 52352 28250 41417 5421 -4051 -25626 -27273 2946 31039 -51589 -58209
12153 -58209 7715 70084 72156 67462 45780 54450 1193 65753 143780 61271 11225 70270
12141 70270 29763 3033 5097 25375 93688 65338 42049 67957 132482 -4248 55494 49785
12129 49785 47344 95125 112335 69855 9166 90782 42625 24996 -2751 49662 46108 15734
12117 15734 21974 59797 96197 19137 2828 -25162 6924 36435 79354 65231 120242 97782
$$ packed form
12201D4437M775j7097k2647q753M5111j16269L2016R7462J4694k5936j9045j8930
12189I818n556j046k4691L4755l9021P0871M6233o7315j9138m1527r641R1016
12177D4758J3120J3766q170R018J9013J6250o9465j8502m498M4231N406p8891
12165a3964L9756K6560k4102J3167l5996r472k1575j647L0219K8093q2628o620
12153e8209O5924O2369K072m694k1682Q670n3257O4560P8027q2509n0046N9045
12141G0270m0507k6730K064K0278O8313k8350k3289K5908O4525j36730N9742n709
12129D9785k441M7781J7210m2480o0689Q1616m8157j7629k7747N2413l554l0374
12117A5734O240L7823L6400p7060j6309k7990L2086K9511M2919j4123N5011k2460
$$ plain form
12105 97782 65075 61442 36949 32666 61461 13638 36565 -73869 -30545 19513 26400 90091
12093 90091 85434 47412 82653 60826 77955 44562 30748 49618 15574 -10000 -39116 -42841
12081 -42841 38001 87058 29459 68981 121991 87700 53050 95920 56707 14599 40556 81366
12069 81366 20891 -5406 -6073 23745 117126 172570 112161 1424 -10873 19268 30391 4960
12057 4960 -17586 -17919 -34415 -45473 -54236 69580 3418 39921 13296 78172 89823 69668
12045 69668 4445 -14538 -82742 -48721 -15841 65173 122455 -2605 14389 36523 33832 27701
12033 27701 87888 61497 5995 91252 89354 71415 47993 20476 40257 100771 36936 52847
12021 52847 78945 81920 24857 39522 59717 77672 90542 94272 116800 35501 32914 90666
$$ packed form
12105I7782l2707l633k4493m283K8795m7823K2927j10434M3324N0058O887O3691
12093I0091m657l8022L5241k1827J7129l3393j3814J8870l4044k5574k9116l725
12081d2841Q0842M9057n7599L9522N3010l4291l4650M2870l9213m2108K5957M0810
12069H1366o0475k6297o67K9818R3381N5444o0409j10737j2297L0141J1123k5431
12057D960k2546l33j6496j1058q763J23816o6162L6503k6625O4876J1651k0155
12045F9668o5223j8983o8204L4021L2880Q1014N7282j25060J6994K2134k691o131
12033B7701O0187k6391n5502Q5257j898j7939k3422k7517J9781O0514o3835J5911
12021E2847K6098K975n7063J4665K0195J7955J2870L730K2528q1299k587N7752
$$ plain form
12009 90666 95202 9383 -1648 -44100 2970 29295 46838 52265 77780 43021 33050 42484
11997 42484 72963 63258 107314 87306 58372 82106 58382 99270 102301 1180 63839 67576
11985 67576 51090 57551 62993 58252 68963 138600 100769 28019 42078 75602 59678 96088
11973 96088 117173 38070 54266 37964 18747 14983 9438 18686 32391 32006 39198 -24964 -57659
11960 -57659 37543 27033 -3014 -5915 75153 92358 57965 118256 128372 120021 76213 -3746
11948 -3746 52519 68143 73518 23265 30251 37916 -19968 -6857 60203 82124 63227 33895
11936 33895 14473 -6944 66794 119495 74646 56111 88008 74729 60203 80822 103035 164119
11924 164119 74152 25893 -11734 33477 54880 30356 5199 -3872 -14566 -16135 26522 69370
$$ packed form
12009I0666M536q5819j1031m2452M7070K6325J7543N427K5515l4759r971R434
11997D2484L0479r705M4056k0008k8934K3734k3724M0888L031j01121O2659L737
11985F7576j6486O461N442m741J0711O9637l7831p2750J4059L3524j5924L6410
11973I6088K1085p9103J6196j6302j9217l764n545R248J3705l85P192o4162l2695
11960e7659R5202j0510l0047k901Q1068J7205l4393O0291J0116q351m3808p9959
11948c746N6265J5624N375n0253O986P665n7884J3111O7060K1921j8897k9332
11936C3895j9422k1417P3738N2701m4849j8535L1897j3279j4526K0619K2213O1084
11924A64119q9967m8259l7627M5211K1403k4524k5157r071j0694j569M2657M2848
$$ plain form
11912 69370 14206 -76425 -69060 27072 70722 46291 17053 25923 61321 109063 100758 77572
11900 77572 97226 67463 -22928 -53954 -17748 56436 125499 91853 41804 10311 -23781 48231
11888 48231 -14228 -24767 11187 41070 58140 2611 51459 46327 -38262 15070 94082 38933
11876 38933 44549 74157 70470 36684 72164 128499 75911 29506 83092 105670 55381 39575
11864 39575 102642 131899 112299 136794 105076 84755 134543 60459 79106 108668 88665 43087
11852 43087 12144 -15462 4307 -14176 -21092 -5091 68553 65937 -333 -1583 -15208 -34850
11840 -34850 24114 24405 14595 -13355 36140 22483 12352 3962 -35214 4565 46512 48781 74424
11827 74424 5286 3661 4013 -29380 37210 109943 71762 64445 41246 11029 16422 20143 38089
$$ packed form
11912F9370n5164r0631P365R6132M3650k4431k9238Q870L5398M7742q305k3186
11900G7572J9654k9763r0391l1026L6206P4184O9063l3646n0049l1493l4092P2012
11888D8231o2459j0539L5954K9883J7070n5529M8848n132q4589N3332P9012n5149
11876C8933N616K9608l687l3786L5480N6335n2588m6405N3586K2578n0289j5806
11864C9575O3067K9257j9600K4495l1718k0321M9788p4084J8647K9562k0003m5578
11852D3087l0943k7606J9769j8483o916J6001P3644k616o6270j250j3625j9642
11840c4850N8964K91r810k7950M9495j3657j0131q390l9176L9779M1947K269K5643
11827G4424o9138j625L52l3393O6590P2733l8181p317k3199l0217N393L721J7946
$$ plain form
11814 38089 103506 76048 120313 69507 -62486 -49962 -32919 50749 81687 140999 121056
11803 121056 34794 12294 54833 36803 54902 39420 68880 102119 64281 -79225 -103909
11792 -103909 -22806 65662 -34482 28805 65082 89153 19562 97308 115481 88798 106180
11781 106180 80134 74416 85591 104327 84554 101349 106430 42129 1429 8679 18359 -10556
11769 -10556 13266 69229 74011 -22398 7478 18872 72985 107414 111632 127961 97848 63566
11757 63566 52916 27286 -13140 -67072 -49613 -59460 7732 91348 40562 44785 -13617 79278
11745 79278 60999 65240 66954 113189 72801 -23808 -46686 -56056 -86258 -25678 -7165 28994
11733 28994 1926 38444 41580 52998 52329 97303 50613 12241 5881 -5010 -18087 2359
$$ packed form
11814C8089O5417k7458M4265n0806j31993J2524J7043Q3668L0938N9312j9943
11803A21056q6262k2500M2539j8030J8099j5482K9460L3239l7838j43506k4684
11792a03909Q1103Q8468j00144O3287L6277K4071o9591P7746J8173k6683J7382
11781A06180k6046n718J1175J8736j9773J6795N081o4301m0700P250R680k8915
11769a0556K3822N5963M782r6409K9876J1394N4113L4429M218J6329l0113l4282
11757F3566j0650k5630m0426n3932J7459r847O7192Q3616n0786M223n8402R2895
11745G9278j8279M241J714M6235m0388r6609k2878r370l0202O0580J8513L6159
11733B8994k7068L6518L136J1418o69M4974m6690l8372o360j0891j3077K0446
$$ plain form
11721 2359 54557 152334 144435 141025 109504 139190 117221 123190 47073 38796 39333 61004 14368
11708 14368 27477 28378 63220 127332 134298 45058 -27915 20974 52788 36732 10974 63369
11696 63369 39203 35283 79538 43683 9957 -1165 -47884 -22632 -51008 18941 -2884 51570
11684 51570 92191 90350 33847 49993 68086 87875 69184 49260 27487 25462 -19866 -39710
11672 -39710 47050 105681 74851 96577 55203 33869 16338 29677 -27152 -36057 -49888 8904
11660 8904 -1645 5310 22425 28180 -12362 -51210 22385 45714 34488 -790 3674 69562
11648 69562 76790 98321 86774 105913 40064 25346 -7266 -12593 8189 18055 28046 8834
11636 8834 64642 137335 50694 57742 95823 86583 -21905 36408 57972 12306 49732 90553
$$ packed form
11721B359N2198R7777p899l410l1521K9686k1969N969p6117q277N37K1671m6636
11708A4368J3109R01L4842O4112O966q9240p2973M8889L1814j6056k5758N2395
11696F3369k4166l920M4255l5855l3726j1122m6719K5252k8376O9949k1825N4454
11684E1570M0621j841n6503J6146J8093J9789j8691j9924k1773k025m5328j9844
11672c9710Q6760N8631l0830K1726m1374k1334j7531J3339n6829q905j3831N8792
11660H904j0549O955J7115N755m0542l8848P3595K3329j1226l5278M464O5888
11648F9562P228K1531j1547J9139o5849j4718l2612n327K0782R866R991j9212
11636H834N5808P2693q6641P048L8081r240j08488N8313K1564m5666L7426M0821
$$ plain form
11624 90553 127567 51490 74075 24593 -2207 90434 80906 16877 65516 75869 82397 74728
11612 74728 120275 147894 125449 90971 84185 36315 20164 84886 127237 104811 61237 77297
11600 77297 48839 1908 34738 73009 101622 64040 23496 -10871 19935 55538 90660 23612
11588 23612 8018 5156 13606 13572 77497 66772 43253 89513 85469 80561 142765 86101 153161
11575 153161 147745 91174 47147 76785 89681 65651 28217 40621 84445 53986 47810 50002
11563 50002 25916 61016 6922 -8851 33087 131494 135529 -38749 -50472 40880 -2771 -9271
11551 -9271 -22828 15316 30562 28645 9389 95315 132610 109881 85400 76308 60300 56059
11539 56059 29342 -36237 24136 71219 93069 42162 51539 89835 86132 99623 88625 42738
$$ packed form
11624I0553L7014p6077K2585m9482k6800R2641r528o4029M8639J0353O528p669
11612G4728M5547K7619k2445l4478o786m7870j6151O4722M2351k2426m3574J6060
11600G7297k8458m6931L2830L8271K8613l7582m0544l4367L0806L5603L5122o7048
11588B3612j5594k862Q450l4O3925j0725k3519M6260m044m908O2204n6664O7060
11575A53161n416n6571m4027K9638J2896k4030l7434J2404M3824l0459o176K192
11563E0002k4086L5100n4094j5773M1938R8407M035j74278j1723R1352m3651o500
11551i271j3557L8144J5246j917j9256Q5926L7295k2729k4481r092j6008m241
11539E6059k6717o5579O0373M7083K1850n0907R377L8296l703J3491j0998m5887
$$ plain form
11527 42738 2523 -6938 11478 27180 41943 54213 61759 -23440 66232 35628 7540 43981
11515 43981 59813 27868 91089 22654 58644 -9242 44423 63326 12129 1139 49523 56341
11503 56341 65754 36185 50420 78831 19605 51367 123542 130718 56093 58436 93662 83712
11491 83712 57665 69642 48658 65805 62645 17185 -6739 -14806 -20853 -9504 -14425 49697
11479 49697 246 58904 95296 138404 75796 78430 87280 16039 -29502 107362 129474 102587
11467 102587 114600 73854 18781 -18028 -21170 53685 85744 87560 66052 80853 78236 -20699
11455 -20699 49612 60146 45467 24042 -28218 -14864 64052 91508 62964 69298 114259 149298
11443 149298 138033 60364 98810 89775 55270 34625 66835 65968 68648 134374 38329 72494
$$ packed form
11527D2738m0215r461J8416J5702J4763J2270P546q5199Q9672l0604k8088L6441
11515D3981J5832l1945O3221o8435L5990o7886N3665J8903n1197j0990M8384O818
11503E6341R413k9569J4235K8411n9226L1762P2175P176p4625K343L5226r950
11491H3712k6047J1977k0984J7147l160m5460k3924q067o047J1349m921O4122
11479D9697m9451N8658L6392M3108o2608K634Q850p1241m5541J36864K2112k6887
11467A02587J2013m0746n5073l6809l142P4855L2059J816k1508J4801k617r8935
11455b0699P0311J0534j4679k1425n2260J3354P8916K7456k8544O334M4961L5039
11443A49298j1265p7669L8446r035l4505k0645L2210q67K680O5726r6045L4165
$$ plain form
11431 72494 102156 68204 91788 35851 29273 5329 81403 -6636 88126 122994 64591 8411
11419 8411 11941 32106 49744 74767 114116 55414 58324 101974 132338 98647 -18703 -24755
11407 -24755 77793 42533 36842 53270 54507 -16993 -13713 29495 -24228 -73522 -1722 -4464
11395 -4464 21680 -28409 -11907 48197 26064 40532 40343 26166 53872 61659 1705 -3282 -22746
11382 -22746 86030 103159 64901 -1482 55974 65361 69808 40258 47343 46367 74490 60564
11370 60564 70591 55241 21194 33958 109223 33242 101832 109475 104101 31210 47642 -27313
11358 -27313 22240 42499 62585 38233 28031 -41924 9544 8731 55614 36642 116988 -5511
11346 -5511 9390 61038 33684 26900 19581 53494 23031 -22271 -2069 99329 87728 35580
$$ packed form
11431G2494K9662l3952K3584n5937o578k3944P6074q8039R4762L4868n8403n6180
11419H411L530K0165J7638K5023L9349n8702K910M3650L0364l3691j17350o052
11407b4755J02548l5260n691J6428J237p1500L280M3208n3723m9294P1800k742
11395d464K6144n0089J6502O0104k2133J4468j89j4177K7706P787n9954m987j9464
11382b2746J08776J7129l8258o6383N7456R387M447k9550P085r76K8123j3926
11370F0564J0027j5350l4047J2764P5265p5981O8590P643n374p2891J6432p4955
11358b7313M9553K0259K0086k4352j0202o9955N1468q13M6883j8972Q0346j22499
11346e511J4901N1648k7354o784p319L3913l0463m5302K0202J01398j1601n2148
$$ plain form
11334 35580 -10193 40824 -880 14637 46488 60846 85673 107533 23882 53247 -17683 62744
11322 62744 50421 52773 104023 109354 158933 137208 48808 38863 22769 48362 87646 105667
11310 105667 67206 124418 92357 79583 24204 23586 65191 97683 50600 25446 -3400 38831
11298 38831 15474 21011 29214 31750 41409 50400 21595 88732 43677 -7780 -12070 70202 108848
11285 108848 103140 65988 55823 73623 92810 67598 81575 77091 50346 21351 77863 60269
11273 60269 26583 26310 78921 8103 -33159 -40994 29673 30579 -15598 32988 30017 48442 68230
11260 68230 63801 40989 73170 -10993 57962 67261 92875 60666 58336 85554 156258 121182
11248 121182 93912 84738 110896 74091 55262 17026 -39177 32707 36850 4241 112547 67562
$$ packed form
11334C5580m5773N1017m1704J5517L1851J4358K4827K1860q3651K9365p0930Q0427
11322F2744j2323K352N1250N331M9579k1725q8400r945j6094K5593L9284J8021
11310A05667l8461N7212l2061j2774n5379o18M1605L2492m7083k5154k8846M2231
11298C8831k3357N537Q203K536R659Q991k8805O7137m5055n1457m290Q2272L8646
11285A08848n708l7152j0165J7800J9187k5212J3977m484k6745k8995N6512j7594
11273F0269l3686k73N2611p0818m1262p835P0667R06m6177M8586k971J8425J9788
11260F8230m429k2812L2181q4163O8955R299K5614l2209k330K7218P0704l5076
11248A21182k7270r174K6158l6805j8829l8236n6203P1884M143l2609J08306m4985
$$ plain form
11236 67562 63486 15922 43004 34478 129862 81605 68946 -27238 -47771 -46278 4714 -70044
11224 -70044 45386 56247 11857 6520 15776 6139 -33542 18357 52323 60252 43649 63015
11212 63015 24730 43706 18995 54577 -16702 -9294 27617 113718 83601 41963 11621 -12562
11200 -12562 -18495 -4016 1457 53804 68328 79237 109057 90435 70280 114655 110350 81839
11188 81839 94624 109766 -780 32349 40786 31148 11152 91466 117807 55567 61017 145481
11176 145481 77080 79400 9961 5526 52685 108433 1081 17006 66145 41799 28755 37787
11164 37787 41825 -8640 72909 124602 117900 89268 65693 102492 33162 -1886 9253 -4252
11152 -4252 -41728 -59480 -6049 -40684 -30076 -20267 41824 26308 22685 5735 -8861 23628
$$ packed form
11236F7562m076m7564K7082q526R5384m8257j2659r6184k0533J493N0992p4758
11224g0044J15430J0861m4390n337R256r637l9681N1899L3966P929j6603J9366
11212F3015l8285J8976k4711L5582p1279P408L6911Q6101l0117m1638l0342k4183
11200a2562n933J4479N473N2347J4524J0909K9820j8622k0155M4375m305k8511
11188H1839J2785J5142j10546L3129Q437r638j9996Q0314K6341o2240N450Q4464
11176A45481o8401K320o9439m435M7159N5748j07352J5925M9139k4346j3044R032
11164C7787M038n0465Q1549N1693o702k8632k3575L6799o9330l5048J1139j3505
11152d252l7476j7752N3431l4635J0608R809O2091j5516l623j6950j4596L2489
$$ plain form
11140 23628 15233 25741 -37266 2173 42987 51230 68130 15856 55076 88910 97061 32931
11128 32931 26935 52501 125461 83623 79716 45057 5180 -17170 -28586 -22622 -14327 -17271 -3939
11115 -3939 21837 14770 19835 54819 14093 87655 68544 47539 64599 76405 8454 7561 24031
11102 24031 59835 -5423 -36494 -28897 7971 48390 87705 97595 3812 1285 13220 59407
11090 59407 -13292 -25429 -2081 42102 66230 75461 74552 12870 3082 105465 169252 109082
11078 109082 102124 135590 110524 41143 62220 111569 99703 80570 61988 33185 53904 26867
11066 26867 -10496 2866 1349 90065 50952 81485 31692 49482 90471 52959 65374 98127
11054 98127 22269 25748 5476 6206 10974 60191 79360 89141 77352 31256 28469 39925 104952
$$ packed form
11140B3628q395J0508o3007L9439M0814Q243J6900n2274L9220L3834Q151o4130
11128C2931n996K5566P2960m1838l907l4659l9877k2350j1416N964Q295k944J3332
11115c939K5776p067N065L4984m0726P3562j9111k1005J7060J1806o7951q93J6470
11102B4031L5804o5258l1071P597L6868M0419L9315R890r3783k527J1935M6187
11090E9407p2699j2137K3348M4183K4128R231r09o1682r788J02383O3787o0170
11078A09082o958L3466k5066o9381K1077M9349j1866j9133j8582k8803K0719k7037
11066B6867l7363J3362j517Q8716l9113L0533m9793J7790M0989l7512J2415L2753
11054I8127p5858L479k0272P30M768M9217J9169R781j1789m6096k787J1456O5027
$$ plain form
11041 104952 144046 95228 80264 127423 122760 93461 68866 87156 46080 88200 86246 84675
11029 84675 107704 109794 117184 89667 22536 47800 89434 80304 -20943 -2896 -9007 45131
11017 45131 76811 39336 22071 44836 42875 85976 -2625 -1299 877 3646 39573 84766
11005 84766 60191 81992 122612 162138 103426 81432 67327 46349 56297 66996 92073 64415
10993 64415 43229 -4037 27906 29286 56429 12855 -2297 25899 -4286 -38272 -9441 14932
10981 14932 -39862 42179 148158 99663 101770 58243 21145 27993 58836 74416 10936 -31572
10969 -31572 19720 36215 55266 -15198 -3890 43535 84786 -3921 8900 20034 59011 44803
10957 44803 72248 64253 36652 90283 112830 61300 95243 12227 17522 -10881 -36124 -73915
$$ packed form
11041A04952L9094m8818j4964M7159m663k9299k4595J8290m1076M2120j954j571
11029H4675K3029K090P390k7517o7131K5264M1634r130j01247J8047o111N4138
11017D5131L1680l7475j7265K2765j961M3101q8601J326K176K769L5927M5193
11005H4766k4575K1801M0620L9526n8712k1994j4105k0978R948J0699K5077k7658
10993F4415k1186m7266L1943J380K7143m3574j5152K8196l0185l3986K8831K4373
10981A4932n4794Q2041J05979m8495K107m3527l7098O848L0843J5580o3480m2508
10969c1572N1292J6495J9051p0464J1308M7425M1251q8707J2821J1134L8977j4208
10957D4803K7445p995k7601N3631K2547n1530L3943q3016N295k8403k5243l7791
$$ plain form
10945 -73915 94404 121620 38488 7477 2086 44744 88708 18223 4904 -12966 52009 62397
10933 62397 -11378 70552 43378 13326 11984 28801 18313 53698 83525 48163 39189 58074
10921 58074 70691 9814 25256 29671 -79482 -53244 1966 62062 1569 -15163 6348 49372
10909 49372 99099 16897 25626 92621 46035 25048 -13339 994 48358 73743 66460 51087
10897 51087 79290 40612 1569 57942 45439 89275 94841 103688 104750 127242 46286 48105
10885 48105 76117 80080 3689 -15911 37292 74373 59486 93881 83781 130326 84629 53993
10873 53993 54288 75663 10511 92930 90565 89014 60544 79728 26840 105517 19302 56878
10861 56878 58878 17431 -18684 31731 56706 30659 72037 94552 124498 84965 58567 -16381
$$ packed form
10945g3915J68319K7216q3132l1011n391M2658M3964p0485j3319j7870O4975J0388
10933F2397p3775Q1930k7174l0052j342J6817j0488L5385K9827l5362q974J8885
10921E8074J2617o0877J5442M415j09153K6238N5210O0096o0493j6732K1511M3024
10909D9372M9727q2202Q729O6995m6586k0987l8387J4333M7364K5385p283j5373
10897E1087K8203l8678l9043N6373j2503M3836N566Q847J062K2492q0956J819
10885D8105K8012L963p6391j9600N3203L7081j4887L4395j0100M6545m5697l0636
10873E3993K95K1375o5152Q2419k365j551k8470J9184n2888P8677q6215L7576
10861E6878K000m1447l6115N0415K4975k6047M1378K2515K9946l9533k6398p4948
$$ plain form
10849 -16381 50235 57693 -6486 54871 78080 88100 74170 -25987 34449 82980 88113 31393
10837 31393 34834 7146 82892 56563 45933 61250 38446 39408 23058 31430 61797 52985 83465
10824 83465 55764 40713 90829 83322 22010 -6223 -42380 -5628 -17673 12099 38239 48070
10812 48070 46891 125788 59702 90828 94929 72451 43707 40831 70164 105404 59119 67835
10800 67835 71178 73543 91345 126822 45114 8061 -40222 -36974 -7111 15400 24482 10548
10788 10548 29017 52494 5378 -24130 -11663 2064 57748 133199 124502 152471 102380 12956
10776 12956 67469 66241 18832 12098 27681 71403 20410 6979 55140 27906 32944 9026
10764 9026 -37151 -45490 -6811 10196 69688 59831 22287 10232 -52881 -11161 34077 4927
$$ packed form
10849a6381O6616P458o4179O1357K3209J0020j3930j00157O0436M8531N133n6720
10837C1393L441k7688P5746k6329j0630J5317k2804R62j6350Q372L0367q812L0480
10824H3465k7701j5051N0116p507o1312k8233l6157L6752j2045K9772K6140R831
10812D8070j179P8897o6086L1126M101k2478k8744k876K9333L5240m6285Q716
10800F7835L343K365J7802L5477q1708l7053m8283L248K9863K2511R082j3934
10788A0548J8469K3477m7116k9508J2467J3727N5684P5451q697K7969n0091q9424
10776A2956N4513j228m7409o734J5583M3722n0993j3431M8161k7234N038k3918
10764I026m6177q339L8679J7007N9492r857l7544j2055o3113M1720M5238k9150
$$ plain form
10752 4927 81243 52477 33625 41430 26040 5998 126599 57711 54347 85978 62063 28084
10740 28084 26880 -4673 31167 30664 29451 -22703 -16101 43850 37609 29124 59949 10756 -38955
10727 -38955 36505 89954 84390 32054 71213 88904 60726 48130 76520 36061 16707 38324
10715 38324 51454 45750 60317 49192 -32353 -70932 8967 -26236 -46390 42467 52825 61141
10703 61141 26640 39402 73340 50593 30287 74561 110351 94556 94151 88615 91609 42818
10691 42818 48166 78729 134400 119340 77437 27485 41143 30278 78289 24777 -49162 19955
10679 19955 30128 11083 4233 33104 3133 44445 130734 68699 82874 97638 80525 59111
10667 59111 4704 -22996 17246 29072 38407 -5009 4923 49853 46563 101243 33050 13355
$$ packed form
10752D927P6316k8766j8852P805j5390k0042J20601o8888l364L1631k3915l3979
10740B8084j204l1553L5840n03j213n2154O602N9951o241q485L0825m9193m9711
10727c8955P5460N3449n564n2336L9159J7691k8178j2596K8390m0459j9354K1617
10715C8324J3130n704J4567j1125q1545l8579P9899l5203k0154Q8857J0358Q316
10703F1141l4501J2762L3938k2747k0306M4274L5790j5795m05n536K994m8791
10691D2818N348L0563N5671j5060m1903m9952J3658j0865M8011n3512p3939O9117
10679A9955J0173j9045o850K8871k9971M1312Q6289o2035J4175J4764j7113k1414
10667E9111n4407k7700M0242J1826R335m3416R932M4930l290N4680o8193j9695
$$ plain form
10655 13355 -33726 -31783 -50843 20176 23367 8517 17371 69326 62070 77736 98762 67311
10643 67311 96020 68239 94444 35096 55993 97557 77889 37228 -13160 32180 69356 65222
10631 65222 81406 98594 58386 6748 57220 129917 60068 33210 20879 23183 15980 8147
10619 8147 74588 49760 19476 24462 87339 86509 92368 66147 89185 103213 99813 117720 10187
10606 10187 -14475 -17318 73366 49331 50566 8534 67073 94003 86913 101146 60843 61841 53634
10593 53634 8725 24623 17149 60210 21417 107685 125976 70826 29391 -2943 63503 61070
10581 61070 69359 66239 -17718 8073 35848 38101 48986 54053 66350 78252 125046 148489
10569 148489 100316 110027 167633 92359 82910 69582 97820 132318 52147 15253 16674 -59868
$$ packed form
10655A3355m7081J943j9060P1019L191j4850Q854N1955p256J5666K1026l1451
10643F7311K8709k7781K6205n9348K0897M1564j9668m0661n0388M5340L7176m134
10631F5222J6184J7188m0208n1638N0472P2697o9849k6858j2331K304p203p833
10619H147O6441k4828l0284M986O2877q30N859k6221K3038J4028l400J7907j07533
10606A0187k4662k843R0684k4035J235m2032N8539K6930p090J4233m0303R98q207
10593E3634m4909J5898p474M3061l8793Q6268J8291n5150m1435l2334O6446k433
10581F1070Q289l120q3957K5791K7775K253J0885N067J2297J1902M6794K3443
10569A48489m8173R711N7606p5274r449j3328K8238L4498q0171l6894J421p6542
$$ plain form
10557 -59868 20217 -27038 12312 1618 21908 -914 3937 11625 15983 27219 76263 4812
10545 4812 -53384 3857 69401 21984 87871 47028 58215 24221 31223 99880 70351 27374
10533 27374 24489 -27827 4162 89014 111019 105468 46471 1678 38551 58673 123310 137942
10521 137942 88943 78092 55893 61693 27223 33053 74878 34724 35984 87703 67936 43783
10509 43783 19415 -10606 -13736 58169 40355 16591 48172 29459 28516 46192 2939 38054
10497 38054 8298 82832 40681 25081 48041 108496 40020 63182 74886 37842 46391 60177
10485 60177 72772 105635 79408 138346 136969 135905 100658 111257 37851 18120 48042 68257
10473 68257 49687 24934 89790 52877 92289 49681 22693 54719 77229 25814 30796 47306
$$ packed form
10557e9868Q0085m7255L9350j0694K0290k2822M851P688M358J1236M9044p1451
10545D812n8196N7241O5544m7417O5887m0843J1187l3994P002O8657k9529m2977
10533B7374k885n2316L1989Q4852K2005n551n8997m4793L6873K0122O4637J4632
10521A37942m8999j0851k2199N800l4470N830M1825m0154J260N1719j9767k4153
10509D3783k4368l0021l130P1905j7814k3764L1581j8713r43J7676m3253L5115
10497C8054k9756P4534m2151j5600K2960O0455o8476K3162J1704l7044Q549J3786
10485F0177J2595L2863k6227N8938j377j064l5247J0599p3406j9731K9922K0215
10473F8257j8570k4753O4856l6913L9412m2608k6988L2026K2510n1415M982J6510
$$ plain form
10461 47306 66280 43673 31987 26644 -7632 -34450 5991 18467 -3311 11834 56180 72636
10449 72636 71872 45723 41339 85884 40470 -40290 15981 59793 67733 35438 21990 42611
10437 42611 14087 51249 89593 51103 38467 31193 89436 33496 -19309 -40550 16715 48296
10425 48296 92706 96495 195598 152187 120041 83300 77821 129728 44496 75851 85714 107105
10413 107105 110822 71890 34203 32230 57430 66499 58011 60294 84429 95350 94995 82411 41809
10400 41809 132905 33707 20221 50202 31986 30448 38098 2358 -20036 -36007 -6387 25197
10388 25197 44730 11705 25456 59397 125657 80613 53202 15671 72307 118449 113458 47541
10376 47541 28769 90314 98191 76133 65692 66910 -1228 54364 102832 44370 25014 46188
$$ packed form
10461D7306J8974k2607j1686n343l4276k6818M0441J2476k1778J5145M4346J6456
10449G2636p64k6149m384M4545m5414q0760N6271M3812P940l2295j3448K0621
10437D2611k8524L7162L8344l8490j2636p274N8243n5940n2805k1241N7265L1581
10425D8296M4410L789R9103m3411l2146l6741n479N1907q5232L1355R863K1391
10413A07105L717l8932l7687j973K5200R069q488K283K4135J0921l55j2584m0602
10400D1809R1096r9198j3486K9981j8216j538P650l5740k2394j5971K9620L1584
10388B5197J9533l3025J3751L3941O6260m5044k7411l7531N6636M6142m991o5917
10376D7541j8772O1545P877k2058j0441J218o8138N5592M8468n8462j9356K1174
$$ plain form
10364 46188 43630 24234 18403 6840 25530 14179 40941 45212 75834 29285 30159 6744 67506
10351 67506 79317 43998 49794 89612 34326 12794 37643 82739 160910 65366 64849 86159
10339 86159 69504 12067 3335 25306 13142 -24693 38049 71785 79744 46902 102898 97610
10327 97610 73451 69863 107588 54959 77035 46844 86923 72611 -3312 32031 63531 105922
10315 105922 108732 37279 18580 -6124 19921 89556 103399 5223 7726 24215 84952 13341
10303 13341 11028 51992 56197 88444 61730 33549 125041 169175 188777 139104 121411 46478
10291 46478 36762 66871 154899 117930 69625 87014 103847 121852 132167 113713 85148 77185
10279 77185 97983 131785 144691 65192 29593 117614 65626 45452 41368 115193 150332 72061
$$ packed form
10364D6188k558j9396n831j1563J8690j1351K6762M271L0622m6549Q74k3415O0762
10351F7506J1811l5319N796L9818n5286k1532K4849M5096P8171r5544n17K1310
10339H6159j6655n7437q732K1971j2164l7835O2742L3736P959l2842N5996n288
10327I7610k4159l588L7725n2629K2076l0191M0079j4312p5923L5343L1500M2391
10315A05922K810p1453j8699k4704K6045O9635J3843r8176K503J6489O0737p1611
10303A3341k313M0964M205L2247k6714k8181R1492M4134J9602m9673j7693p4933
10291D6478r716L0109Q8028l6969m8305J7389J6833J8005J0315j8454k8565p963
10279G7185K0798L3802J2906p9499l5599Q8021n1988k0174m084P3825L5139p8271
$$ plain form
10267 72061 30104 133552 127500 62045 68539 104885 13485 51221 77354 107403 127484 134613
10255 134613 70355 65082 71576 35490 -14668 6360 85834 109801 134227 139978 131027 135733
10243 135733 142980 167246 110826 39721 37108 36569 -24542 39196 11420 41803 173825 122262
10231 122262 92035 80583 52282 71044 95959 169390 158763 97888 58676 78165 140372
10220 140372 155189 140876 58205 31678 97268 50849 93614 104404 101145 73343 24916 91228
10208 91228 105114 107374 113312 118633 76402 40157 95807 158638 166348 126689 84727 79419 75625
10195 75625 138143 158383 164276 105961 57048 52111 54404 77549 79970 122665 110222 124023
10183 124023 117266 77577 68084 123182 117949 135175 91551 60672 59992 35073 51282 99670
$$ packed form
10267G2061m1957J03448o052o5455O494L6346r1400L7736K6133L0049K0081P129
10255A34613o4258n273O494l6086n0158K1028P9474K3967K4426N751q951M706
10243A35733P247K4266n6420p1105k613n39o1111O3738k7776L0383J32022n1563
10231A22262l0227j1452k8301J8762K4915P3431j0627o0875l9212J9489O2207
10220A40372J4817j4313q2671k6527O5590m6419M2765J0790l259k7802m8427O6312
10208I1228J3886K260N938N321m2231l6245N5650O2831P710l9659m1962n308l794
10195G5625O2518K0240N893n8315m8913m937K293K3145K421M2695j2443J3801
10183A24023o757l9689r493N5098n233J7226m3624l0879o80k4919J6209M8388
$$ plain form
10171 99670 81499 67921 71904 87507 45646 15933 7450 26933 93974 21960 68660 91158
10159 91158 133015 133762 153196 104952 76303 148686 136317 97163 183319 163097 76779 128842
10147 128842 184374 195252 143294 164856 134255 135951 166041 208062 159595 79866 17234 41869
10135 41869 37252 33631 52630 122126 142293 78282 112714 79891 17730 53243 103905 150508
10123 150508 130499 141277 140562 99151 130538 127269 138242 120074 145509 114821 119975 68703
10111 68703 23574 4043 15909 79879 103625 71394 69312 94711 97446 117279 146850 122462
10099 122462 117429 165189 132394 109320 159888 141258 144094 119243 96859 134403 180888 156946
10087 156946 131284 170530 175460 204984 133991 120755 107813 140294 241198 205216 223081
$$ packed form
10171I9670j8171j3578L983J5603m1861k9713q483J9483O7041p2014M6700K2498
10159I1158M1857P47J9434m8244k8649P2383j2369l9154Q6156k0222q6318N2063
10147A28842N5532J0878n1958K1562l0601J696L0090M2021m8467p9729o2632K4635
10135D1869m617l621J8999O9496K0167o4011L4432l2823o2161L5513N0662M6603
10123A50508k0009J0778p15m1411L1387l269J0973j8168K5435l0688N154n1272
10111F8703m5129j9531J1866O3970K3746l2231k082K5399K735J9833K9571k4388
10099A22462n033M7760l2795k3074N0568j8630K836k4851k2384L7544M6485k3942
10087A56946k5662L9246M930K9524p0993j3236j2942L2481J00904l5982J7865
$$ plain form
10076 223081 228752 227512 278740 306133 267165 357046 372216 403415 454284 471184 498008 553178
10064 553178 581235 607562 554932 586391 584365 580491 615635 632463 621396 607948 613614 572744
10052 572744 465238 407502 438591 357794 396485 408383 334706 409396 377195 345893 320481
10041 320481 365838 397121 409564 416822 375530 379282 411782 396448 419536 456070 468144 521441
10029 521441 562995 663322 730612 760099 716592 752296 768189 711182 648653 651734 609255
10018 609255 606171 505727 421627 417718 390016 391337 319462 274986 341801 340014 312609 261133
10006 261133 277205 301366 219440 191403 242222 193444 157109 179639 196357 255720 213452
9995 213452 183463 223784 242436 269854 248449 209193 214155 235901 266851 291141 230654 220517
$$ packed form
10076B23081N671j240N1228K7393l8968Q9881J5170L1199N0869J6900K6824N5170
10064E53178K8057K6327n2630L1459k026l874L5144J6828j1067j3448N666m0870
10052E72744j07506n7736L1089q0797L8691J1898p3677P4690l2201l1302k5412
10041C20481M5357L1283J2443P258m1292L752L2500j5334K3088L6534J2074N3297
10029E21441M1554J00327O7290K9487m3507L5704J5893n7007o2529L081m2479
10018F09255l084j00444q4100l909k7702J321p1875m4476O6815j787k7405n1476
10006B61133J6072K4161q1926k8037N0819m8778l6335K2530J6718N9363m2268
9995B13452k9989M0321J8652K7418k1405l9256M962K1746L0950K4290o0487j0137
$$ plain form
9983 220517 237620 291386 228599 257185 155326 182532 252130 231012 253338 241941 229142
9972 229142 232752 223274 230027 218046 219798 264452 306750 298120 215975 172287 216761 248182 228380
9959 228380 293595 294494 297324 306332 302210 282760 226452 226264 250364 200850 264355 298795 240229
9946 240229 208529 190027 267698 254454 238352 241120 239694 301261 258470 270967 294926 293535
9934 293535 271155 235144 280902 263432 229005 259593 250697 258699 263524 278842 322276 320105
9922 320105 256778 234655 307211 272510 294923 336042 256359 284218 310859 275052 255814 297612
9910 297612 297860 341199 309204 321643 359347 317537 320892 271972 269563 363339 303402 336210
9898 336210 334397 305924 319226 308161 350220 388395 336346 328119 344176 349827 408902 341691
$$ packed form
9983B20517J7103N3766o2787K8586j01859K7206O9598k1118K2326j1397j2799
9972B29142L610r478O753j1981J752M4654M2298q630q2145m3688M4474L1421j9802
9959B28380O5215Q99K830R008m122j9450n6308j88K4100m9514O3505L4440n8566
9946B40229l1700j8502P7671j3244j6102K768j426O1567m2791J2497K3959j391
9934B93535k2380l6011M5758j7470l4427L0588q896Q002M825J5318M3434k171
9922C20105o3327k2123P2556l4701K2413M1119p9683K7859K6641l5807j9238M1798
9910B97612K48M3339l1995J2439L7704m1810L355m8920k409R3776n9937L2808
9898C36210j813k8473J3302j1065M2059L8175n2049q227J6057N651N9075o7211
$$ plain form
9886 341691 395842 376799 360996 403397 432455 433094 407045 317910 313874 444689 400056 354078
9874 354078 413897 460614 421166 427036 475478 404486 377865 385487 434868 424473 441563 470343
9862 470343 430293 400410 384182 450690 507137 469254 460216 405296 403415 486909 446339 470876
9850 470876 541711 554634 497424 519277 582612 522392 468022 485692 499264 485005 470884 519403
9838 519403 535645 568093 574048 521728 465005 495818 548337 622569 586913 583488 594143 638386
9826 638386 636202 691576 713496 744141 710353 741082 729068 737053 720245 730256 788147 869676
9814 869676 855526 871396 905968 937674 972567 1029139 1091779 1142952 1142623 1153309 1191255 1210977
9802 1210977 1251360 1194546 1291404 1292567 1266715 1312183 1340229 1294114 1365292 1442323 1440314 1393132
$$ packed form
9886C41691N4151j9043j5803M2401K9058O39k6049q9135m036J30815m4633m5978
9874C54078N9819M6717l9448N870M8442p0992k6621P622M9381j0395J7090K8780
9862D70343m0050k9883j6228O6508N6447l7883r038n4920j881Q3494m0570K4537
9850D70876P0835J2923n7210K1853O3335o0220n4370J7670J3572j4259j4121M8519
9838E19403J6242L2448N955n2320n6723L0813N2519P4232l5656l425J0655M4243
9826F38386k184N5374K1920L0645l3788L0729j2014P985j6808J0011N7891Q1529
9814H69676j4150J5870L4572L1706L4893N6572O2640N1173l29J0686L7946J9722
9802A210977M0383n6814R6858J163k5852M5468K8046m6115P1178P7031k009m7182
$$ plain form
9790 1393132 1410231 1424744 1469526 1515772 1590829 1588313 1659019 1637856 1656495 1739497 1732256 1726924
9778 1726924 1799065 1850627 1908268 1967019 2099364 2161591 2219751 2280585 2300592 2285786 2342274
9767 2342274 2415515 2423185 2425879 2554943 2647293 2679161 2636558 2745982 2844729 2957286 2969367
9756 2969367 3104258 3139741 3177780 3213618 3271639 3417695 3498277 3533947 3557603 3643592 3659528
9745 3659528 3730292 3864664 4003998 4061570 4171240 4395568 4485744 4645622 4788864 4923095
9735 4923095 5093369 5262897 5582215 5821483 6076137 6284577 6575820 6802937 7157546 7606018
9725 7606018 8152316 8583936 9068837 9546735 10134217 10818660 11680341 12575818 13640980
9716 13640980 14743898 16063520 17718707 19824467 22476216 25930743 30566750 36940829
$$ packed form
9790A393132J7099J4513M4782M6246P5057k516P0706k1163J8639Q3002p241n332
9778A726924P2141N1562N7641N8751J32345O2227N8160O0834K0007j4806N6488
9767B342274P3241P670K694J29064R2350L1868m2603J09424R8747J12557J2081
9756B969367J34891L5483L8039L5838N8021J46056Q0582L5670K3656Q5989J5936
9745C659528P0764J34372J39334N7572J09670K24328R0176J59878J43242J34231
9735D923095J70274J69528L19318K39268K54654K08440K91243K27117L54609M48472
9725G606018N46298M31620M84901M77898N87482O84443Q61681Q95477J065162
9716A3640980J102918J319622J655187K105760K651749L454527M636007O374079
$$ plain form
9708 36940829 45221317 54994663 64133393 70222508 73389382 75576542 78766046 83749890
9700 83749890 89565574 94270622 96426993 95050661 89094820 79989210 69566384 59577924
9692 59577924 50979470 43988411 38577920 34532107 31588933 29532827 28171302 27372354
9684 27372354 27039246 27049957 27382747 28078582 29178572 30803328 33175535 36022741 39500587
9675 39500587 43091892 46754794 50356975 54515538 59913304 67322290 77158327 88717622
9667 88717622 99618217 107928609 112339930 112438617 108751212 101941234 92243308 80813612
9659 80813612 69022080 58180229 48908401 41336182 35147944 30470381 26863183 24136004
9651 24136004 21928554 20180364 18824763 17644806 16606924 15643307 14778303 14010097 13293166
$$ packed form
9708C6940829Q280488R773346R138730O089115L166874K187160L189504M983844
9700H3749890N815684M705048K156371j376332n955841r105610j0422826r988460
9692E9577924q598454o991059n410491m045813k943174k056106j361525p98948
9684B7372354l33108J0711L32790O95835J099990J624756K372207K847206L477846
9675C9500587L591305L662902L602181M158563N397766P408986R836037J1559295
9667H8717622J0900595Q310392M411321R8687l687405o809978r697926j1429696
9659H0813612j1791532j0841851r271828p572219o188238m677563l607198k727179
9651B4136004k207450j748190j355601j179957j037882r63617q65004p68206p16931
$$ plain form
9642 13293166 12601364 11903588 11297862 10766504 10318941 9858401 9444170 9113158 8736043
9633 8736043 8462161 8144953 7851080 7615862 7386013 7106444 6890117 6720531 6526408 6223579
9623 6223579 6024214 5875165 5749554 5522745 5280329 5093674 4905156 4770292 4609773 4442184
9613 4442184 4301265 4177540 4065814 3978775 3944101 3863379 3703620 3567722 3558951 3556118 3523940
9602 3523940 3416760 3352625 3233704 3177365 3052103 2994906 2850566 2783862 2757181 2670111 2548506
9591 2548506 2558188 2477421 2505474 2323044 2297075 2294328 2287755 2292977 2255447 2231741 2179558 2073325
9579 2073325 2048326 1993974 1901970 1867399 1838196 1833181 1885846 1870086 1822438 1834120 1863292 1845394
9567 1845394 1842610 1796589 1765278 1727045 1705808 1659424 1568082 1597826 1521189 1516891 1484880 1522306
$$ packed form
9642A3293166o91802o97776o05726n31358m47563m60540m14231l31012l77115
9633H736043k73882l17208k93873k35218k29849k79569k16327j69586j94123l02829
9623F223579j99365j49049j25611k26809k42416j86655j88518j34864j60519j67589
9613D442184j40919j23725j11726q7039l4674q0722j59759j35898q771k833l2178
9602C523940j07180o4135j18921n6339j25262n7197j44340o6704k6681q7070j21605
9591B548506R682q0767K8053j82430k5969k747o573N222l7530k3706n2183j06233
9579B073325k4999n4352r2004l4571k9203n015N2665j5760m7648J1682K9172j7898
9567A845394k784m6021l1311l8233k1237m6384r1342K9744p6637m298l2011L7426
$$ plain form
9555 1522306 1458774 1423560 1432973 1469800 1507085 1461867 1413769 1440080 1379812 1351630 1411768 1436029
9543 1436029 1350496 1387405 1332536 1272533 1330356 1319959 1232619 1266091 1214677 1239182 1157805
9532 1157805 1114794 1123203 1153489 1153322 1155181 1080438 1067136 1004609 966284 963849 983607 963182
9520 963182 983882 986756 981572 949228 953848 968771 849307 775964 850282 957577 969119 954487
9508 954487 879396 897112 923974 935207 917657 882253 867186 903614 871245 881657 836057 832278
9496 832278 716729 774189 769600 802529 803734 742736 730977 754594 702812 731139 693155 744150
9484 744150 772361 790665 752606 760550 719024 722017 732435 807728 861924 890640 917576 879322
9472 879322 782226 846082 875944 879969 857982 812273 856427 798425 861835 878523 813837 772974
$$ packed form
9555A522306o3532l5214R413L6827L7285m5218m8098K6311o0268k8182O0138K4261
9543A436029q5533L6909n4869o0003N7823j0397q7340L3472n1414K4505q1377
9532A157805m3011Q409L0286j67J859p4743j3302o2527l8325k435J9758k0425
9520I63182K0700K874n184l2344M620J4923j19464p3343P4318J07295J1542j4632
9508I54487p5091J7716K6862J1233j7550l5404j5067L6428l2369J0412m5600l779
9496H32278j15549N7460m589L2929J205o0998j1759K3617n1782K8327l7984N0995
9484G44150K8211J8304l8059P944m1526K993J0418P5293N4196K8716K6936l8254
9472H79322r7096O3856K9862M025k1987m5709M4154n8002O3410J6688o4686m0863
$$ plain form
9460 772974 806283 847868 837183 786173 782648 808783 890372 886575 877865 854066 901302 918619
9448 918619 924866 856577 904612 907205 976997 1061250 1082355 1102176 1177631 1136012 1148262 1178833
9436 1178833 1226007 1198989 1330244 1214795 1198269 1230879 1164484 1100467 1100834 1119367 1202238
9425 1202238 1122775 1121752 1019101 1025244 977372 988629 992125 1025239 956683 918551 870681 903568
9413 903568 937866 1009946 967494 969717 1071533 1067804 1098969 1070540 1069607 1169295 1202903 1182742
9401 1182742 1154789 1158397 1211054 1200458 1163960 1134243 1080895 1046643 1033880 955727 953026 955938
9389 955938 992687 952688 945269 958490 1001088 951393 887364 903821 931663 877613 911876 932766
9377 932766 914740 825194 901473 880832 918174 920654 968039 884890 966345 885654 930387 875981
$$ packed form
9460G72974L3309M1585j0685n1010l525K6135Q1589l797q710k3799M7236J7317
9448I18619O247o8289M8035K593O9792Q4253K1105J9821P5455m1619J2250L0571
9436A178833M7174k7018J31255j15449j6526L2610o6395o4017L67J8533Q2871
9425A202238p9463j023j02651O143m7872J1257L496L3114o8556l8132m7870L2887
9413I03568L4298P2080m2452K223J01816l729L1165k8429r33R9688L3608k0161
9401A182742k7953L608N2657j0596l6498k9717n3348l4252j2763p8153k701K912
9389I55938L6749l9999p419J3221M2598m9695o4029J6457K7842n4050L4263K0890
9377I32766j8026q9546P6279k0641L7342K480M7385q3149Q1455q0691M4733n4406
$$ plain form
9365 875981 972857 929887 926032 913704 966509 941440 921615 930229 982144 957134 1089454 1016691
9353 1016691 976861 1058281 1067912 1030188 1086092 1034987 1113097 1143815 1156126 1150998 1177445 1301465
9341 1301465 1377255 1434551 1473849 1428334 1488528 1542978 1521111 1469822 1435568 1448722 1400024
9330 1400024 1392704 1424833 1523393 1595348 1672777 1694062 1660970 1687803 1754636 1833320 1879843 1895653
9318 1895653 1962488 1880028 1857760 1840524 1838529 1848592 1800766 1809781 1878015 1817599 1852314 1839561
9306 1839561 1873302 1926410 1995334 1956064 1965743 1890211 1971581 1950321 1914031 1899191 1875247 1874694
9294 1874694 1894430 1923791 2015233 2118084 2201269 2177530 2229395 2176432 2210556 2270592 2284232
9283 2284232 2290559 2291327 2276313 2220559 2110247 2072883 2009318 1949222 1927093 1885613 1870962 1821780
$$ packed form
9365H75981R6876m2970l855j2328N2805k5069j9825Q614N1915k5010J32320p2763
9353A016691l9830Q1420R631l7724N5904n1105P8110L0718J2311n128K6447J24020
9341A301465P5790N7296L9298m5515O0194N4450k1867n1289l4254J3154m8698
9330A400024p320L2129R8560P1955P7429K1285l3092K6833O6833P8684M6523J5810
9318A895653O6835q2460k2268j7236j995J0063m7826R015O8234o0416L4715j2753
9306A839561L3741N3108O8924l9270R679p5532Q1370k1260l6290j4840k3944n53
9294A874694J9736K9361R1442J02851Q3185k3739N1865n2963L4124O0036J3640
9283B284232O327P68j5014n5754j10312l7364o3565o0096k2129m1480j4651m9182
$$ plain form
9271 1821780 1750582 1705084 1720383 1769956 1784208 1855989 1804486 1833894 1848480 1886647 1890703 1902078
9259 1902078 1897705 1929658 1996214 2046800 2057908 2130853 2107103 2086377 2092185 2092077 2033045 1991009
9247 1991009 2003793 1970300 2008318 2028747 2074365 2082798 2068502 2090663 2085213 2075468 2037158 1983849
9235 1983849 2026077 2032268 2072537 2123699 2158903 2165512 2180447 2224782 2242316 2304068 2275423 2196248
9223 2196248 2191128 2256795 2249183 2322204 2382557 2446458 2481474 2512702 2571717 2590910 2615472 2661821
9211 2661821 2625226 2654264 2757951 2765759 2740616 2803690 2843362 2859483 2858035 2901597 2957293 3098936
9199 3098936 3130871 3139537 3221661 3346657 3371504 3412921 3487219 3544425 3609621 3696550 3789203
9188 3789203 3895880 3949839 4009853 4007450 4153342 4183740 4193928 4272650 4360985 4434254 4495419
$$ packed form
9271A821780p1198m5498J5299M9573J4252P1781n1503K9408J4586L8167M056J1375
9259A902078m373L1953O6556N0586J1108P2945k3750k0726N808j08n9032m2036
9247A991009J2784l3493L8018K0429M5618Q433j4296K2161n450r745l8310n3309
9235A983849M2228O191M0269N1162L5204O609J4935M4335J7534O1752k8645p9175
9223B196248n120O5667p612P3021O0353O3901L5016L1228N9015J9193K4562M6349
9211B661821l6595K9038J03687P808k5143O3074L9672J6121j448M3562N5696J41643
9199C098936L1935Q666Q2124J24996K4847M1417P4298N7206O5196Q6929R2653
9188C789203J06677N3959O0014k403J45892L0398J0188P8722Q8335P3269O1165
$$ plain form
9177 4495419 4580000 4690898 4732435 4853287 5043037 5124976 5253027 5375230 5600974 5686497
9167 5686497 5833682 5895459 6013753 6115774 6274024 6370595 6510748 6654219 6774648 6903723
9157 6903723 7026570 7127992 7259065 7400633 7595485 7701113 7893992 8076463 8286497 8496942
9147 8496942 8732677 8940955 9129800 9300588 9499117 9687346 10055990 10304981 10625549 10830406
9137 10830406 11057783 11259244 11667381 12046013 12387679 12810293 13361084 13830449 14441488
9128 14441488 15041291 15804342 16736702 17921382 19270846 21106331 23251116 26167328 29819605
9119 29819605 33793871 37346575 39905436 41432528 42713120 43935923 45239979 45526744
9111 45526744 44506833 42308523 39694675 37107317 34965716 33163629 31898500 30976547
$$ packed form
9177D495419Q4581J10898M1537J20852J89750Q1939J28051J22203K25744Q5523
9167E686497J47185O1777J18294J02021J58250R6571J40153J43471J20429J29075
9157F903723J22847J01422J31073J41568J94852J05628J92879J82471K10034K10445
9147H496942K35735K08278J88845J70788J98529J88229L68644K48991L20568K04857
9137A0830406K27377K01461M08137L78632L41666M22614N50791M69365O11039
9128A4441488N99803P63051R32360J184680J349464J835485K144785K916212L652277
9119B9819605L974266L552704K558861J527092J280592J222803J304056K86765
9111D5526744j019911k198310k613848k587358k141601j802087j265129r21953
$$ plain form
9103 30976547 30641443 30536562 30738569 31188707 32008788 33083908 34491040 36067729 38041383
9094 38041383 40372616 43282217 46486605 49858288 52987983 56205341 59732479 64087510
9086 64087510 69307963 75776235 82885643 90161502 96758170 101704679 104411951 105769555
9078 105769555 106865478 108710271 110595258 111242216 109382310 105428655 100574214 95935725
9070 95935725 92290127 90331539 90539076 93081750 98138122 106976102 122179196 148868061
9062 148868061 194162028 259489142 312342575 306380854 273604711 230918157 193138680
9055 193138680 166016040 143784087 129708076 122610773 121340071 122657279 125342068 126556472
9047 126556472 126541450 125463193 124799465 123805914 121768136 116833369 109584300 100675048 91852072
$$ packed form
9103C0976547l35104j04881K02007M50138Q20081J075120J407132J576689J973654
9094C8041383K331233K909601L204388L371683L129695L217358L527138M355031
9086F4087510N220453O468272P109408P275859O596668M946509K707272J357604
9078A05769555J095923J844793J884987O46958j859906l953655m854441m638489
9070I5935725l645598j958588K07537K542674N056372Q837980J5203094K6688865
9062A48868061M5293967O5327114N2853433n961721l2776143m2686554l7779477
9055A93138680k7122640k2231953j4076011p097303j270702J317208K684789J214404
9047A26556472j5022j078257o63728r93551k037778m934767p249069q909252q822976
$$ plain form
9038 91852072 83465399 76448580 70312180 65484080 61455594 58382206 55791464 53767686
9030 53767686 51979057 50685639 49328557 48222427 47035796 46131468 45060399 44269113
9022 44269113 43429373 42759702 42085480 41502876 40785386 40255908 39612871 39212419 38606604
9013 38606604 38068625 37465095 36983278 36414454 36095371 35730012 35403163 34952604 34762545
9004 34762545 34505300 34278740 34073903 33939536 33690353 33525056 33338000 33154946 33012291
8995 33012291 32973267 32852373 32890561 32821410 32849962 32832449 32957414 33085272 33281725 33407909
8985 33407909 33719243 33970830 34317444 34651723 35057187 35551439 36128295 36799768 37538017
8976 37538017 38410849 39444845 40603774 41938521 43410570 45239731 47422739 50004489
$$ packed form
9038I1852072q386673p016819o136400m828100m028486l073388k590742k023778
9030E3767686j788629j293418j357082j106130j186631r04328j071069p91286
9022D4269113q39740o69671o74222n82604p17490n29478o43037m00452o05815
9013C8606604n37979o03530m81817n68824l19083l65359l26849m50559j90059
9004C4762545k57245k26560k04837j34367k49183j65297j87056j83054j42655
8995C3012291l9024j20894L8188o9151K8552j7513J24965J27858J96453J26184
8985C3407909L11334K51587L46614L34279M05464M94252N76856O71473P38249
8976C7538017Q72832J033996J158929J334747J472049J829161K183008K581750
$$ plain form
8968 50004489 53139027 57000274 61751839 67601763 75250610 85059016 98007091 114796648
8960 114796648 136004720 160406307 184911175 205248618 217756090 220208495 213755491
8953 213755491 202038030 188086674 173399459 158243903 142702116 127573306 113836037
8946 113836037 101980899 92104383 84291466 78138475 73528162 70108581 67687131 66037640
8938 66037640 65148144 64862234 65266279 66324354 68330493 71487502 76294155 83154162 92477699
8929 92477699 104555104 118721892 133927949 149501445 162082827 170479719 175411068
8922 175411068 177183684 176863379 174571054 170296312 163816885 155626032 145916259 135405036
8914 135405036 124604856 113772603 102908631 92473347 82836210 74466214 67404044
$$ packed form
8968E0004489L134538L861247M751565N849924P648847R808406J2948075J6789557
8960A14796648K1208072K4401587K4504868K0337443J2507472K452405o453004
8953B13755491j1717461j3951356j4687215j5155556j5541787j5128810j3737269
8946A13836037j1855138r876516p812917o152991m610313l419581k421450j649491
8938F6037640q89496k85910M04045J058075K006139L157009M806653O860007R323537
8929I2477699J2077405J4166788J5206057J5573496J2581382Q396892M931349
8922A75411068J772616l20305k292325m274742o479427q190853r709773j0511223
8914A35405036j0800180j0832253j0863972j0435284r637137q369996p062170
$$ plain form
8907 67404044 61619303 56955996 53288643 50385678 48030939 46228876 44985830 44256238
8899 44256238 44105985 44586300 45856236 48224002 51701313 56091375 60273477 62969447
8891 62969447 63929621 63951490 63427159 61918635 58757188 54047491 48699763 43498067 38846049
8882 38846049 34916633 31549034 28921182 26828676 25081998 23549475 22410403 21439899
8874 21439899 20562503 19765353 19111508 18464480 17854114 17196790 16596645 16053688 15579051
8865 15579051 15085931 14669890 14147663 13764979 13386053 13048975 12763629 12584944 12287011
8856 12287011 12015106 11710825 11513425 11250029 11025073 10799417 10548367 10268880 10102004
8847 10102004 9905850 9728969 9483801 9317687 9066084 8846281 8659429 8591584 8439331 8288658
$$ packed form
8907F7404044n784741m663307l667353k902965k354739j802063j243046p29592
8899D4256238j50253M80315J269936K367766L477311M390062M182102K695970
8891F2969447R60174K1869n24331j508524l161447m709697n347728n201696m652018
8882C8846049l929416l367599k627852k092506j746678j532523j139072r70504
8874B1439899q77396p97150o53845o47028o10366o57324o00145n42957m74637
8865A5579051m93120m16041n22227l82684l78926l37078k85346j78685k97933
8856A2287011k71905l04281j97400k63396k24956k25656k51050k79487j66876
8847A0102004j96154j76881k45168j66114k51603k19803j86852o7845j52253j50673
$$ plain form
8837 8288658 8110390 7987965 7822720 7632030 7472831 7353854 7217147 7083758 6973362 6849665
8827 6849665 6767181 6639999 6507633 6422015 6396372 6338493 6180662 6064942 5988759 5781910
8817 5781910 5702360 5624395 5547688 5447494 5410424 5338129 5372089 5298667 5200419 5069631 5034935
8806 5034935 4995725 5010980 4899298 4852004 4791353 4784603 4712482 4635751 4538489 4473671 4407202
8795 4407202 4386972 4263394 4302575 4250192 4235221 4159683 4084677 3986100 3951891 3952206 3877023 3817301
8783 3817301 3741879 3677642 3704348 3685317 3648619 3517190 3389631 3259897 3270166 3257362 3255785
8772 3255785 3203773 3196564 3242135 3239251 3217875 3223163 3151880 3102307 3087526 3115592 3155144 3186163
8760 3186163 3167722 3150427 3111314 3022023 2998229 3019967 2966484 2848450 2835990 2910020 2874281
$$ packed form
8837H288658j78268j22425j65245j90690j59199j18977j36707j33389j10396j23697
8827F849665q2484j27182j32366q5618k5643n7879j57831j15720p6183k06849
8817E781910p9550p7965p6707j00194l7070p2295L3960p3422r8248j30788l4696
8806E034935l9210J5255j11682m7294o0651o750p2121p6731r7262o4818o6469
8795D407202k0230j23578L9181n2383j4971p5538p5006r8577l4209L15p5183n9722
8783C817301p5422o4237K6706j9031l6698j31429j27559j29734J0269j2804j577
8772C255785n2012p209M5571k884k1376N288p1283m9573j4781K8066L9552L1019
8760C186163j8441j7295l9113q9291k3794K1738n3483j18034j2460P4030l5739
$$ plain form
8749 2874281 2836698 2874235 2848116 2867198 2825207 2773982 2737330 2705662 2645705 2600599 2531228
8738 2531228 2518232 2474646 2459574 2445840 2436924 2449013 2463591 2390183 2409419 2375577 2371269 2389499
8726 2389499 2432558 2421851 2406730 2432472 2322496 2286475 2374702 2425925 2423180 2374079 2339508
8715 2339508 2285242 2439861 2492473 2431618 2418524 2442738 2440869 2446283 2428109 2355418 2272749 2197667
8703 2197667 2137499 2087270 2045754 1975504 1961996 1928086 1869914 1876538 1908972 1820397 1831771 1846714
8691 1846714 1840135 1832596 1780805 1757864 1732331 1712649 1726766 1703093 1811795 1749519 1725417 1760609
8679 1760609 1773040 1719686 1657223 1635266 1659533 1693246 1718928 1590965 1561736 1496607 1549438
8668 1549438 1530580 1484327 1462100 1418906 1375623 1382984 1377309 1336492 1327861 1275046 1322069 1297839
$$ packed form
8749B874281l7583L7537k6119J9082m1991n1225l6652l1668n9957m5106o9371
8738B531228j2996m3586j5072j3734q916J2089J4578p3408J9236l3842m308J8230
8726B389499M3059j0707j5121K5742j09976l6021Q8227N1223k745m9101l4571
8715B339508n4266J54619N2612o0855j3094K4214j869N414j8174p2691q2669p5082
8703B197667o0168n0229m1516p0250j3508l3910n8172O624L2434q8575J1374J4943
8691A846714o579p539n1791k2941k5533j9682J4117k3673J08702o2276k4102L5192
8679A760609J2431n3354o2463k1957K4267L3713K5682j27963k9229o5129N2831
8668A549438j8858m6253k2227m3194m3283P361n675m0817q631n2815M7023k4230
$$ plain form
8656 1297839 1252311 1308422 1343618 1295281 1265565 1202839 1205455 1179315 1141735 1101210 1135846 1126162
8644 1126162 1140047 1161404 1156112 1114048 1134677 1080582 1120162 1132461 1179451 1101216 1040517 1042299
8632 1042299 1153026 1114003 1007929 973186 1050357 971407 940475 990562 1040284 1056457 1096332
8621 1096332 1084372 1020023 998228 1003658 988664 1027621 969437 1051212 1079508 1028472 1047790 1050892
8609 1050892 1039423 1043167 1070700 1130429 1097381 1053542 1097762 1156359 1189386 1217229 1277056 1425077
8597 1425077 1441678 1453929 1533087 1649333 1681248 1688633 1651233 1571852 1488025 1516529 1414302
8586 1414302 1297796 1304493 1310450 1333532 1304987 1410062 1383490 919590 830728 947306 938128
8575 938128 972187 987259 989707 942515 991082 1025367 1042397 1086961 1227530 1181109 1182250 1288552
$$ packed form
8656A297839m5528N6111L5196m8337k9716o2726K616k6140l7580m0525L4636r684
8644A126162J3885K1357n292m2064K0629n4095L9580J2299M6990p8235o0699J782
8632A042299J10727l9023j06074l4743P7171p8950l0932N0087M9722J6173L9875
8621A096332j1960o4349k1795N430j4994L8957n8184Q1775K8296n1036J9318L102
8609A050892j1469L744K7533N9729l3048m3839M4220N8597L3027K7843N9827J48021
8597A425077J6601J2251P9158J16246L1915P385l7400p9381q3827K8504j02227
8586A414302j16506O697N957K3082k8545J05075k6572m63900q8862J16578r178
8575I38128L4059J5072K448m7192M8567L4285J7030M4564J40569m6421J141J06302
$$ plain form
8563 1288552 1345748 1343790 1515377 1558720 1595663 1576024 1606955 1518574 1532843 1456494 1428085
8552 1428085 1346288 1221194 1168039 1131445 1019503 990968 953710 961008 883666 837000 858008
8541 858008 912616 850052 808896 780579 813550 811038 786981 805895 866724 833656 846249 853206
8529 853206 953016 983493 1017020 968884 900042 940865 977562 887548 831928 786742 699264 692313
8517 692313 650045 663251 743799 730535 701645 686056 627019 616030 623391 686349 599488 531950
8505 531950 493224 591484 580991 581489 643424 669151 637532 549850 525626 535233 566780 555935
8493 555935 537138 521986 469923 520411 484668 438000 538117 523737 496117 454484 438956
8482 438956 510119 497051 469058 491679 481775 442306 533431 512964 501438 502154 437164 447897
$$ packed form
8563A288552N7196j958J71587M3343L6943j9639L0931q8381J4269p6349k8409
8552A428085q1797j25094n3155l6594j11942k8535l7258P298p7342m6666K1008
8541H58008N4608o2564m1156k8317L2971k512k4057J8914O0829l3068J2593O957
8529H53206R9810L0477L3527m8136o8842M0823L6697r0014n5620m5186q7478o951
8517F92313m2268J3206Q0548j3264k8890j5589n9037j0989P361O2958q6861o7538
8505E31950l8726R8260j0493M98O1935K5727l1619q7682k4224R607L1547j0845
8493E55935j8797j5152n2063N0488l5743m6668J00117j4380k7620m1633j5528
8482D38956P1163j3068k7993K2621r904l9469R1125k0467j1526P16o4990J0733
$$ plain form
8470 447897 476327 447212 434430 426952 462567 411928 470939 484271 552940 541051 567775 577662
8458 577662 550647 499650 472223 488207 497894 499839 519862 552502 574768 542221 550153 532934
8446 532934 482472 426255 408275 415979 436858 454820 451342 516742 543160 460870 447203 416186
8434 416186 359104 419846 452820 463403 435394 400542 399439 481475 527003 424953 367040 377872
8422 377872 372808 377681 396765 391806 448442 527789 478886 479819 427195 360327 379108 428323 362408
8409 362408 374671 348014 297105 276622 317236 346631 338058 318555 374600 337980 316680 352269
8397 352269 395142 360826 309997 287421 254865 289463 334938 391187 320961 250205 236561 277506
8385 277506 272151 249276 280457 265618 273175 331171 337884 284220 319824 319799 312002 313789 264618
$$ packed form
8470D47897K8430k9115j2782p478L5615n0639N9011J3332O8669j1889K6724R887
8458E77662k7015n0997k7427J5984R687J945K0023L2640K2266l2547P932j7219
8446E32934n0462n6217j7980P704K0879J7962l478O5400K6418q2290j3667l1017
8434D16186n7082O0742L2974J0583k8009l4852j103Q2036M5528j02050n7913J0832
8422C77872n064M873J9084m959N6636P9347m8903R33n2624o6868J8781M9215o5915
8409C62408J2263k6657n0909k0483M0614K9395q573j9503N6045l6620k1300L5589
8397C52269M2873l4316n0829k2576l2556L4598M5475N6249p0226p0756j3644M0945
8385B77506n355k2875L1181j4839P557N7996O713n3664L5604k5p797J787m9171
$$ plain form
8372 264618 299650 333714 302163 304187 346413 299923 323228 353094 350863 306399 377678 411159
8360 411159 374273 244301 281639 317019 260375 265176 303088 351738 349023 276911 303785 358300
8348 358300 364015 288942 316998 328230 325927 252855 257791 358316 290821 237757 316502 284163
8336 284163 189045 193006 307328 347635 391903 391690 386500 388647 337290 286798 305268 304170 288186
8323 288186 323041 303282 268392 242170 212725 307716 332668 389586 407792 352873 321538 333904
8311 333904 347418 295602 270476 268733 310124 233386 300737 335348 332348 274135 237747 276703
8299 276703 346991 372827 384305 354085 324070 268957 258999 186490 330706 290569 230827 281472
8287 281472 298440 244086 350179 316929 293276 260051 293268 200205 227469 193104 194272 289371
$$ packed form
8372B64618L5032L4064l1551K024M2226m6490K3305K9866k231m4464P1279L3481
8360D11159l6886j29972L7338L5380n6644M801L7912M8650k715p2112K6874N4515
8348C58300N715p5073K8056J1232k303p3072M936J00525o7495n3064P8745l2339
8336B84163r5118L961J14322M0307M4268k13n190K147n1357n0492J8470j098j5984
8323B88186L4855j9759l4890k6222k9445R4991K4952N6918J8206n4919l1335J2366
8311C33904J3514n1816k5126j743M1391p6738O7351L4611l000n8213l6388L8956
8299B76703P0288K5836J1478l0220l0015n5113r958p2509J44216m0137n9742N0645
8287B81472J6968n4354J06093l3250k3653l3225L3217r3063K7264l4365J168R5099
$$ plain form
8275 289371 315407 272662 252777 225249 276528 267241 286441 250140 303047 341470 337369 342040
8263 342040 289218 259133 291338 227755 193122 199941 239526 238031 238163 299263 270276 247219
8251 247219 258857 256723 203974 216015 194750 216583 216025 299247 279455 292211 198765 254573
8239 254573 193300 214585 247140 259222 224871 193562 151634 177446 143056 161309 238637 288962
8227 288962 237639 223323 153143 204384 227895 282109 250249 152759 138270 205860 219317 214439
8215 214439 242914 215918 145139 153073 143930 160356 224999 276399 260314 218904 173849 169754
8203 169754 194974 103073 197356 254525 169251 207453 156754 216351 222412 131638 273643 1472457
8191 1472457 1043012 436948 494344 333736 385195 267834 248446 217738 369719 334164
$$ packed form
8275B89371K6036m2745j9885k7528N1279r287J9200l6301N2907L8423m101M671
8263C42040n2822l0085L2205o3583l4633O819L9585j495J32O1100k8987k3057
8251B47219J1638k134n2749J2041k1265K1833n58Q3222j9792J2756r3446N5808
8239B54573o1273K1285L2555J2082l4351l1309m1928K5812l4390J8253P7328N0325
8227B88962n1323j4316p0180N1241K3511N4214l1860r7490j4489O7590J3457m878
8215B14439K8475k6996p0779P934r143J6426O4643N1400j6085m1410m5055m095
8203A69754K5220r1901R4283N7169q5274L8202n0699N9597O061r0774J42005J198814
8191A472457m29445o06064N7396j60608N1459j17361j9388l0708J51981l5555
$$ plain form
8181 334164 462524 398189 305402 158511 302257 335039 307115 226151 302545 301292 357589
8170 357589 247695 176274 147050 214375 157612 248597 214477 202154 129980 140091 95311
8159 95311 157995 233771 254608 178551 141027 178407 220136 221705 216091 167097 121263 167428
8147 167428 171178 242732 250299 242890 285752 259144 212062 239168 224632 247950 206946 190529
8135 190529 175240 201990 207658 251394 181081 196537 136715 183667 123078 171828 192880 212881
8123 212881 198583 258963 156633 140223 155744 218061 208553 173079 161201 236110 229606 240883
8111 240883 232474 249932 158834 165018 144354 211330 184151 143599 111809 127354 93016 178249
8099 178249 148231 191923 199521 207086 185267 181215 171557 160134 203812 158297 203157 223156
$$ packed form
8181C34164J28360o4335r2787j46891J43746L2782k7924q0964P6394j253N6297
8170C57589j09894p1421k9224O7325n6763R0985l4120j2323p2174J0111m4780
8159I5311O2684P5776K0837p6057l7524L7380M1729J569n614m8994m5834M6165
8147A67428L750P1554P567p409M2862k6608m7082K7106j4536K3318m1004j6417
8135A90529j5289K6750N668M3736p0313J5456n9822M6952o0589M8750K1052K0001
8123B12881j4298O0380j02330j6410J5521O2317r508l5474j1878P4909o504J1277
8111B40883q409J7458r1098O184k0664O6976k7179m0552l1790J5545l4338Q5233
8099A78249l0018M3692P598P565k1819m052r658j1423M3678m5515M4860J9999
$$ plain form
8087 223156 219905 234332 188416 203135 238755 190665 221903 119568 166839 153511 134464 108983
8075 108983 190380 134675 51408 41323 189347 124081 125426 176438 140114 109249 178194 178496
8063 178496 288577 221897 218292 201109 292673 187893 264804 177698 209549 192227 214696
8052 214696 266780 254628 151255 198206 221919 199135 133532 125350 139674 176873 157229 204634
8040 204634 178630 267115 216711 138574 136146 179347 180383 195267 227078 200231 193597 120244
8028 120244 122753 108339 173389 205099 222006 184412 149710 153749 163318 90929 166627 202369
8016 202369 217580 92390 187575 203862 194082 147017 170086 170186 152469 125513 187089 194973
8004 194973 207726 137638 204523 148706 178205 128163 178493 161502 161137 202564 204120 215241
$$ packed form
8087B23156l251J4427m5916J4719L5620m8090L1238j02335M7271j3328j9047k5481
8075A08983Q1397n5705q3267j0085J48024o5266J345N1012l6324l0865O8945L02
8063A78496J10081o6680l605j7183R1564j04780P6911q7106L1851j7322K2469
8052B14696N2084j2152j03373M6951K3713k2784o5603q182J4324L7199j9644M7405
8040B04634k6004Q8485n0404p8137k428M3201J036J4884L1811k6847o634p3353
8028A20244K509j4414O5050L1710J6907l7594l4702M039R569p2389P5698L5742
8016B02369J5211j25190R5185J6287r780m7065K3069J00j7717k6956O1576P884
8004A94973J2753p0088O6885n5817K9499n0042N0330j6991l65M1427J556J1121
$$ plain form
7992 215241 263517 142791 96594 133522 174597 129199 180171 212589 219872 253092 243793 188373
7980 188373 226460 167868 59546 90127 215134 201916 137709 154781 156429 134859 122028
7969 122028 159961 133060 132887 174028 175158 156859 158552 101602 113434 95025 140435 131943 160856
7956 160856 157362 156481 147173 175516 167793 169762 154986 147502 94173 132926 79476 136700 122869
7943 122869 121875 190955 240258 186882 118039 118477 153131 155541 219881 162133 178726 146460 198753
7930 198753 197314 238519 223903 171836 172974 105582 152484 181582 239114 220815 254370 130116
7918 130116 139037 111118 62219 78759 123359 135113 94502 88255 176484 143430 131567 158379
7906 158379 144465 135501 135505 99623 148591 197163 212222 237095 226319 153782 154995 171335 156729
$$ packed form
7992B15241M8276j20726m6197L6928M1075m5398N0972L2418P283L3220r299n5420
7980A88373L8087n8592j08322L0581J25007j3218o4207J7072J648k1570j2831
7969A22028L7933k6901j73M1141J130j8299J693n6950J1832j8409M5410q492K8913
7956A60856l494q81r308K8343p723J969j4776p484n3329L8753n3450N7224j3831
7943A22869r94O9080M9303n3376o8843M38L4654K410O4340n7748J6593l2266N2293
7930A98753j439M1205j4616n2067J138o7392M6902K9098N7532j8299L3555j24254
7918A30116Q921k7919m8899J6540M4600J1754m0611o247Q8229l3054j1863K6812
7906A58379j3914q964Ml5882M8968M8572J5059K4873j0776p2537J213J6340j4606
$$ plain form
7893 156729 141601 179594 181378 188420 144330 171660 163331 103477 95706 166592 77982 51177
7881 51177 80024 64744 94802 97888 107339 121189 99498 157109 162084 110844 104395 76883 108096
7868 108096 153508 125027 108240 59942 129782 139813 102732 95614 59219 31665 104987 167243
7856 167243 183144 159490 146535 166757 128758 146734 203672 224886 165202 144932 80825 108869
7844 108869 75947 140344 101865 151993 88295 79760 89907 95578 114622 158026 114382 174445
7832 174445 140574 115974 33223 36115 118693 197314 158295 187409 143332 185684 216645 225350
7820 225350 127804 127327 103516 104245 101906 142997 138844 116788 80610 108335 174990 172702 151161
7807 151161 156989 200388 -68341 -21415 259027 154389 147580 83181 65709 72566 78752 124003
$$ packed form
7893A56729j5128L7993J784P042m4090K7330q329n9854p771P0886q8610k6805
7881E1177K8847j5280L0058L086R451J3850k1691N7611M975n1240o449k7512L1213
7868A08096M5412k8481j6787m8298O9840J0031l7081p118l6395k7554P3322O2256
7856A67243J5901k3654j2955K0222l7999J7976N6938K1214n9684k0270o4107K8044
7844A08869l2922O4397l8479N0128o3698q535J0147N671J9044M3404m3644O0063
7832A74445l3871k4600q2751K892Q2578P8621l9019K9114m4077M2352L0961Q705
7820B25350r7546m77k3811P29k339M1091m153k2056l6178K7725O6655k288k1541
7807A51161N828M3399k68729M6926K80442j04638o809o4399j7472O857O186M5251
$$ plain form
7795 124003 144609 95824 126592 187469 92955 158274 137866 178498 128557 104933 94908 196722
7783 196722 219166 150077 157067 133976 63919 134881 146615 153785 127877 145212 123808 101745
7771 101745 124818 186187 146950 163692 116812 98080 115250 163156 58668 130555 137771 72936
7759 72936 60017 134901 74862 101887 173451 194980 172235 181833 119123 137045 79371 123728
7747 123728 100666 124584 147215 160501 113858 160332 163092 151571 175983 139899 177357 236303
7735 236303 137787 136035 153744 146922 127081 146064 124660 78501 35549 60075 167112 213749
7723 213749 171592 120590 183913 205339 114373 44987 66283 135146 171689 106210 92601 27608
7711 27608 82445 84025 105243 107725 88182 146837 189877 185181 202493 116698 149868 147497 163755
$$ packed form
7795A24003K0606m8785L0768O0877r4514O5319k0408M0632m9941k3624j0025J01814
7783A96722K2444o9089O990k3091p0057P0962J1734P170k5908J7335k1404k2063
7771A01745K3073O1369l9237J6742m6880j8732J7170M7906j04488P1887P216o4835
7759G2936j2919P4884o0039K7025P1564K1529k2745R598o2710J7922n7674M4357
7747A23728k3062K3918K2631J3286m6643M6474K760j1521K4412l6084L7458N8946
7735B36303r8516j752J7709o822j9841J8983k1404m6159m2952K4526J07037M6637
7723B13749m2157n1002O3323K1426r0966o9386K1296O8863L6543o5479j3609o4993
7711B7608N4837J580K1218K482j9543N8655M3040m696J7312q5795L3170k371J6258
$$ plain form
7698 163755 184105 175525 138153 185852 89367 150363 138211 194316 168777 151380 162567 102409
7686 102409 66385 123338 42179 118951 130776 146286 88996 140572 82044 45833 33937 76106
7674 76106 138770 186311 120798 126185 52958 93807 116714 96917 26772 -2765 58607 44867
7662 44867 65505 131365 100537 114238 105325 117696 146419 112396 53254 78149 88935 98957
7650 98957 97489 129874 159600 131704 119765 83451 165379 158295 128955 105012 169615 179601
7638 179601 176954 134066 132858 90867 163360 161309 113164 69305 43179 55990 192614 183223
7626 183223 126575 61176 109102 100614 156591 98003 92506 45771 55951 60242 62200 -2835
7614 -2835 157761 113010 138485 116815 122177 123937 182814 165928 210330 166657 101909 -39984
$$ packed form
7698A63755K0350q580l7372M7699r6485O0996j2152N6105k5539j7397J1187o0158
7686A02409l6024N6953q1159P6772J1825J5510n7290N1576n8528l6211j1896M2169
7674G6106O2664M7541o5513N387p3227M0849K2907j9797p0145k9537O1372j3740
7662D4867K0638O5860l0828J3701q913J2371K8723l4023n9142K4895J0786J0022
7650I8957j468L2385K9726k7896j1939l6314Q1928p084k9340k3943O4603R986
7638A79601k647m2888j208m1991P2493k051m8145m3859k6126J2811J36624r391
7626A83223n6648o5399M7926q488N5977n8588n497m6735J0180M291J958o5035
7614b835J60596m4751K5475k1670N362J760N8877j6886M4402m3673o4748j41893
$$ plain form
7602 -39984 -23915 36932 87747 152408 136772 107545 102859 76347 122422 138224 165334 63868
7590 63868 51921 14929 31462 24626 112282 118617 59693 50635 67501 96035 41161 75687
7578 75687 9453 111792 110015 115034 82748 144458 99700 107051 82066 123439 103001 83940
7566 83940 99105 208388 34627 -39123 30771 103686 55480 97743 34939 139435 73752
7555 73752 68093 44400 47269 -23338 58320 100972 108140 105652 97366 86885 147919 44791 30183
7542 30183 52951 83714 101521 132203 94976 131702 99681 111416 130934 95552 36907 69815
7530 69815 109698 164701 227403 108170 83201 147144 179816 160794 146782 137859 174123 67730
7518 67730 101280 55612 97756 47782 40011 26863 65327 103314 69265 96413 112129 99729
$$ packed form
7602c9984J6069O0847N0815O4661j5636k9227m686k6512M6075J5802K7110j01466
7590F3868j1947l6992J6533o836Q7656O335n8924r058J6866K8534n4874L4526
7578G5687o6234J02339j777N019l2286O1710m4758P351k4985M1373k0438j9061
7566H3940J5165J09283j73761p3750O9894P2915m8206M2263o2804J04496o5683
7555G3752n659k3693K869p0607Q1658M2652P168k488q286j0481O1034j03128j4608
7542C0183K2768L0763J7807L0682l7227L6726l2021J1735J9518l5382n8645L2908
7530F9815L9883N5003O2702j19233k4969O3943L2672j9022j4012q923L6264j06393
7518F7730L3550m5668M2144m9974p771j3148L8464L7987l4049K7148J5716j2400
$$ plain form
7506 99729 94005 70221 36078 68615 102282 102537 73835 31087 50832 73638 121121 -13117
7494 -13117 67220 141016 176262 95576 156163 129131 175983 145964 137965 146472 126567 55187
7482 55187 89373 30381 102711 93541 103591 58505 37317 24271 13477 55508 49404 86599
7470 86599 107976 95384 117387 96248 123356 138446 89402 138995 95726 51871 15532 103675
7458 103675 1276 -9161 38822 33530 17033 65039 93304 85941 5943 20157 16087 113951
7446 113951 94824 77824 74923 53979 43430 50740 55096 128447 95135 89422 73252 101077
7434 101077 132640 154783 83538 69377 109622 161918 159146 58461 73730 75200 45159 100934
7422 100934 129541 141531 156157 101498 96025 61673 83797 42322 44531 78168 55333 57635
$$ packed form
7506I9729n724k3784l4143L2537L3667K55k8702m2748J9745K2806M7483j34238
7494a3117Q0337P3796L5246q0686O0587k7032M6852l0019p999Q507j9905p1380
7482E5187L4186n8992P2330r170J0050m5086k1188j3046j0794M2031o104L7195
7470H6599K1377j2592K2003k1139K7108J5090m9044M9593m3269m3855l6339Q8143
7458A03675j02399j0437M7983n292j6497M8006K8265p363p9998J4214m070R7864
7446A13951j9127j7000k901k0944j0549P310M356P3351l3312n713j6170K7825
7434A01077L1563K2143p1245j4161M0245N2296k772j00685J5269J470l0041N5775
7422A00934K8607J1990J4626n4659n473l4352K2124m1475K209L3637k2835K302
$$ plain form
7410 57635 71585 56673 49245 111102 114007 60814 102205 97687 113006 95891 112687 112079 89743
7397 89743 70914 113137 141196 148333 109661 109351 120211 96544 49430 19580 -3883 32592
7385 32592 -15044 48349 138575 124608 84648 103452 20599 15827 44839 30874 40211 62603
7373 62603 38376 42505 72791 78670 91922 106440 111198 139944 97700 59011 86154 122137
7361 122137 147364 106980 75652 35073 36950 50217 63541 10557 43185 71037 71229 82651
7349 82651 86917 42630 56329 44213 22792 51199 85181 34557 22265 -7762 53211 30981
7337 30981 74485 53365 67407 88616 52502 13207 96626 64884 85991 74248 99370 57636
7325 57636 28897 50342 112551 192405 130929 48756 73518 79273 26080 65688 95067 78846
$$ packed form
7410E7635J3950j4912p428O1857K905n3193M1391m518J5319j7115J6796o08k2336
7397H9743j8829M2223K8059P137l8672l10J0860k3667m7114k9850k3463L6475
7385C2592m7636O3393R0226j3967l9960J8804q2853m772K9012j3965R337K2392
7373F2603k4227M129L0286N879J3252J4518M758K8746m2244l8689K7143L5983
7361A22137K5227m0384l1328m0579J877J3267J3324n2984L2628K7852J92J1422
7349H2651M266m4287J3699j2116k1421K8407L3982n0624j2292l0027O0973k2230
7337C0981M3504k1120J4042K1209l6114l9295Q3419l1742K1107j1743K5122m1734
7325E7636k8739K1445O2209P9854o1476q2173K4762N755n3193L9608K9379j6221
$$ plain form
7313 78846 53184 20997 70354 43666 122765 31987 -29614 34300 -16091 18628 23238 70780
7301 70780 84862 54026 89423 76999 27358 18196 107862 160497 154024 111176 124560 119116
7289 119116 113818 163072 64870 86621 87565 91862 -30687 -14207 36489 6923 32218 113639
7277 113639 123370 119503 116632 95253 96982 72134 41722 66810 47124 105312 118556 95363
7265 95363 4116 11998 78191 132035 125163 135965 119986 119825 96861 92278 114013 141310 128407
7252 128407 174556 134572 106485 75660 69389 77019 98855 44410 80034 102783 70812 97524
7240 97524 129992 108886 63057 78285 130850 46711 16220 41595 127333 170254 110113 83009
7228 83009 9537 3186 82824 106089 117290 89093 103664 132330 111239 143592 122344 112513
$$ packed form
7313G8846k5662l2187M9357k6688P9099r0778o1601O3914n0391L4719M610M7542
7301G0780J4082l0836L5397j2424m9641r162Q9666N2635o473m2848J3384n444
7289A19116n298M9254r8202K1751R44M297j22549J6480N0696k9566K5295Q1421
7277A13639R731l867k871k1379J729k4848l0412K5088j9686N8188J3244k3193
7265I5363r1247P882O6193N3844o872J0802j5979j61k2964m583K1735K7297j2903
7252A28407M6149l9984k8087l0825o271P630K1836n4445L5624K2749l1971K6712
7240I7524L2468k1106m5829J5228N2565q4139l0491K5375Q5738M2921o0141k7104
7228H3009p3472o351P9638K3265J1201k8197J4571K8666k1091L2353k1248r831
$$ plain form
7216 112513 67483 96571 158282 71557 15179 53353 69805 60632 55714 74487 138172 94876
7204 94876 69107 54249 93115 97853 38923 78631 92872 92776 172247 156278 65966 81730 59171
7191 59171 119136 76852 35112 -29943 22263 48134 64020 111410 106310 134695 138128 138019 102459
7178 102459 3796 30965 102192 120300 94310 71458 32896 60624 35551 85668 61411 106969
7166 106969 73608 127890 106901 73983 116186 218369 184708 187666 99837 132774 131060 102586
7154 102586 129957 197347 226723 310296 382333 393154 387415 288439 209363 259108 241306 189082
7142 189082 183418 154123 152838 112030 123498 142655 108120 73741 55577 50843 74517 63446
7130 63446 50967 21743 26225 98955 130566 106238 61163 85620 82691 59924 117994 70990
$$ packed form
7216A12513m5030K9088O1711q6725n6378L8174J6452r173m918J8773O3685m3296
7204I4876k5769j4858L8866M738n8930L9708J4241r6P9471j5969r0312J5764k2559
7191E9171N9965m2284m1740o5055N2206K5871J5886M7390n100K8385L433j09l5560
7178A02459r8663K7169P1227J8108k5990k2852l8562K7728k5073N0117k4257M5558
7166A06969l3361N4282k0989l2918M2203J02183l3661K958q7829L2937j714k8474
7154A02586K7371O7390K9376Q3573P2037J0821n739r8976p9076M9745j7802n2224
7142A89082n664k9295j285m0808J1468J9157l4535l4379j8164m734K3674j1071
7130F3446j2479k9224M482P2730L1611k4328m5075K4457k929k2767N8070m7004
$$ plain form
7118 70990 78697 27069 93586 45722 91193 62068 13484 24771 69747 72198 96968 99210
7106 99210 162619 147354 147574 85432 126413 43435 50636 56636 95100 73822 119460 139660 109105
7093 109105 129504 96645 124131 149983 105303 62983 95307 95273 114781 166604 107387 51818
7081 51818 75815 162503 126998 90977 72723 -5336 -24746 30171 72010 70084 89815 46197
7069 46197 55592 36738 77459 98095 124678 93997 -28580 15039 -21131 -13739 74982 44052
7057 44052 23826 38360 106377 56527 62800 56690 52336 63535 105875 90360 3595 -1153 77192
7044 77192 22152 5456 98887 77228 -5763 18186 2205 -2934 -28732 1078 10029 61267
7032 61267 40747 63333 20629 29045 58580 103901 64506 64116 33667 53127 69854 95680
$$ packed form
7118G0990P707n1628O6517m7864M5471k9125m8584J1287M4976K451K4770K242
7106I9210O3409j5265K20o2142M0981q2978P201O000L8464k1278M5638K0200l0555
7093A09105K0399l2859K7486K5852m4680m2320L2324l4J9508N1823n9217n5569
7081E1818K3997Q6688l5505l6021j8254p8059j9410N4917M1839j926J9731m3618
7069D6197R395j8854M0721K0636K6583l0681j22577M3619l6170P392Q8721l0930
7057D4052k0226J4534O8017m9850O273o110m354J1199M2340j5515q6765m748P8345
7044G7192n5040j6696R3431k1659q2991K3949j5981n139k5798K9810Q951N1238
7032F1267k0520K2586m2704Q416K9535M5321l9395l90l0449J9460J6727K5826
$$ plain form
7020 95680 126648 92278 122826 88437 30943 77138 92376 67334 51287 68424 105910 97773
7008 97773 114826 74781 -41954 -87401 -53145 -52961 -13158 44596 28427 -2422 -29067 16300
6996 16300 69776 35093 83918 103053 117429 34691 35821 69150 50762 81532 82027 14159
6984 14159 20432 25166 114506 60720 59186 83531 86632 73161 110133 126892 119472 177058 122272
6971 122272 46917 61656 72235 111752 135779 169558 205528 166571 130815 135324 150555 92055
6959 92055 85161 76452 87396 155556 176941 163019 131057 103175 110047 103339 35288 -12708 47355
6946 47355 69689 87564 105606 144465 164402 116437 59848 65995 103229 107605 63737 62797 28622
6933 28622 6799 55301 9376 62072 89523 102980 72726 10433 19664 40453 59180 39997
$$ packed form
7020I5680L0968l4370L0548l4389n7494M6195J5238k5042j6047J7137L7486q137
7008I7773J7053m0045j16735m5447L4256J84L9803N7754j6169l0849k6645M5367
6996A6300N3476l4683M8825J9135J4376q2738J130L3329j8388L0770M95o7868
6984A4159O273M734Q9340n3786j534K4345L101j3471L6972J6759p420N7586n4786
6971A22272p5355J4739J0579L9517K4027L3779L5970l8957l5756M509J5231n8500
6959I2055o894q709J0944O8160K1385j3922l1962k7882O872o708o8051m7996O0063
6946D7355K2334J7875J8042L8859J9937m7965n6589O147L7234M376m3868r40l4175
6933B8622k1823M8502m5925N2696K7451J3457l0254o2293R231K0789J8727j9183
$$ plain form
6921 39997 43409 51958 59139 45219 48935 96239 120073 130574 102133 99935 150408 148132 103324
6908 103324 91086 86326 63457 21146 64461 71267 106411 88306 108395 100350 111955 150226
6896 150226 98326 123276 163768 136479 165652 131701 134417 108585 87958 127537 162490 115563
6884 115563 99896 134772 122986 131400 150144 87487 171140 172127 120435 172878 172565 152841 170929
6871 170929 184458 110990 82633 96935 144852 158678 200586 188021 242163 201205 91000
6860 91000 94545 149176 121373 181171 220498 230491 237453 261437 184615 141688 119934 187456
6848 187456 185467 179620 120632 139720 184653 213111 117856 93276 51860 87470 94194 103442
6836 103442 96947 134849 158177 207754 253124 244013 95733 105927 134292 106198 99751 50775
$$ packed form
6921C9997L412Q549P181j3920L716M7304K3834J0501k8441k198N0473k276m4808
6908A03324j2238m760k2869m2311M3315O806L5144j8105K0089q045J1605L8271
6896A50226n1900K4950M0492k7289K9173l3951K716k5832k0627L9579L4953m6927
6884A15563j5667L4876j1786Q414J8744o2657Q3653R87n1692N2443l13j9724J8088
6871A70929J3529p3468k8357J4302M7917J3826M1908j2565N4142m0958j10205
6860I1000L545N4631k7803N9798L9327R993O962K3984p6822m2927k1754O7522
6848A87456j989n847n8988J9088M4933K8458r5255k4580m1416L5610O724R248
6836A03442o495L7902K3328M9577M5370r111j48280J0194K8365k8094o447m8976
$$ plain form
6824 50775 32541 32957 116068 137512 100535 67396 32927 30718 41325 71908 68776 125095 131435
6811 131435 160487 140921 128289 167393 134630 64061 94863 123599 135575 184363 111989 115751
6799 115751 94400 133706 66413 96082 140621 155158 104881 83316 88220 95115 59378 84737
6787 84737 47098 113595 57237 85217 81753 43112 -8633 28982 39748 141790 152331 68894
6775 68894 8937 43803 169024 228173 150506 178593 88410 145455 118073 112771 152881 135295
6763 135295 138857 161121 167225 141297 118435 187847 129048 168805 198616 162999 138778 172158
6751 172158 188451 93067 128590 147292 128011 129277 107056 60385 112763 137837 136511 78517
6739 78517 68165 69792 128193 169163 270922 171775 96806 126625 116766 104341 147074 203377
$$ packed form
6824E0775j8234M16Q3111K1444l6977l3139l4469k209J0607L0583l132N6319O340
6811A31435K9052j9566j2632L9104l2763p0569L0802K8736J1976M8788p2374L762
6799A15751k1351L9306o7293K9669M4539J4537n0277k1565M904O895l5737K5359
6787H4737l7639O6497n6358K7980l464l8641n1745L7615J0766J02042J0541q3437
6775F8894n9957L4866J25221N9149p7667K8087r0183N7045k7382n302M0110j7586
6763A35295L562K2264O104k5928k2862O9412n8799L9757K9811l5617k4221L3380
6751A72158J6293r5384L5523J8702j9281J266k2221m6671N2378K5074j326n7994
6739G8517j0352J627N8401M0970J01759r9147p4969K9819r859j2425M2733N6303
$$ plain form
6727 203377 252569 186169 190123 169201 145815 178674 197778 210117 159879 133332 184178 144602
6715 144602 118483 150646 216145 226282 205972 161617 239618 215699 225346 227889 174564 244608
6703 244608 237939 199701 237680 259816 234037 192939 244783 234423 200259 152631 172399 202844
6691 202844 286088 312644 374884 328863 266550 290102 259392 335714 293556 352333 405705 391411
6679 391411 410846 385051 332063 337354 322241 364057 392532 366784 312689 338322 380204 384604
6667 384604 404681 408494 414002 481894 476509 411497 527549 540938 499690 503235 469233 486855
6655 486855 502690 470058 516474 535522 574630 554698 537002 507460 564953 595900 611771 560336
6643 560336 582821 619351 675060 664254 709146 739638 705018 619359 661920 748225 763788 816305
$$ packed form
6727B03377M9192o6400L954k0922k3386L2859J9104J2339n0238k6547N0846l9576
6715A44602k6119L2163O5499J0137k0310m4355P8001k3919R647K543n3325P0044
6703B44608o669l8238L7979K2136k5779m1098N1844j0360l4164m7628J9768L0445
6691B02844Q3244K6556O2240m6021o2313K3552l0710P6322m2158N8777N3372j4294
6679C91411J9435k5795n2988N291j5113M1816K8475k5748n4095K5633M1882M400
6667C84604K0077L813N508O7892n385o5012J16052J3389m1248L545l4002J7622
6655D86855J5835l2632M6416J9048L9108j9932j7696k9542N7493L0947J5871n1435
6643E60336K2485L6530N5709j0806M4892L0492l4620q5659M2561Q6305J5563N2517
$$ plain form
6631 816305 878485 937237 919231 906882 936764 914126 1031451 1110527 1157148 1243169 1277746
6620 1277746 1396252 1541272 1599783 1738552 1865056 2060692 2229310 2423554 2622993 2743456
6610 2743456 2890922 2946440 2977632 2833966 2858268 2853814 2831689 2857530 2885289 2849540 2887002
6599 2887002 2931269 3019080 3139762 3301852 3566323 3855937 4155508 4619699 5097191 5637895
6589 5637895 6101598 6554522 6868188 7162661 7304319 7348560 7353988 7371581 7292855 7320809 7275010
6578 7275010 7390146 7591959 7659106 7735393 7861651 7884042 7953527 7952664 8072111 8292166 8466592
6567 8466592 8710157 9079127 9368852 9675941 9869555 9972420 10094802 10388206 10851792 11398598
6557 11398598 12146716 12972936 13699798 14316232 14684487 14675641 14331430 13845261 13274771 12661090
$$ packed form
6631H16305O2180N8752j8006j2349K9882k2638J17325P9076M6621Q6021L4577
6620A277746J18506J45020N8511J38769J26504J95636J68618J94244J99439J20463
6610B743456J47466N5518L1192j43666K4302m454k2125K5841K7759l5749L7462
6599B887002M4267Q7811J20682J62090K64471K89614K99571M64191M77492N40704
6589E637895M63703M52924L13666K94473J41658M4241N428J7593p8726K7954m5799
6578G275010J15136K01813O7147P6287J26258K2391O9485q63J19447K20055J74426
6567H466592K43565L68970K89725L07089J93614J02865J22382K93404M63586N46806
6557A1398598P48118Q26220P26862O16434L68255q846l44211m86169n70490o13681
$$ plain form
6547 12661090 12152783 11712962 11450689 11259716 11104918 10924605 10805497 10761217 10711622 10649662
6537 10649662 10699405 10892402 11037221 11244836 11395494 11626070 11869078 11963677 11986446 12017274
6527 12017274 12007672 11907318 11849159 11741919 11710729 11819539 11821189 11583206 11399419 11046714
6517 11046714 10642387 10145188 9612158 8949382 8423131 7873042 7432670 7088853 6804661
6508 6804661 6579938 6464627 6292153 6303963 6278444 6366279 6460350 6672317 6816655 7028848
6498 7028848 7120411 7141003 6936325 6716691 6300268 5821085 5390710 4990753 4642383 4325331
6488 4325331 4017640 3786620 3522693 3342463 3158852 3008933 2878207 2782848 2736198 2686917
6478 2686917 2560092 2476597 2499928 2401701 2375199 2290213 2178704 2146384 2123952 2045842 2044467
$$ packed form
6547A2661090n08307m39821k62273j90973j54798j80313j19108m4280m9595o1960
6537A0649662M9743J92997J44819K07615J50658K30576K43008R4599K2769L0828
6527A2017274r602j00354n8159j07240l1190J08810J650k37983j83787l52705
6517A1046714m04327m97199n33030o62776n26251n50089m40372l43817k84192
6508F804661k24723j15311j72474J1810k5519Q7835R4071K11967J44338K12193
6498G028848R1563K0592k04678k19634m16423m79183m30375l99957l48370l17052
6488D325331l07691k31020k63927j80230j83611j49919j30726r5359m6650m9281
6478B686917j26825q3495K3331r8227k6502q4986j11509l2320k2432p8110j375
$$ plain form
6467 2044467 2074048 2019481 1946200 1921867 1914018 1943765 1930128 1933018 1832606 1822746 1843371 1887601
6455 1887601 1904330 1958068 1916834 1937208 1869622 1831349 1865679 1917433 1930042 2017906 1896760
6444 1896760 1943480 1916865 1972902 1995106 2012035 2050781 2136725 2103616 2190754 2233797 2296007
6433 2296007 2366181 2370299 2429772 2526837 2537452 2632379 2669073 2826622 2996582 3080284 3312680
6422 3312680 3514851 3688042 4004397 4227407 4545360 4998406 5438807 5987571 6649780 7561995
6412 7561995 8591423 9790343 11332407 13069922 14946375 16558105 17645170 17986978
6404 17986978 17577835 16498636 15023821 13594479 12222443 10943061 9857553 8988113
6396 8988113 8303283 7720422 7156521 6738829 6399758 6169850 6007279 5922007 5884214 5895727
$$ packed form
6467B044467K9581n4567p3281k4333p849K9747j3637K890j00412r860K0625M4230
6455A887601J6729N3738m1234K0374o7586l8273L4330N1754J2609Q7864j21146
6444A896760M6720k6615N6037K2204J6929L8746Q5944l3109Q7138M3043O2210
6433B296007P0174M118N9473R7065J0615R4927L6694J57549J69960Q3702K32396
6422C312680K02171J73191L16355K23010L17953M53046M40401N48764O62209R12215
6412G561995J029428J198920J542064J737515J876453J611730J087065L41808
6404A7986978m09143j079199j474815j429342j372036j279382j085508q69440
6396H988113o84830n82861n63901m17692l39071k29908j62571q5272l7793J1513
$$ plain form
6386 5895727 5842822 5889953 5980613 6111463 6266412 6569417 6861101 7219176 7706603 8385189
6376 8385189 9132211 9954644 10684634 11430852 11907150 12040608 11767290 11303284 10629440 9924797
6366 9924797 9343816 8871407 8466651 8152157 7935110 7854085 7859683 7924071 7945189 8120239
6356 8120239 8314417 8681226 9144477 9686596 10293777 10977401 11901850 13032505 14210478
6347 14210478 15764634 17642069 19967541 22714949 25995804 29819326 33880187 37773827
6339 37773827 40918967 42611849 42677406 41212182 38602953 35528779 32178477 28979784
6331 28979784 26171751 23773423 21692188 20021612 18582618 17404478 16482435 15837361
6323 15837361 15354915 14982819 14773000 14697663 14760613 14963298 15324382 15819534 16507779 17382068
$$ packed form
6386E895727n2905M7131R0660J30850J54949L03005K91684L58075M87427O78586
6376H385189P47022Q22433P29990P46218M76298J33458k73318m64006o73844p04643
6366I924797n80981m72409m04756l14494k17047q1025N598O4388K1118J75050
6356H120239J94178L66809M63251N42119O07181O83624R24449J130655J177973
6347A4210478J554156J877435K325472K747408L280855L823522M060861L893640
6339C7773827L145140J692882O5557j465224k609229l074174l350302l198693
6331B8979784k808033k398328k081235j670576j438994j178140r22043o45074
6323A5837361m82446l72096k09819p5337O2950K02685L61084M95152O88245Q74289
$$ plain form
6313 17382068 18422072 19845227 21565810 23616658 26046580 28767083 31627065 34191537
6305 34191537 35977192 36807242 36486788 35217081 33157352 30800219 28271509 25945531
6297 25945531 23803135 21899361 20330583 18968318 17813257 16989380 16365991 15946491 15709225
6288 15709225 15686050 15800815 16090014 16413386 17011627 17802315 18885595 20290361 22046733
6279 22046733 24091278 26782741 29921761 33520670 37326140 40849106 43503724 44908228
6271 44908228 44688379 43173170 40820621 37951074 35041127 32331486 30040825 28144232
6263 28144232 26730360 25778799 25177132 24931141 25136055 25711788 26741556 28223984 30134389
6254 30134389 32379831 34696647 36810093 38528046 39413125 39276251 38140622 36174378
$$ packed form
6313A7382068J040004J423155J720583K050848K429922K720503K859982K564472
6305C4191537J785655Q30050l20454j269707k059729k357133k528710k325978
6297B5945531k142396j903774j568778j362265j155061q23877o23389m19500k37266
6288A5709225k3175J14765K89199L23372N98241P90688J083280J404766J756372
6279B2046733K044545K691463L139020L598909L805470L522966K654618J404504
6271D4908228k19849j515209k352549k869547k909947k709641k290661j896593
6263B8144232j413872r51561o01667k45991K04914N75733J029768J482428J910405
6254C0134389K245442K316816K113446J717953Q85079j36874j135629j966244
$$ plain form
6246 36174378 33541721 30608207 27681201 25006326 22451125 20324410 18545295 16916369
6238 16916369 15470130 14344967 13281373 12572247 11941190 11336958 10798004 10344362 9940362
6229 9940362 9580836 9232541 8871133 8653958 8535376 8314854 8182573 8078761 8007417 8026325
6219 8026325 8074841 8062460 8179969 8379114 8625492 8967374 9399755 9923827 10677428 11615574
6209 11615574 12854299 14267699 15863255 17254661 18069996 18149882 17624044 16603646 15350331
6200 15350331 14077005 12821879 11756455 10877605 10237623 9771817 9409342 9160097 9098929
6191 9098929 9162076 9412356 9691089 10101524 10829092 11681879 12553809 13386849 14034685 14355500
6181 14355500 14092397 13470187 12547577 11460378 10333298 9316895 8523818 7731635 7043328
$$ packed form
6246C6174378k632657k933514k927006k674875k555201k126715j779115j628926
6238A6916369j446239j125163j063594p09126o31057o04232n38954m53642m04000
6229I940362l59526l48295l61408k17175j18582k20522j32281j03812p1344J8908
6219H026325M8516j2381J17509J99145K46378L41882M32381N24072P53601R38146
6209A1615574J238725J413400J595556J391406Q15335P9886n25838j020398j253315
6200A5350331j273326j255126j065424q78850o39982m65806l62475k49245o1168
6191I098929O3147K50280K78733M10435P27568Q52787Q71930Q33040O47836L20815
6181A4355500k63103o22210r22610j087199j127080j016403p93077p92183o88307
$$ plain form
6172 7043328 6489647 5969695 5558303 5229815 4956216 4638124 4405866 4237332 4132755 3936678
6162 3936678 3844206 3645751 3504870 3328752 3205627 3174005 3148127 3041986 2981682 2884301
6152 2884301 2805109 2746765 2734404 2720272 2554664 2540089 2576264 2485143 2398866 2337956 2322659
6141 2322659 2255186 2216987 2126477 2092129 2054476 1993816 1958734 1919826 1915816 1891582 1885161 1872505
6129 1872505 1824189 1785673 1737624 1671161 1667148 1592887 1592695 1560713 1531657 1514703 1560912 1461850
6117 1461850 1435006 1396379 1409823 1461993 1411250 1442695 1434483 1391018 1359157 1312812 1313770 1307478
6105 1307478 1287813 1181845 1171154 1209013 1220422 1235141 1234706 1211449 1195858 1171332 1192054 1149528
6093 1149528 1134022 1117362 1091913 1045524 1061447 1042041 1073874 1073741 1037971 1030878 988483 951929
$$ packed form
6172G043328n53681n19952m11392l28488k73599l18092k32258j68534j04577j96077
6162C936678r2472j98455j40881j76118j23125l1622k5878j06141o0304r7381
6152B884301p9192n8344j2361j4132j65608j4575L6175r1121q6277o0910j5297
6141B322659o7473l8199r0510l4348l7653o0660l5082l8908m010k4234o421j2656
6129A872505m8316l8516m8049o6463m013p4261j92l1982k9056j6954M6209r9062
6117A461850k6844l8627J3444N2170n0743L1445q212m3465l1861m6345R58o292
6105A307478j9665j05968j0691L7859J1409J4719m35k3257j5591k4526K0722m2526
6093A149528j5506j6660k5449m6389J5923j9406L1833j33l5770p093m2395l6554
$$ plain form
6081 951929 950184 1020885 978495 987477 1018137 1019531 983061 978098 980098 904576 851539 887422 902168
6068 902168 937824 868525 842693 790244 795452 779333 810888 828026 816589 834964 890493 832206
6056 832206 847288 856862 834499 814671 812479 787017 794982 784707 736770 764212 706554 742743
6044 742743 804274 823141 764272 727366 763329 794613 782905 704297 698691 701442 748588 730631
6032 730631 759593 798533 769915 796046 861328 799533 738350 717170 775959 862209 795956 776720
6020 776720 720571 656445 674086 726435 642452 668694 653491 647619 651468 600443 571915 578914
6008 578914 644724 683253 636199 593229 557244 571935 576114 646941 639839 608574 568709 567917
5996 567917 576928 699903 664757 594738 616220 648135 723078 692461 601347 579906 660684 668981
$$ packed form
6081I51929j745P0701m2390Q982L0660J394l6470m963K000p5522n3037L5883J4746
6068I02168L5656o9299k5832n2449N208j6119L1555J7138j1437J8375N5529n8287
6056H32206J5082R574k2363j9828k192k5462P965j0275m7937K7442n7658L6189
6044G42743O1531J8867n8869l6906L5963L1284j1708p8608n606K751M7146j7957
6032G30631K8962L8940k8618K6131O5282o1795o1183k1180N8789Q6250o6253j9236
6020G76720n6149o4126J7641N2349q3983K6242j5203n872L849n1025k8528O999
6008E78914O5810L8529m7054m2970l5985J4691M179P0827p102l1265l9865p92
5996E67917R011J22975l5146p0019K1482L1915P4943l0617r1114k1441Q0778Q297
$$ plain form
5984 668981 601524 642738 633754 618602 599831 580658 585788 582441 548666 572753 595941 638536
5972 638536 644721 627618 647500 603624 671880 712440 623006 614951 606689 639282 668798 582573
5960 582573 572979 527707 482233 522109 470349 478504 519038 536173 483403 443989 484116 526498
5948 526498 572984 526660 521328 517974 492376 540015 620211 564120 609251 660553 628447 571119
5936 571119 555499 479640 475335 483559 534429 556859 519759 448760 486659 539144 545717 516435
5924 516435 456961 415953 445565 450518 408259 366377 371377 396703 462832 413946 467682 412325
5912 412325 409220 433651 377502 397661 491218 449769 432763 422599 455951 461314 427854 442293
5900 442293 384216 377939 463392 444446 439700 503718 500651 500636 397677 344116 364822 427669 447730
$$ packed form
5984F68981o7457M1214q984j5152j8771j9173N130l347l3775K4087K3188M2595
5972F38536O185j7103J9882m3876O8256M0560q9434q055q262L2593K9516q6225
5960E82573r594m5272m5474L9876n1760Q155M0534J7135n2770l9414M0127M2382
5948E26498M6486m6324n332l354k5598M7639Q0196n6091M5131N1302l2106n7328
5936E71119j5620p5859m305Q224N0870K2430l7100p0999L7899N2485O573k9282
5924E16435n9474m1008K9612M953m2259m1882N000K5326O6129m8886N3736n5357
5912D12325l105K4431n6149K0159R3557m1449j7006j0164L3352N363l3460J4439
5900D42293n8077o277Q5453j8946m746O4018l067j5j02959n3561K0706O2847K0061
$$ plain form
5887 447730 418333 333443 312754 399748 396546 371072 340967 430207 468033 496022 485980 413627
5875 413627 394240 363531 405202 392881 400398 352272 391341 410700 417125 324076 418947 467493
5863 467493 414443 377729 408599 386666 355634 301197 271319 288742 305648 302042 329256 351141
5851 351141 313115 257217 314286 339912 381404 369437 330615 287507 408027 445566 421007
5840 421007 415885 403081 391449 373795 352888 340082 344801 373501 388485 428150 451867 385424
5828 385424 363773 367293 417567 401960 380426 336793 298176 357678 317317 296405 322905 368792
5816 368792 323650 335517 341190 372609 408980 357425 326486 335883 403715 349631 397537 426299
5804 426299 417846 374393 352970 387613 378270 391317 383099 378839 336465 384232 381563 319872 302517
$$ packed form
5887D47730k9397q4890k0689Q6994l202k5474l0105Q9240L7826K7989j0042p2353
5875D13627j9387l0709M1671j2321P517m8126L9069J9359O425r3049R4871M8546
5863D67493n3050l6714L0870k1933l1032n4437k9878J7423J6906l606K7214K1885
5851C51141l8026n5898N7069K5626M1492j1967l8822m3108J20520L7539k4559
5840D21007n122j2804j1632j7654k0907j2806M719K8700J4984L9665K3717o6443
5828C85424k1651L520N0274j5607k1534m3633l8617N9502m0361k0912K6500M5887
5816C68792m5142J1867N673L1419L6371n1555l0939R397O7832n4084M7906K8762
5804D26299q453m3453k1423L4643r343J3047q218m260m2374M7767k669o1691j7355
$$ plain form
5791 302517 276918 345514 324270 331725 292290 322531 302815 337322 313008 299319 314584 273091
5779 273091 289623 329843 310464 331505 357116 366994 384948 390791 368880 452149 432377 352139
5767 352139 352063 318137 267597 265333 294930 262998 279003 328133 315715 348042 301683 278727
5755 278727 326571 354678 249708 276973 340248 349623 338740 378144 288738 319718 396152 335127
5743 335127 397016 379273 384383 380130 375566 373523 326509 318800 355222 373507 391344 419156 356962
5730 356962 354964 312152 318748 366413 381831 383444 345670 300724 310067 307694 349199 285676 263274
5717 263274 316814 336874 344453 280899 294583 275056 307118 291856 328076 409322 365282 312626
5705 312626 306010 315508 382672 369901 371651 362493 308970 309932 321261 363981 339813 314431 288064
$$ packed form
5791C02517k5599O8596k1244P455l9435L0241j9716L4507k4314j3689J5265m1493
5779B73091J6532M0220j9379K1041K5611R878J7954N843k1911Q3269j9772q0238
5767C52139p6l3926n0540k264K9597l1932J6005M9130j2418L2327m6359k2956
5755B78727M7844K8107j04970K7265O3275R375j0883L9404q9406L0980P6434o1025
5743C35127O1889j7743N110m253m564k043m7014p709L6422J8285J7837K7812o2194
5730C56962j998m2812O596M7665J5418J613l7774m4946R343k373M1505o3523k2402
5717B63274N3540K0060P579o3554J3684j9527L2062j5262L6220Q1246m4040n2656
5705C12626o616R498O7164j2771J750r158n3523R62J1329M2720k4168k5382k6367
$$ plain form
5692 288064 328257 290240 245335 300395 405273 417101 348384 338300 316794 330818 321026 299907
5680 299907 320483 328489 293784 396894 346336 387736 401007 416796 395025 294779 271256
5669 271256 288720 310591 307294 296114 309679 331304 368134 308023 300766 286899 348575 344871
5657 344871 322558 279844 267335 252934 276766 250385 369321 339521 370301 358545 332937
5646 332937 271627 337076 330557 368145 376246 342327 345358 358606 359600 369551 347675 323695 299803
5633 299803 362490 389807 330593 279773 316412 339482 291711 242910 231150 301088 292333 289892
$$ packed form
5692B88064M0193l8017m4905N5060J04878J1828o8717j0084k1506J4024r792k1119
5680B99907K0576Q006l4705J03110n0558M1400J3271J5789k1771j00246k3523
5669B71256J7464K1871l297j1180J3565K1625L6830o0111p257j3867O1676l704
5657C44871k2313m2714j2509j4401K3832k6381J18936k9800L0780j1756k5608
5646C32937o1310O5449o519L7588Q101l3919L031J3248R94R951k1876k3980k3892
5633B99803O2687K7317n9214n0820L6639K3070m7771m8801j1760O9938q755k441
$$ [...]
##END NTUPLES=NMR SPECTRUM
##END=
