##TITLE=1H_DE-80H_X3
 200.13MHz, d2o
 8 sc
 
 19ns.26.2.2025
##JCAMPDX= 6.0         $$ Bruker NMR JCAMP-DX V2.0
##DATA TYPE= NMR SPECTRUM
##DATA CLASS= NTUPLES
##ORIGIN= UXNMR, Bruker Analytische Messtechnik GmbH
##OWNER= pz
$$ XWIN-NMR		Version 3.5
$$ Thu Dec 25 09:59:35 2025 Russian Standard Time (UT+4h)  Yarkov@DPX200
##.OBSERVE FREQUENCY= 200.1313
##.OBSERVE NUCLEUS= ^1H
##.ACQUISITION MODE= SIMULTANEOUS
##.ACQUISITION SCHEME= undefined
##.AVERAGES= 8
##.DIGITISER RES= 18
##SPECTROMETER/DATA SYSTEM= spect
##.PULSE SEQUENCE= zg30
##.SOLVENT NAME= CDCl3
##.SHIFT REFERENCE= (INTERNAL, CDCl3, 0, 15.4296)
##AUDIT TRAIL= $$ (NUMBER, WHEN, WHO, WHERE, WHAT)
$$ ##TITLE= Audit trail, XWIN-NMR		Version 3.5
$$ ##JCAMPDX= 5.01
$$ ##ORIGIN= Bruker BioSpin GmbH
$$ ##OWNER= Yarkov
$$ C:/Bruker/XWIN-NMR/data/yarkov2/nmr/H-C/1/pdata/1/auditp.txt
$$ ##AUDIT TRAIL=  $$ (NUMBER, WHEN, WHO, WHERE, WHAT)
(   1,<2025-12-25 09:58:44.57 +0400>,<Yarkov>,<DPX200>,
      <created by zg, POWCHK disabled, PULCHK disabled
       configuration hash MD5:
       00 E9 B6 7A A2 85 ED C7 34 08 36 98 17 FE 4E 26
       data hash MD5: 16K
       23 52 18 3A 3A 86 EF 67 26 75 81 03 72 41 1B 9A>)
(   2,<2025-12-25 09:58:48.56 +0400>,<Yarkov>,<DPX200>,
      <Start of raw data processing
       efp BC_mod = 2 LB = 0.25 FT_mod = 6 PKNL = 1 PHC0 = -5299.955 PHC1 = 10.82193 SI = 16K 
       data hash MD5: 16K
       9B 6D 8B BF BB 00 4A 35 D1 14 E8 F0 E7 50 2D 84>)
$$ ##END=
$$ 
$$ hash MD5
$$ DD E0 FF AF 5D C5 40 3F C4 EE 4B 03 3C 36 9A 1C
##$RELAX= 
##$RELAX= 
##$RELAX= 
##$RELAX= 
##$RELAX= 
##$RELAX= 
$$ Bruker specific parameters
$$ --------------------------
##$DU= <C:/Bruker/XWIN-NMR>
##$EXPNO= 1
##$NAME= <H-C>
##$PROCNO= 1
##$TYPE= <nmr>
##$USER= <yarkov2>
##$AMP= (0..31)
100 100 100 100 100 100 100 100 100 100 100 100 100 100 100 100 100 100 
100 100 100 100 100 100 100 100 100 100 100 100 100 100 
##$AQSEQ= 0
##$AQ_mod= 1
##$AUNM= <au_zg>
##$AUTOPOS= <>
##$BF1= 200.13
##$BF2= 200.13
##$BF3= 200.13
##$BF4= 200.13
##$BF5= 200.13
##$BF6= 200.13
##$BF7= 200.13
##$BF8= 200.13
##$BYTORDA= 1
##$CFDGTYP= 0
##$CFRGTYP= 5
##$CHEMSTR= <none>
##$CNST= (0..31)
1 1 145 1 1 1 1 1 1 1 1 1 1 1 1 1 1 1 1 1 1 1 1 1 1 1 1 1 1 1 1 1 
##$CPDPRG= <>
##$CPDPRG1= <>
##$CPDPRG2= <>
##$CPDPRG3= <>
##$CPDPRG4= <mlev>
##$CPDPRG5= <mlev>
##$CPDPRG6= <mlev>
##$CPDPRG7= <mlev>
##$CPDPRG8= <mlev>
##$CPDPRGB= <>
##$CPDPRGT= <>
##$D= (0..31)
0 0.7 0 0 0 0 0 0 0 0 0 0.03 0 0 0 0 0 0 0 0 0 0 0 0 0 0 0 0 0 0 0 0 
##$DATE= 1766642324
##$DBL= (0..7)
120 120 120 120 120 120 120 120 
##$DBP= (0..7)
150 150 150 150 150 150 150 150 
##$DBP07= 0
##$DBPNAM0= <>
##$DBPNAM1= <>
##$DBPNAM2= <>
##$DBPNAM3= <>
##$DBPNAM4= <>
##$DBPNAM5= <>
##$DBPNAM6= <>
##$DBPNAM7= <>
##$DBPOAL= (0..7)
0.5 0.5 0.5 0.5 0.5 0.5 0.5 0.5 
##$DBPOFFS= (0..7)
0 0 0 0 0 0 0 0 
##$DE= 6
##$DECBNUC= <off>
##$DECIM= 32
##$DECNUC= <off>
##$DECSTAT= 4
##$DIGMOD= 1
##$DIGTYP= 9
##$DL= (0..7)
0 120 120 120 120 120 120 120 
##$DP= (0..7)
$$ [...]
##$SUBNAM2= <"">
##$SUBNAM3= <"">
##$SUBNAM4= <"">
##$SUBNAM5= <"">
##$SUBNAM6= <"">
##$SUBNAM7= <"">
##$SUBNAM8= <"">
##$SUBNAM9= <"">
##$SW= 18.0517328524113
##$SWIBOX= (0..15)
0 0 2 0 0 0 0 0 0 0 0 0 0 0 0 0 
##$SW_h= 3612.71676300578
##$TD= 16384
##$TD0= 1
##$TE= 0
##$TE2= 300
##$TE3= 300
##$TEG= 300
##$TL= (0..7)
0 120 120 120 120 120 120 120 
##$TP= (0..7)
150 150 150 150 150 150 150 150 
##$TP07= 0
##$TPNAME0= <>
##$TPNAME1= <>
##$TPNAME2= <>
##$TPNAME3= <>
##$TPNAME4= <>
##$TPNAME5= <>
##$TPNAME6= <>
##$TPNAME7= <>
##$TPOAL= (0..7)
0.5 0.5 0.5 0.5 0.5 0.5 0.5 0.5 
##$TPOFFS= (0..7)
0 0 0 0 0 0 0 0 
##$TUNHIN= 0
##$TUNHOUT= 0
##$TUNXOUT= 0
##$USERA1= <user>
##$USERA2= <user>
##$USERA3= <user>
##$USERA4= <user>
##$USERA5= <user>
##$V9= 5
##$VALIST= <valist>
##$VCLIST= <CCCCCCCCCCCCCCC>
##$VD= 0
##$VDLIST= <DDDDDDDDDDDDDDD>
##$VPLIST= <PPPPPPPPPPPPPPP>
##$VTLIST= <TTTTTTTTTTTTTTT>
##$WBST= 1024
##$WBSW= 4
##$XGAIN= (0..3)
0 0 0 0 
##$XL= 0
##$YL= 0
##$YMAX_a= 154278
##$YMIN_a= -117657
##$ZGOPTNS= <>
##$ZL1= 120
##$ZL2= 120
##$ZL3= 120
##$ZL4= 120
##$ABSF1= 0
##$ABSF2= 0
##$ABSG= 0
##$ABSL= 0
##$ALPHA= 0
##$AQORDER= 0
##$ASSFAC= 0
##$ASSFACI= 0
##$ASSFACX= 0
##$ASSWID= 0
##$AUNMP= <proc_1d>
##$AZFE= 0.1
##$AZFW= 0.1
##$BCFW= 0
##$BC_mod= 2
##$BYTORDP= 0
##$COROFFS= 0
##$CY= -3
##$DATMOD= 1
##$DC= 0
##$DFILT= <>
##$DTYPP= 0
##$F1P= 0
##$F2P= 0
##$FCOR= 1
##$FTSIZE= 16384
##$FT_mod= 6
##$GAMMA= 0
##$GB= 0
##$INTBC= 1
##$INTSCL= 3.241238e-09
##$ISEN= 128
##$LB= 0.25
##$LEV0= 0
##$LPBIN= 0
##$MAXI= 10000
##$MC2= 0
##$MEAN= 0
##$ME_mod= 0
##$MI= 1.114404
##$NCOEF= 0
##$NC_proc= -7
##$NLEV= 6
##$NOISF1= 3.799351
##$NOISF2= 2.8
##$NSP= 0
##$NTH_PI= 0
##$NZP= 0
##$OFFSET= 15.42957
##$PC= 1
##$PHC0= -5299.955
##$PHC1= 10.82193
##$PH_mod= 1
##$PKNL= yes
##$PPARMOD= 0
##$PSCAL= 0
##$PSIGN= 0
##$REVERSE= no
##$SF= 200.130018439018
##$SI= 16384
##$SIGF1= 3
##$SIGF2= 2
##$SINO= 0.751879
##$SIOLD= 32768
##$SREGLST= <19F.Aceton>
##$SSB= 0
##$STSI= 16384
##$STSR= 0
##$SW_p= 3612.71676300578
##$SYMM= 0
##$S_DEV= 0
##$TDeff= 16384
##$TDoff= 0
##$TI= <>
##$TILT= no
##$TM1= 0
##$TM2= 0
##$TOPLEV= 0
##$USERP1= <user>
##$USERP2= <user>
##$USERP3= <user>
##$USERP4= <user>
##$USERP5= <user>
##$WDW= 1
##$XDIM= 16384
##$YMAX_p= 369168330
##$YMIN_p= -920197
$$ End of Bruker specific parameters
$$ ---------------------------------
##NTUPLES= NMR SPECTRUM
##VAR_NAME=  FREQUENCY,     SPECTRUM/REAL,   SPECTRUM/IMAG
##SYMBOL=    X,             R,               I
##VAR_TYPE=  INDEPENDENT,   DEPENDENT,       DEPENDENT
##VAR_FORM=  AFFN,          ASDF,            ASDF
##VAR_DIM=   16384,         16384,           16384
##UNITS=     HZ,            ARBITRARY UNITS, ARBITRARY UNITS
##FACTOR=    0.220516191357247, 1,           1
##FIRST=     3087.92016824369, 0,            0
##LAST=      -524.796594762094, 0,           0
##MIN=       -524.796594762094, -920197,     0
##MAX=       3087.92016824369, 369168330,    0
$$ Real data points
##PAGE= N=1
##DATA TABLE= (X++(R..R)), XYDATA
$$ [...]
$$ plain form
12075 -96564 -6935 -52490 -73174 -24673 116172 4199 -55650 2317 106125 -16338 48354
12064 48354 100142 195425 170166 121542 -29162 -99381 -156033 -168438 -93431 -74573 -138211
12053 -138211 -92912 89222 21920 -135374 -248720 -182842 -55437 -37425 13799 173304
12043 173304 15441 -84046 -93890 -101662 -126645 -52434 47505 119783 107748 141586 105922 19570
12031 19570 -94194 -19336 -39805 -56810 -148208 209010 247594 103650 42411 68543 -28344
12020 -28344 50355 44477 44196 -59544 15975 128637 43199 -115593 -129527 -158322 12227
12009 12227 -16221 1389 57694 -46643 -102389 -193634 -119330 21233 -90775 -18677 137024
11998 137024 134945 132241 73306 45311 -14601 -24856 48137 265540 153216 130048 180632
$$ packed form
12075i6564Q9629m5555k0684M8501J40845j11973n9849N7967J03808j22463O4692
12064D8354N1788R5283k5259m8624j50704p0219n6652j2405P5007J8858o3638
12053a38211M5299J82134o7302j57294j13346O5878J27405J8012N1224J59505
12043A73304j57863r9487r844p772k4983P4211R9939P2278j2035L3838l5664q6352
12031A9570j13764P4858k0469j7005r1398L57218L8584j43944o1239K6132r6887
12020b8344P8699n878k81j03740P5519J12662q5438j58792j3934k8795J70549
12009A2227k8448J7610N6305j04337n5746r1245P4304J40563j12008P2098J55701
11998A37024k079k704n8935k7995n9912j0255P2993K17403j12324k3168N0584
$$ plain form
11987 180632 22440 26409 -9790 -62627 -1031 -24396 -6510 -155739 -16523 6623 99075
11976 99075 -82097 -11961 -18095 -6456 -47247 30483 15367 2584 43264 108245 4440
11965 4440 -113638 -58082 104549 117252 185024 146583 116987 37740 -1081 12483 17225 13096
11953 13096 -113622 -55651 42102 -109309 -126221 -59059 -165857 -117229 27456 180456 205912
11942 205912 229399 154706 32796 -154915 -200081 -67509 -74947 -105836 67549 53007 41383
11931 41383 -106516 -23688 -45209 -49466 -64290 155555 107415 100135 8252 -35096 -261710
11920 -261710 -188695 -43108 -6365 139775 178585 81415 77805 6608 -83498 -27659 64143
11909 64143 87374 72974 205600 157496 -94913 -105770 -108843 -64077 -106123 33615 108691
$$ packed form
11987A80632j58192L969l6199n2837O1596k3365J7886j49229J39216K3146R2452
11976I9075j81172P0136o134J1639m0791P7730j5116j2783M0680O4981j03805
11965D440j18078N5556J62631J2703O7772l8441k9596p9247l8821J3564M742m129
11953A3096j26718N7971R7753j51411j6912O7162j06798M8628J44685J53000K5456
11942B05912K3487p4693j21910j87711m5166J32572p438l0889J73385j4542j1624
11931D1383j47899Q2828k1521m257j4824K19845m8140p280r1883m3348k26614
11920b61710P3015J45587L6743J46140L8810r7170l610p1197r0106N5839R1802
11909F4143K3231j4400J32626m8104k52409j0857l073M4766m2046J39738P5076
$$ plain form
11898 108691 62955 82265 55040 19357 -53503 -88092 -200470 -71050 105903 218285 1976
11887 1976 61265 50827 -86244 -121695 46690 129399 19529 55443 46605 -113253 -90662
11876 -90662 -167926 -195153 -189679 -178721 -4647 126929 131438 158779 -6778 -97324 -175777
11865 -175777 -109407 -29498 151682 8440 32929 137329 64656 -55404 40266 32052 74017
11854 74017 99474 138364 90678 -67807 -89621 -128570 -195632 -50874 -45725 -42820 88556
11843 88556 169085 128472 -58177 -225788 -187899 -40813 -3138 4982 46380 51780 -115148
11832 -115148 -318509 -390133 -285981 -216132 22520 44646 146884 165370 301250 162292
11822 162292 4612 -26171 -36390 100161 195393 95539 95972 15526 -7670 30935 38966 -52905
$$ packed form
11898A08691m5736J9310k7225l5683p2860l4589j12378J29420J76953J12382k16309
11887A976N9289j0438j37071l5451J68385Q2709j09870L5914q838j59858K2591
11876i0662p7264k7227N474J0958J74074J31576M509K7341j65557r0546p8453
11865a75777O6370P9909J81180j43242K4489J04400p2673j20060R5670q214M1965
11854G4017K5457L8890m7686j58485k1814l8949o7062J44758N149K905J31376
11843H8556Q0529m0613j86649j67611L7889J47086L7675Q120M1398N400j66928
11832a15148k03361p1624J04152O9849K38652K2126J02238J8486J35880j38958
11822A62292j57680l0783j0219J36551R5232r9854M33q0446k3196L8605Q031r1871
$$ plain form
11810 -52905 -94880 -134433 -79859 36489 156782 51086 5837 -111959 -51123 45560 73031
11799 73031 122030 93445 73918 148250 89714 -92496 -122648 -52787 67677 66053 70529 -78474
11787 -78474 -156124 -153045 -138587 -74588 112890 60580 121488 94694 83844 -38712 -7681
11776 -7681 -16034 -138345 -32973 130666 255095 394162 236499 119585 5470 66310
11766 66310 53066 132000 291526 274393 171682 174108 200279 77871 -103288 -19742 -2423
11755 -2423 8769 110791 65717 103733 -18876 -116051 -100719 -112463 -127209 -35923 27124
11744 27124 103161 47527 94178 79122 67902 34281 -4227 64005 74271 -6778 79052 103241
11732 103241 -27916 -68077 7052 -121968 -35917 72555 116651 24315 -94879 -105939 11499
$$ packed form
11810e2905m1975l9553N4574J16348J20293j05696m5249j17796O0836R6683K7471
11799G3031M8999k8585j9527P4332n8536j82210l0152O9861J20464j624M476j49003
11787g8474p7650L079J4458O3999J87478n2310O0908k6794j0850j22556L1031
11776g681q353j22311J05372J63639J24429J39067j57663j16914j14115O0840
11766F6310j3244P8934J59526j7133j02711K426K6171j22408j81159Q3546J7319
11755b423J1192J02022m5074L8016j22609r7175J5332j1744j4746R1286O3047
11744B7124P6037n5634M6651j5056j1220l3621l8508O8232J0266q1049Q5830K4189
11732A03241j31157m0161P5129j29020Q6051J08472M4096r2336j19194j1060J17438
$$ plain form
11721 11499 -31804 1151 -13149 -62819 -122406 55830 -26193 30191 -69291 -116171 16974
11710 16974 143509 36641 -6435 38547 -59466 -26360 -43254 -12287 99089 -83618 -108219
11699 -108219 22148 150219 177322 97729 -23198 -29784 41594 78834 138973 -16484 -31127
11688 -31127 3017 55373 56943 151956 62670 -54014 -48488 82035 53232 201832 147277
11677 147277 145016 69229 -49692 -116074 27133 -21636 -91105 -117474 22657 -25999 -113317
11666 -113317 -108930 47940 136185 170040 133349 181323 102725 76927 135967 208352 191086
11655 191086 234071 90788 67441 -70870 -40505 78405 -14292 -62633 -129648 95600 305143
11644 305143 254408 160326 -49792 21977 28669 50762 104222 217475 149301 -73213 -22639
$$ packed form
11721A1499m3303L2955j4300m9670n9587J78236q2023N6384r9482m6880J33145
11710A6974J26535j06868m3076M4982r8013L3106j6894L0967J11376j82707k4601
11699a08219J30367J28071K7103p9593j20927o586P1378L7240O0139j55457j4643
11688c1127L4144N2356J570R5013q9286j16684N526J30523k8803J48600n4555
11677A47277k261p5787j18921o6382J43207m8769o9469k6369J40131m8656q7318
11666a13317M387J56870Q8245L3855l6691M7974p8598k5798N9040P2385j7266
11655A91086M2985j43283k3347j38311L0365J18910r2697m8341o7015K25248K09543
11644C05143n0735r4082k10118P1769O692K2093N3460J13253o8174k22514N0574
$$ plain form
11633 -22639 -133598 -88032 -40126 55649 -34360 -138297 -139147 153043 66110 -69759 -193
11622 -193 54878 22439 133249 15739 16952 -32529 89412 219365 69572 -107189 -83337
11611 -83337 -44567 -18425 -129604 -104549 -189763 -41222 35922 34333 94825 173010 163460 158341
11599 158341 173956 210318 214588 121601 59478 44851 97994 101095 124570 42562 -72087 -126891
11587 -126891 -73221 82347 81484 -94761 -142984 -93007 -42871 -24151 147801 9805 123762
11576 123762 199683 112107 61490 86975 97240 122453 47347 132987 175296 30499 74774
11565 74774 100601 75697 49511 -28079 5288 -66615 -18768 68021 94279 -29497 68862
11554 68862 1707 98235 122600 65172 133659 115339 38679 1932 50105 191721 199508 213667
$$ packed form
11633b2639j10959M5566M7906R5775r0009j03937q50K92190q6933j35869O9566
11622a93N5071l2439J10810j17510J213m9481J21941J29953j49793j76761K3852
11611h3337L8770K6142j11179K5055q5214J48541P7144j589O0492P8185r550n119
11599A58341J5615L6362M270r2987o2123j4627N3143L101K3475q2008j14649n4804
11587a26891N3670J55568q63j76245m8223M9977N0136J8720J71952j37996J13957
11576A23762P5921q7576n0617K5485J0265K5213p5106Q5640M2309j44797M4275
11565G4774K5827k4904k6186p7590L3367p1903M7847Q6789K6258j23776R8359
11554F8862o7155R6528K4365n7428O8487j8320p6660l6747M8173J41616P787J4159
$$ plain form
11542 213667 97002 13357 -19239 -34755 44497 -100064 -71132 -70239 -61892 -49287 -21735 134597
11530 134597 179974 -36201 102299 189940 88941 -85513 -89896 -79190 -106619 66835 121483
11519 121483 62664 190649 55578 175025 209577 271233 207616 155950 66082 26652 -72256
11508 -72256 -39155 -108784 -119611 -125074 58281 -21559 -181519 -228683 -44959 2916 13325
11497 13325 84404 157907 98737 11412 -88834 -157962 -87418 -47299 35918 84667 143171
11486 143171 140845 160976 167773 113864 -43389 97613 51064 -21563 22400 35367 -150754
11475 -150754 -144471 -110280 -55393 -5871 -61205 -145657 -44591 -57053 -132113 -230728 -174892
11464 -174892 -239433 -86009 115188 122731 57014 12737 -84325 -58337 -148040 -88029 -38720
$$ packed form
11542B13667j16665q3645l2596j5516P9252j44561K8932Q93Q347J2605K7552J56332
11530A34597M5377k16175J38500Q7641j00999j74454m383J0706k7429J73454N4648
11519A21483n8819J27985j35071J19447L4552O1656o3617n1666q9868l9430r8908
11508g2256L3101o9629j0827n463J83355p9840j59960m7164J83724M7875J0409
11497A3325P1079P3503n9170q7325j00246o9128P0544M0119Q3217M8749N8504
11486A43171k326K0131O797n3909j57253J41002m6549p2627M3963J2967j86121
11475a50754O283L4191N4887M9522n5334q4452J01066j2462p5060r8615N5836
11464a74892o4541J53424K01197P543o5717m4277r7062K5988q9703O0011M9309
$$ plain form
11453 -38720 147389 139233 61851 45628 62816 42801 -70302 -232539 -31134 98213 77612
11442 77612 133599 193645 -91609 -112273 -119472 -39135 -15201 153582 215207 34976 -133082
11431 -133082 -90447 105237 72179 -28147 -5439 177257 235696 150502 134250 163926 -79393
11420 -79393 51010 17765 -34528 -10183 198545 171519 41563 -22791 28272 -28943 -54221
11409 -54221 -122502 115200 150871 164279 -57773 -12389 81916 85360 -14668 -54891 26937
11398 26937 28134 69334 64777 -57036 -20842 -60795 37518 123661 72271 120743 -9966 -203122
11386 -203122 -186059 -72264 6080 21132 -19948 -35598 17660 52012 13261 64927 -27745
11375 -27745 -152912 -121011 134204 99224 83251 164029 72007 -30080 -2699 7809 27702
$$ packed form
11453c8720J86109q156p7382j6223J7188k0015j13103j62237K01405J29347k0601
11442G7612N5987O0046k85254k0664p199Q0337K3934J68783O1625j80231j68058
11431a33082M2635J95684l3058j00326K2708J82696N8439q5194j6252K9676k43319
11420g9393J30403l3245n2293K4345K08728k7026j29956o4354N1063n7215k5278
11409e4221o8281K37702L5671J3408k22052M5384R4305L444j00028m0223Q1828
11398B6937J197M1200m557j21813L6194l9953R8313Q6143n1390M8472j30709j93156
11386b03122J7063J13795P8344J5052m1080j5650N3258L4352l8751N1666r2672
11375b7745j25167L1901K55215l4980j5973Q0778r2022j02087K7381J0508J9893
$$ plain form
11364 27702 -21088 27489 149607 311974 257305 -11166 -169225 74169 73264 183260 154156
11353 154156 59660 123278 172503 96788 49664 -249926 -158081 15561 106451 137808 121119
11342 121119 69279 -153087 -187453 -21390 83213 -10876 51515 28441 16901 49620 57038
11331 57038 92427 75708 -94014 75520 115989 52611 -32759 -218276 -145112 -19323 -5846
11320 -5846 99524 138696 238381 221246 186168 96546 -53346 -71429 76111 10596 298
11309 298 -6245 156886 50269 16282 60431 114749 6195 -23617 -16363 115261 -16686
11298 -16686 32825 153925 225925 14953 -124611 -88683 -23195 19621 109238 122563 96284
11287 96284 275560 202433 194959 109408 161784 70463 189481 187724 83762 6272 13674 34283
$$ packed form
11364B7702m8790M8577J22118J62367n4669k68471j58059K43394r05J09996k9104
11353A54156r4496O3618M9225p5715m7124k99590R1845J73642R0890L1357j6689
11342A21119n1840k22366l4366J66063J04603r4089O2391k3074j1540L2719P418
11331E7038L5389j6719j69722J69534M0469o3378q5370j85517P3164J25789J3477
11320e846J05370L9172R9685j7135l5078q9622j49892j8083J47540o5515j0298
11309B98o543J63131j06617l3987M4149N4318j08554k9812P254J31624j31947
11298a6686M9511J21100P2000k10972j39564L5928O5488M2816Q9617J3325k6279
11287I6284J79276p3127p474q5551N2376r1321J19018j757j03962p7490P402K0609
$$ plain form
11275 34283 -5909 -39270 2973 97712 63643 53157 202357 154796 96757 -56684 -33981
11264 -33981 32246 17398 1256 130435 65203 701 17133 190905 66096 -30619 -141946
11253 -141946 11584 -42845 49139 132744 174754 154329 143323 99386 41235 56712 -85333
11242 -85333 67157 240765 137494 128432 86899 -45394 78461 221270 137030 -7684
11232 -7684 32620 110551 86226 124340 172713 19428 15303 -8029 143932 74653 114739 103589
11220 103589 55522 47945 85533 200543 200778 103401 -149444 -189511 -63825 -103384 120369
11209 120369 202570 239400 25352 55713 63073 17701 39108 -5354 -72641 45585 137281
11198 137281 114714 -63213 26035 -51444 88929 123525 135583 184805 162057 101897 27118
$$ packed form
11275C4283m0192l3361M2243R4739l4069j0486J49200m7561n8039j53441K2703
11264c3981O6227j4848j6142J29179o5232o4502J6432J73772j24809r6715j11327
11253a41946J53530n4429R1984Q3605M2010k0425j1006m3937n8151J5477j42045
11242h5333J52490J73608j03271r062m1533j32293J23855J42809q4240j44714
11232g684M0304P7931k4325L8114M8373j53285m125k3332J51961o9279M0086j1150
11220A03589m8067p577L7588J15010K35r7377k52845m0067J25686l9559K23753
11209A20369Q2201L6830k14048L0361P360m5372K1407m4462o7287J18226R1696
11198A37281k2567j77927Q9248p7479J40373L4596J2058M9222k2748o0160p4779
$$ plain form
11187 27118 4854 -60611 153231 24091 87598 142816 100556 -29335 -25673 -135344 13166
11176 13166 56521 129709 73426 97117 101930 183954 56895 67264 90415 -372 85866 228885
11164 228885 167143 108014 136196 171993 178371 158371 14710 -28948 -34271 77405 145806
11153 145806 144000 68253 46764 -24026 -65659 61225 152798 218251 63879 -109816 -133369
11142 -133369 -101172 -66648 -48697 32197 70993 133678 280990 232530 77933 -88248 88021
11131 88021 66781 -12656 27212 76685 122846 118058 98231 52217 -77020 -20833 -106426 -8254
11119 -8254 54048 71036 -148198 -147734 -124085 48947 22645 11698 16586 63810 31373 -8393
11107 -8393 50130 78806 -26719 50698 152985 75484 -25624 163575 23214 -127289 -92282
$$ packed form
11187B7118k2264o5465K13842j29140O3507N5218m2260j29891L662j09671J48510
11176A3166M3355P3188n6283K3691M813Q2024j27059J0369K3151r0787Q6238J43019
11164B28885o1742n9129K8182L5797O378k0000j43661m3658n323J11676O8401
11153A45806j806p5747k1489p0790m1633J26884R1573O5453j54372j73695k3553
11142a33369L2197L4524J7951Q0894L8796O2685J47312m8460j54597j66181J76269
11131H8021k1240p9437L9868M9473M6161m788j9827m6014j29237N6187q5593R8172
11119h254O2302J6988k19234M64K3649J73032k6302j0947M888M7224l2437l9766
11107h393N8523K8676j05525P7417J02287p7501j01108J89199j40361j50503L5007
$$ plain form
11096 -92282 106795 143160 -15179 -41750 205790 289279 17936 -102877 -96271 -30793 -1936
11085 -1936 -97797 -2569 51868 102452 142545 59693 7776 -61278 134913 63484 45578 43167
11073 43167 220786 92259 -61534 -124269 -23458 -73428 36407 12859 200336 33164
11063 33164 -5596 150841 186212 21896 -20086 70344 235624 115025 86634 168014 182356
11052 182356 -28477 62849 187979 89698 -30865 -105927 -79286 -103647 -20431 57298 9150
11041 9150 -28427 -54881 -4377 34262 -95223 -74366 81826 153983 28258 167806 160681
11030 160681 221941 169967 62168 124087 -75107 -34403 -11821 -29502 92049 179960 331639
11019 331639 230064 127452 144212 156859 38906 61289 58029 73114 70150 265426 79618
$$ packed form
11096i2282J99077L6365j58339k6571K47540Q3489k71343j20813O606O5478K8857
11085a936r5861R5228N4437N0584M0093q2852n1917o9054J96191p1429j7906k411
11073D3167J77619j28527j53793o2735J00811m9970J09835k3548J87477j67172
11063C3164l8760J56437L5371j64316m1982R0430J65280j20599k8391Q1380J4342
11052A82356k10833R1326J25130r8281j20563p5062K6641k4361Q3216P7729m8148
11041I150l7577k6454N0504L8639j29485K0857J56192P2157j25725J39548p125
11030A60681O1260n1974j07799O1919j99194M0704K2582j7681J21551Q7911J51679
11019C31639j01575j02612J6760J2647j17953K2383l260J5085k964J95276j85808
$$ plain form
11008 79618 -50463 11457 -17974 -4180 147291 99338 21596 206305 190757 -12424 93900
10997 93900 217487 112439 38986 86955 71554 148723 73144 72717 78133 63400 103460 247041
10985 247041 106997 -124015 -155438 -189938 137185 122283 7137 -55212 -135528 -181623 -41882
10974 -41882 48775 46388 -20994 120211 215471 180732 95336 145230 174634 95991 58588 -56798
10962 -56798 3038 47090 13493 -26846 2133 29810 -34747 43276 104064 33791 -67586
10951 -67586 92474 67912 127571 53032 -7619 -26913 -81908 -58961 -104994 -9904 -80169
10940 -80169 144320 168851 27476 -13618 49153 136432 135480 205400 136412 133344 85913 -53718
10928 -53718 55660 9166 -68880 -113900 -32004 -57097 -40943 -4743 -1621 -117903 -79176
$$ packed form
11008G9618j30081O1920k9431J3794J51471m7953p7742J84709j5548k03181J06324
10997I3900J23587j05048p3453M7969j5401P7169p5579m27N416j4733M0060J43581
10985B47041j40044k31012l1423l4500L27123j4902j15146o2349q0316m6095J39741
10974d1882R0657k387o7382J41205R5260l4739q5396M9894K9404p8643l7403j15386
10962e6798N9836M4052l3597m0339K8979K7677o4557P8023O0788p0273j01377
10951f7586J60060k4562N9659p4539o0651j9294n4995K2947m6033R5090p0265
10940h0169K24489K4531j41375m1094O2771Q7279r52O9920o8988l068m7431j39631
10928e3718J09378m6494p8046m5020Q1896k5093J6154L6200L122j16282L8727
$$ plain form
10917 -79176 -17416 115514 77869 -5945 -5165 142076 126867 149816 98643 69828 -232807
10906 -232807 -298121 -70007 60458 -77576 -40532 106826 76568 58329 44265 263676
10896 263676 202342 118987 83282 111055 -48580 -21998 -139448 -4509 145248 106258 177222
10885 177222 233434 216928 54936 90527 151172 96287 176232 214167 218390 161859 84393
10874 84393 -11528 24100 -89468 -89329 28364 98089 36000 21894 107409 117462 -25264
10863 -25264 58648 83657 31456 90753 349306 296582 124633 -14046 52998 -116146 -39944
10852 -39944 95865 75970 45427 171199 260542 176120 32831 -135349 -146154 -21684 158527
10841 158527 103546 56804 30714 -31997 -13079 -41738 -34114 15865 77796 159908 195836 206046
$$ packed form
10917g9176O1760J32930l7645q3814P80J47241j5209K2949n1173k8815l02635
10906b32807o5314K28114J30465j38034L7044J47358l0258j8239j4064K19411
10896B63676o1334q3355l5705K7773j59635K6582j17450J34939J49757l8990P0964
10885A77222N6212j6506j61992L5591O0645n4885P9945L7935M223n6531p7466
10874H4393r5921L5628j13568J39J17693O9725o2089j4106Q5515J0053j42726
10863b5264Q3912K5009n2201N9297K58553n2724j71949j38679O7044j69144P6202
10852c9944J35809j9895l0543J25772Q9343q4422j43289j68180j0805J24470J80211
10841A58527n4981m6742k6090o2711J8918k8659P624M9979O1931Q2112L5928J0210
$$ plain form
10829 206046 77601 -9585 22696 -47402 -122344 -82574 57092 133335 185525 90631 12917
10818 12917 -127196 -109670 105343 148222 146033 207221 313402 94834 59515 -26840 95909
10807 95909 60937 116526 76491 89781 35554 121564 54129 108449 58440 25990 101527 114198
10795 114198 183137 251564 98832 -52291 -146984 -34869 202051 179154 202066 326734
10785 326734 310819 232899 -12572 -16059 71139 72312 82551 140807 170281 91062 96820 -2179
10773 -2179 -35343 44375 42281 46384 49530 48038 108520 88876 36688 -113116 -97244 121
10761 121 82379 60648 56425 165523 140769 -65103 49913 35831 100747 69827 123613 240546
10749 240546 243744 164526 103362 -13981 25185 -24423 124949 258814 180384 143824 148792
$$ packed form
10829B06046j28445q7186L2281p0098p4942L9770J39666P6243N2190r4894p7714
10818A2917j40113J7526K15013M2879k189O1188J06181k18568l5319q6355J22749
10807I5909l4972N5589m0035J3290n4227Q6010o7435N4320n0009l2450P5537J2671
10795A14198O8939O8427j52732j51123r4693J12115K36920k2897K2912J24668
10785C26734j5915p7920k45471l487Q7198J173J0239N8256K9474p9219N758r8999
10773b179l3164P9718k094M103L146j492O0482j9644n2188j49804J5872R7365
10761A21Q2258k1731m223J09098k4754k05872J15016j4082O4916l0920N3786J16933
10749B40546L198p9218o1164j17343L9166m9608J49372J33865p8430l6560M968
$$ plain form
10738 148792 119189 135418 129054 -6413 -30642 -24779 72689 145073 104052 20903 108858 103907
10726 103907 14027 95982 252233 257411 165374 112203 227336 192490 205545 128385 200158
10715 200158 157588 68177 16182 -25411 -150689 -73415 24690 157476 66374 -40862 31798
10704 31798 83798 199203 241733 126619 -51181 -109456 48005 179990 119717 -13826
10694 -13826 39396 131694 129503 145557 148544 156690 27126 73021 222091 -28167 -143161
10683 -143161 125527 224112 163415 9996 34941 -100720 -157684 -204284 -156236 -34163 75372
10672 75372 104162 64606 86153 27754 -10993 60409 36787 70236 -12734 141551 115657
10661 115657 35728 11155 -8260 -29201 -85352 -1529 77539 40118 36643 35638 97568 78385
$$ packed form
10738A48792k9603J6229o364j35467k4229N863R7468P2384m1021q3149Q7955m951
10726A03907q9880Q1955J56251N178r2037n3171J15133l4846J3055p7160P1773
10715B00158m2570q9411n1995m1593j25278P7274R8105J32786r1102j07236P2660
10704C1798N2000J15405M2530j15114j77800n8275J57461J31985o0273j33543
10694a3826N3222R2298k191J6054K987Q146j29564M5895J49070k50258j14994
10683a43161K68688R8585o0697j53419K4945j35661n6964m6600M8048J22073J09535
10672G5372K8790l9556K1547n8399l8747P1402k3622L3449q2970J54285k5894
10661A15657p9929k4573j9415k0941n6151Q3823P9068l7421l475j005O1930j9183
$$ plain form
10649 78385 62395 82539 87077 130229 168831 219232 162485 -127670 -96196 -93701 101850 153924
10637 153924 115297 -44418 18738 38540 -34184 31943 -25525 -10017 11789 196911 251265
10626 251265 263434 262537 74728 3580 77392 55784 -77474 -27374 65070 -48047 -30455
10615 -30455 -143268 -120371 -112360 -66643 110595 160504 46755 -26904 -113163 -84792 -98985
10604 -98985 -28717 56028 95896 44234 84468 118027 126831 85749 47657 55937 601 40747
10592 40747 127071 -22679 106744 112543 289390 221934 82187 21802 -35597 -198072 -136357
10581 -136357 -15178 243961 162280 139773 77438 44692 -70984 17713 169420 67733
10571 67733 164705 250019 231827 89235 97032 60649 147112 138855 -84104 -76135 20108 105948
$$ packed form
10649G8385j5990K0144M538M3152L8602N0401n6747k90155L1474K495J95551N2074
10637A53924l8627j59715O3156J9802p2724O6127n7468J5508K1806J85122N4354
10626B51265J2169q97j87809p1148P3812k1608j33258N0100R2444j13117J7592
10615c0455j12813K2897Q011M5717J77238M9909j13749p3659q6259K8371j4193
10604i8985P0268Q4745L9868n1662M0234L3559Q804m1082l8092Q280n5336M0146
10592D0747Q6324j49750J29423N799J76847o7456j39747o0385n7399j62475O1715
10581a36357J21179K59139q1681k2507o2335l2746j15676Q8697J51707j01687
10571F7733R6972Q5314j8192j42592P797l6383Q6463q257k22959P969R6243Q5840
$$ plain form
10559 105948 79345 285 128034 -23857 91485 145193 185969 243121 288020 114785 117915
10548 117915 96952 98108 102330 28098 93497 152928 108614 85228 55268 49447 -32210 -24442
10536 -24442 51874 135365 189332 99164 61491 45775 32156 155846 23321 -21551 58185
10525 58185 94365 71516 51953 14178 15401 -75119 -3207 34500 -76381 103526 271564
10514 271564 254326 229081 235846 199398 44146 31046 181970 246924 172143 195676 126960
10503 126960 -31585 124219 186320 245257 122546 232172 207278 199876 78054 285142
10493 285142 157425 -56203 -4109 -21885 -30674 -26035 72500 129371 112694 63699 86560
10482 86560 36062 38831 42364 104005 185378 290085 172417 22839 38145 -3117 67412
$$ packed form
10559A05948k6603p9060J27749j51891J15342N3708M0776N7152M4899j73235L130
10548A17915k0963J156M222p4232O5399N9431m4314k3386k9960n821q1657P768
10536b4442P6316Q3491N3967r0168l7673j5716j3619J23690j32525m4872P9736
10525E8185L6180k2849j9563l7775J223r0520P1912L7707j10881J79907J68038
10514B71564j7238k5245O765l6448j55252j3100J50924O4954p4781K3533o8716
10503A26960j58545J55804O2101N8937j22711J09626k4894p402j21822K07088
10493B85142j27717k13628N2094j7776q789M639R8535N6871j6677m8995K2861
10482H6560n0498K769L533O1641Q1373J04707j17668j49578J5306m1262P0529
$$ plain form
10471 67412 119699 151437 162600 171854 162915 86080 127455 55646 206763 224423 97802 195084
10459 195084 319101 214752 220518 94487 10777 -99922 -70860 -33827 129285 260756
10449 260756 330784 185429 119511 72282 21518 128612 144736 55362 167872 200029 147069
10438 147069 128111 175557 228033 240125 77955 183485 259999 238070 324713 256017 142499
10427 142499 47491 4708 32998 54874 34525 61924 232949 168560 111085 3070 90658
10416 90658 108882 92311 165503 260876 237942 78679 185902 112935 73416 187117 195925
10405 195925 179207 269377 228573 344840 129757 -42686 -109494 94398 110011 216499
10395 216499 120944 228230 193518 377892 227969 191998 122162 117495 254797 270515 204092
$$ packed form
10471F7412N2287L1738J1163R254q939p6835M1375p1809J51117J7660j26621R7282
10459A95084J24017j04349N766j26031q3710j10699K9062L7033J63112J31471
10449B60756P0028j45355o5918m7229n0764J07094J6124q9374J12510L2157n2960
10438A47069j8958M7446N2476J2092j62170J05530P6514k1929Q6643o8696j13518
10427A42499r5008m2783K8290K1876k0349K7399J71025o4389n7475j08015Q7588
10416I0658J8224j6571P3192R5373k2934j59263J07223p2967l9519J13701Q808
10405A95925j6718R0170m0804J16267k15083j72443o6808K03892J5613J06488
10395B16499r5555J07286l4712J84374j49923l5971o9836m667J37302J5718o6423
$$ plain form
10384 204092 209095 130803 59001 77154 183081 255535 236781 109347 35528 116496 96787
10373 96787 112550 -25563 48482 123993 28251 43993 211011 253337 180036 90974 56814
10362 56814 128515 212533 271912 292413 149266 -86060 -66706 -16780 6395 772 118827
10351 118827 288722 265783 293519 260513 188785 207088 305531 120174 184401 131215 112210
10340 112210 68236 67785 -45420 80140 -65442 138111 95831 85345 -21046 -157483 -234324
10329 -234324 -31105 48199 80868 112725 101439 209121 96246 141701 260530 213746 37055
10318 37055 78626 122198 203482 222288 209207 174708 163674 171996 228965 284122 356508 150952
10306 150952 163674 91563 141476 144283 246858 104018 100637 50616 118423 275997 180400
$$ packed form
10384B04092N003p8292p1802J8153J05927P2454j8754j27434p3819Q0968j9709
10373I6787J5763j38113P4045P5511r5742J5742J67018M2326p3301q9062l4160
10362E6814P1701Q4018N9379K0501j43147k35326J9354M9926K3175n623J18055
10351A18827J69895k2939K7736l3006p1728J8303R8443j85357O4227n3186j9005
10340A12210m3974m51j13205J25560j45582K03553m2280j0486j06391j36437p6841
10329b34324K03219P9304L2669L1857j1286J07682j12875M5455J18829m6784j76691
10318C7055M1571M3572Q1284J8806j3081l4499j1034Q322N6969N5157P2386k05556
10306A50952J2722p2111M9913K807J02575j42840l381n0021O7807J57574r5597
$$ plain form
10295 180400 162535 211704 161062 118632 223893 207562 57504 169955 167584 240465 96094
10284 96094 39582 -12620 181975 396348 523477 403151 176912 137014 192915 352837
10274 352837 380835 233221 189702 288755 304100 498336 401652 249200 287157 116705 107841
10263 107841 171854 155726 156075 95735 17601 -30747 167039 227120 231968 196758 297489 319451
10251 319451 362390 201033 142434 65176 201085 221385 309438 179177 191519 149954 174144
10240 174144 48223 34469 59795 172721 137529 296719 283482 177915 69395 88423
10230 88423 58514 25481 235670 379756 294462 268034 275862 278224 123657 149073 110617
10219 110617 66580 234601 210316 284900 158955 156966 262068 227695 148594 223232 212260
$$ packed form
10295A80400j7865M9169n0642m2430J05261j6331j50058J12451k371P2881j44371
10284I6094n6512n2202J94595K14373J27129j20326k26239l9898N5901J59922
10274C52837K7998j47614m3519R9053J5345J94236r6684j52452L7957j70452q864
10263A07841O4013j6128L49o0340p8134m8348J97786O0081M848l5210J00731K1962
10251C19451M2939j61357n8599p7258J35909K0300Q8053j30261J2342m1565K4190
10240A74144j25921j3754K5326J12926l5192J59190j3237j05567j08520J9028
10230H8423k9909l3033K10189J44086q5294k6428P828K362j54567K5416l8456
10219A10617m4037J68021k4285P4584j25945j989J05102l4373p9101P4638j0972
$$ plain form
10208 212260 217708 297624 503232 275007 166977 -63974 -4604 71334 235607 154212 186527
10197 186527 176716 160715 163618 224012 241897 288281 332847 429722 337816 300902 227154 211503
10185 211503 247095 210499 157331 274914 383597 264209 301317 333878 116927 105847 225314
10174 225314 383085 408380 357933 581713 497316 351967 364708 226633 172252 231368 316534
10163 316534 437155 191471 260240 342752 201325 62692 95633 158945 200705 238672 280486
10152 280486 264325 169212 116251 178584 143828 219306 229536 395788 582114 449125 303020
10141 303020 339410 351729 347779 327129 422751 407205 333394 267089 372946 308332 162687
10130 162687 65766 179279 196180 291089 292771 359258 412202 260886 238750 185170 201460
$$ packed form
10208B12260N448P9916K05608k28225j08030k30951N9370P5938J64273q1395L2315
10197A86527r811j6001K903O0394J7885M6384M4566R6875r1906l6914p3748j5651
10185B11503L5592l6596n3168J17583J08683j19388L7108L2561k16951j1080J19467
10174B25314J57771K5295n0447K23780q4397j45349J2741j38075n4381N9116Q5166
10163C16534J20621k45684O8769Q2512j41427j38633L2941O3312M1760L7967M1814
10152B80486j6161r5113n2961O2333l4756P5478J0230J66252J86326j32989j46105
10141C03020L6390J2319l950k0650R5622j5546p3811o6305J05857o4614j45645
10130A62687r6921J13513J6901R4909J682O6487N2944j51316k2136n3580J6290
$$ plain form
10119 201460 323880 479358 534898 563539 422211 438659 450129 337287 164551 348726
10109 348726 294843 372745 460544 489437 220312 126959 184584 420940 201605 95277 330575
10098 330575 398293 362720 435958 343601 312984 175220 222984 407049 520074 435673 389625
10087 389625 379979 417686 376733 429119 426514 409199 532762 477343 575914 439891 362960
10076 362960 413708 415571 351513 538354 552695 580721 416223 389243 451707 525738 492797
10065 492797 567726 701454 764204 958420 1042787 909959 1027620 873585 818138 882530
10055 882530 925152 981680 1305628 1180098 1173957 1100569 999058 907245 902334 825918 854261
10044 854261 836046 797432 665496 570768 622029 564839 556541 665079 694174 698141 848053
$$ packed form
10119B01460J22420J55478N5540K8641j41328J6448J1470j12842j72736J84175
10109C48726n3883P7902Q7799K8893k69125r3353N7625K36356k19335j06328K35298
10098C30575O7718l5573P3238r2357l0617j37764M7764J84065J13025q4401m6048
10087C89625r646L7707m0953N2386k605j7315J23563n5419R8571j36023p6931
10076C62960N0748J863o4058J86841J4341K8026j64498k6980O2464P4031l2941
10065D92797P4929J33728O2750J94216Q4367j32828J17661j54035n5447O4392
10055H82530M2622N6528L23948j25530o141p3388j01511r1813m911p6416K8343
10044H54261j8215l8614j31936r4728N1261n7190q298J08538K9095L967J49912
$$ plain form
10033 848053 927357 693422 610509 721474 664265 684652 716915 861131 1047309 1240443
10023 1240443 1199715 1251058 1244597 1535672 1373141 1287329 1329177 1221388 1228920 1201831 1037269
10012 1037269 910865 762541 857704 824521 842520 706300 685326 702050 654373 679830 548000
10001 548000 377109 464132 520537 575264 540525 502099 471426 568490 455676 308856 453903
9990 453903 620353 605383 497860 668805 551698 459861 442192 570762 571177 563775 540270
9979 540270 525291 470385 448722 419013 608516 605691 554640 467919 441671 331271 505874
9968 505874 575023 498625 551775 609041 665466 693749 532720 441551 485662 700329 748439
9957 748439 700262 526830 479710 555089 433918 412313 494927 588649 607938 610872 663650
$$ packed form
10033H48053P9304k33935q2913J10965n7209K0387L2263J44216J86178J93134
10023A240443m0728N1343o461K91075j62531q5812M1848j07789P532k7089j64562
10012A037269j26404j48324R5163l3183J7999j36220k0974J6724m7677K5457j31830
10001E48000j70891Q7023N6405N4727l4739l8426l0673R7064j12814j46820J45047
9990D53903J66450j4970j07523J70945j17107r1837j7669J28570M15p402k3505
9979E40270j4979n4906k1663k9709J89503k825n1051q6721k6248j10400J74603
9968E05874O9149p6398N3150N7266N6425K8283j61029r1169M4111K14667M8110
9957G48439m8177j73432m7120P5379j21171k1605Q2614R3722J9289K934N2778
$$ plain form
9946 663650 780013 791434 752154 492336 443033 460277 501412 641615 675978 625054 546418
9935 546418 559547 691834 590275 505337 590566 778844 745253 715836 530056 535208 538513
9924 538513 709916 748937 647807 673016 770203 677479 704372 668156 752473 728642 692996
9913 692996 619612 719647 848006 906463 851293 829891 683824 667255 800911 901559 891572
9902 891572 1014890 1095847 930186 950359 1072522 948184 824678 851441 843611 926145 947248
9891 947248 832940 766105 932579 995789 1081386 1033862 882114 802961 989697 1154997 1130094
9880 1130094 1028281 1119998 1010733 933616 956431 1065621 1039635 1041076 1007302 1126212 1069767
9869 1069767 1169624 1114101 1147137 1060378 1082469 1153756 1227917 1201203 1131571 1170870 1313678
$$ packed form
9946F63650J16363J1421l9280k59818m9303J7244M1135J40203L4363n0924p8636
9935E46418J3129J32287j01559q4938Q5229J88278l3591k9417j85780N152L305
9924E38513J71403L9021j01130K5209R7187r2724K6893l6216Q4317k3831l5646
9913F92996p3384J00035J28359N8457n5170k1402j46067j6569J33656J00648r987
9902H91572J23318Q0957j65661K0173J22163j24338j23506K6763p830Q2534K1103
9891I47248j14308o6835J66474O3210Q5597m7524j51748p9153J86736J65300k4903
9880A130094j01813R1717j09265p7117K2815J09190k5986J441l3774J18910n6445
9869A069767R9857n5523L3036q6759K2091P1287P4161k6714o9632L9299J42808
$$ plain form
9858 1313678 1220303 1061505 966266 1020171 1160064 1253269 1212112 1186424 1145936 1196172 1202338
9847 1202338 1171563 1130828 1149604 1380063 1385888 1415425 1378294 1469218 1280732 1291140 1385141
9836 1385141 1608063 1620610 1633225 1545805 1597702 1383039 1421333 1615150 1617594 1589315 1674826
9825 1674826 1932074 1812708 1712651 1780213 1750063 1790194 1899553 2154682 2151434 2078779 2126802
9814 2126802 2220824 2187266 2024830 2057792 2178548 2111990 2266415 2519637 2360938 2184145
9804 2184145 2280758 2337270 2346944 2383239 2484628 2588361 2485846 2422544 2458332 2632042 2511568
9793 2511568 2466568 2589640 2826330 2961677 3123457 3144168 3118721 2935273 2896227 3064677
9783 3064677 3295476 3280870 3375756 3450799 3613987 3569449 3640110 3556347 3550583 3697586 3811411
$$ packed form
9858A313678r3375j58798r5239N3905J39893R3205m1157k5688m0488N0236O166
9847A202338l0775m0735J8776K30459N825K9537l7131R0924j88486J0408R4001
9836A385141K22922J2547J2615q7420N1897k14663L8294J93817K444k8279Q5511
9825A674826K57248j19366j00057O7562l0150M0131J09359K55129l248p2655M8023
9814B126802R4022l3558j62436L2962J20756o6558J54425K53222j58699j76793
9804B184145R6613N6512R674L6295J01389J03733j02515o3302L5788J73710j20474
9793B511568m5000J23072K36690J35347J61780K0711k5447j83448l9046J68450
9783C064677K30799j4606R4886P5043J63188m4538P0661q3763n764J47003J13825
$$ plain form
9772 3811411 4104309 4262684 4127604 4163778 4099649 4102375 4057357 4141773 4371217 4666316 4876198
9761 4876198 4917132 5187695 5120541 4947472 5095987 5349977 5602278 5779689 5903026 5995180
9751 5995180 6010186 6225838 6509601 6782430 6929181 7154992 7295493 7640062 7645518 7803624
9741 7803624 8127884 8292095 8519140 8876193 9210205 9604922 9714025 10084249 10446141 10880392
9731 10880392 11221817 11558816 11776255 12063674 12600471 13345708 14022517 14671415 15286075
9722 15286075 15981637 16834875 17833443 19007743 20240468 21415104 22814069 24556974 26354006
9713 26354006 28298400 30562412 33115394 36282070 40099606 44587308 49959817 56468933
9705 56468933 64353087 73773005 85132064 98014846 110785507 121373301 129136895 137073700
$$ packed form
9772C811411K92898J58375j35080L6174o4129K726m5018Q4416K29444K95099K09882
9761D876198M0934K70563o7154j73069J48515K53990K52301J77411J23337R2154
9751E995180J5006K15652K83763K72829J46751K25811J40501L44569N456J58106
9741G803624L24260J64211K27045L57053L34012L94717J09103L70224L61892M34251
9731A0880392L41425L36999K17439K87419N36797P45237O76809O48898O14660
9722A5286075O95562Q53238R98568J174300J232725J174636J398965J742905J797032
9713B6354006J944394K264012K552982L166676L817536M487702N372509O509116
9705E6468933P884154R419918J1359059J2882782J2770661J0587794P763594P936805
$$ plain form
9697 137073700 149251214 163959893 175415141 178158063 171206959 159253984 145417580
9690 145417580 128365923 109120830 91366839 77661987 67390555 59794134 54192748
9683 54192748 50314255 47762182 46382577 45870253 45768734 46147431 47168507 48660247 50637187
9674 50637187 53380296 57170098 62364658 69473924 79278973 91530971 104627309 116250500
9666 116250500 125240944 133139737 143255878 156150438 169049061 178376549 182187342 181499068
9658 181499068 176113589 165742979 150803729 131226178 109415583 89714654 74184754
9651 74184754 62289490 52809614 45268615 39538713 35336369 32077450 29324223 27055811
9643 27055811 25196434 23563503 22072069 20869096 19632341 18499992 17504225 16784450
$$ packed form
9697A37073700J2177514J4708679J1455248K742922o951104j1952975j3836404
9690A45417580j7051657j9245093j7753991j3704852j0271432p596421n601386
9683E4192748l878493k552073j379605n12324j01519L78697J021076J491740J976940
9674E0637187K743109L789802N194560P109266R805049J2251998J3096338J1623191
9666A16250500Q990444P898793J0116141J2894560J2898623R327488L810793o88274
9658A81499068n385479j0370610j4939250j9577551k1810595j9700929j5529900
9651G4184754j1895264r479876p540999n729902m202344l258919k753227k268412
9643B7055811j859377j632931j491434j202973j236755j132349r95767p19775
$$ plain form
9635 16784450 16201106 15519165 14950870 14573304 14092723 13378998 12802993 12340916 11951919
9626 11951919 11654267 11131356 10817227 10369164 9778481 9344059 9044575 8595042 8275443
9617 8275443 7923445 7720565 7489816 7233659 6875737 6898490 6661311 6384446 6192865 5891256
9607 5891256 5683084 5531831 5463617 5186432 5192474 5108228 4891505 4821347 4685974 4538256
9597 4538256 4401333 4273162 4257285 4129035 4062484 3980087 3858010 3757234 3702539 3518019
9587 3518019 3535792 3382785 3382487 3409558 3363074 3111100 2961023 2889741 2809306 2767298 2829756
9576 2829756 2805019 2688197 2661893 2775999 2642361 2538005 2501502 2469714 2402466 2400994 2522968
9565 2522968 2494922 2406260 2239547 2134566 2132132 1932869 1949967 2042900 2028713 1984674 2005291
$$ packed form
9635A6784450n83344o81941n68295l77566m80581p13725n76005m62077l88997
9626A1951919k97652n22911l14129m48063n90683m34422k99484m49533l19599
9617H275443l51998k02880k30749k56157l57922K2753k37179k76865j91581l01609
9607E891256k08172j51253o8214k77185O042q4246k16723p0158j35373j47718
9597D538256j36923j28171j5877j28250o6551q2397j22077j00776n4695j84520
9587C518019J7773j53007k98K7071m6484k51974j50077p1282q0435m2008O2458
9576B829756k4737j16822k6304J14106j33638j04356l6503l1788o7248j472J21974
9565B522968k8046q8662j66713j04981k434j99263J7098R2933j4187m4039K0617
$$ plain form
9554 2005291 1887783 1932367 1865213 1672112 1578622 1666931 1663188 1772040 1792110 1621096 1530039
9543 1530039 1319885 1367303 1539510 1629383 1549432 1602221 1670190 1581877 1495800 1460983 1383029
9532 1383029 1291102 1294520 1571221 1653333 1641100 1522707 1363156 1220461 1229064 1324100 1435255
9521 1435255 1464885 1438018 1527138 1547701 1441653 1238721 1082468 994200 1048233 1209249 1385604
9510 1385604 1303945 1283213 1340513 1385062 1227657 979833 1191102 1154131 1218287 1336198 1339997
9499 1339997 967059 871166 929372 883453 816369 940175 1004760 1137672 1187617 1056154 1052642
9488 1052642 949807 840375 785666 856535 846373 910674 1009845 954734 974022 832760 908795
9477 908795 947352 1051268 1093695 1137696 1102889 1101772 1009978 890162 931202 987287 1116886
$$ packed form
9554B005291j17508M4584o7154j93101r3490Q8309l743J08852K0070j71014r1057
9543A530039k10154M7418J72207Q9873p9951N2789O7969q8313q6077l4817p7954
9532A383029r1927L418K76701Q2112j2233j18393j59551j42695Q603R5036J11155
9521A435255K9630k6867Q9120K0563j06048k02932j56253q8268N4033J61016J76355
9510A385604q1659k0732N7300M4549j57405k47824K11269l6971O4156J17911L799
9499A339997l72938r5893N8206m5919o7084J23806O4585J32912M9945j31463l512
9488A052642j02835j09432n4709P0869j0162O4301R9171n5111J9288j41262P6035
9477I08795L8557J03916M2427M4001l4807j117r1794j19816M1040N6085J29599
$$ plain form
9466 1116886 1116656 1263460 1371159 1145208 1081880 989367 875855 765289 841689 908254 880320
9455 880320 953851 889116 768219 676987 704876 839565 896340 929428 931780 838735 765440
9444 765440 761837 882533 719665 779230 948965 1038345 1175173 1346217 1385834 1330108 1187231
9433 1187231 1299551 1399616 1518789 1597897 1636414 1551652 1485560 1381593 1384066 1181454 1126790
9422 1126790 1146115 1057893 959777 1057441 1032976 1011087 944148 912784 960629 1017544 1031177
9411 1031177 1015749 914031 849297 930065 1029013 995899 967024 978529 1017313 1072235 1033983
9400 1033983 1236428 1416911 1530915 1578306 1536431 1370697 1264639 1215602 1230387 1329445
9390 1329445 1278279 1095020 1121695 980174 896728 933096 1070672 874226 902774 918952 981907
$$ packed form
9466A116886k30J46804J07699k25951o3328r2513j13512j10566P6400O6565k7934
9455H80320P3531o4735j20897r1232K7889J34689N6775L3088K352r3045p3295
9444G65440l603J20696j62868N9565J69735Q9380J36828J71044L9617n5726j42877
9433A187231J12320J00065J19173P9108L8517q4762o6092j03967K473k02612n4664
9422A126790J9325q8222r8116R7664k4465k1889o6939l1364M7845N6915J3633
9411A031177j5428j01718o4734Q0768R8948l3114k8875J1505L8784N4922l8252
9400A033983K02445J80483J14004M7391m1875j65734j06058m9037J4785R9058
9390A329445n1166j83259K6675j41521q3446L6368J37576j96446K8548J6178O2955
$$ plain form
9379 981907 826809 853827 974232 918041 917808 1042759 1064719 950946 785900 802241 992453
9368 992453 1085367 1028187 967955 1066704 942848 855936 896502 976864 837605 843007 936407
9357 936407 958670 980376 1026138 1133765 1046188 1047286 1192844 1120211 1134211 1108445 1162366
9346 1162366 1165979 1141498 1113191 1228579 1261536 1382548 1411628 1571325 1513122 1662759 1724238
9335 1724238 1866562 1934762 1941203 1975156 2135688 1974440 1833620 1804943 1918559 2048693
9325 2048693 1844299 1883408 1933780 1992819 2102264 2171326 2267476 2229403 2341256 2608777 2589534
9314 2589534 2516523 2545488 2466334 2203341 2177672 2205744 2087866 2103416 2249927 2358095 2532854
9303 2532854 2510880 2541490 2577848 2612899 2540509 2758724 2639845 2569307 2509843 2449434 2418024
$$ packed form
9379I81907j55098K7018J20405n6191k33J24951K1960j13773j65046J6341J90212
9368I92453R2914n7180o0232R8749j23856q6912M0566Q0362j39259N402R3400
9357I36407K2263K1706M5762J07627q7577J098J45558p2633J4000k5766N3921
9346A162366L613k4481k8307J15388L2957J21012K9080J59697n8203J49637O1479
9335A724238J42324O8200O441L3953J60532j61248j40820k8677J13616J30134
9325B048693k04394L9109N0372N9039J09445O9062R6150l8073J11853K67521j9243
9314B589534p3011K8965p9154k62993k5669K8072j17878J5550J46511J08168J74759
9303B532854k1974L0610L6358L5051p2390K18215j18879p0538n9464o0409l1410
$$ plain form
9292 2418024 2436716 2392867 2389185 2525629 2703679 2778442 2888956 2882713 3153839 3218983 3351419
9281 3351419 3404890 3519625 3537715 3347891 3213911 3282766 2883716 2572632 2536924 2356520
9271 2356520 2314723 2098730 1984913 2022890 2053970 2106245 2107554 2124223 2015437 2025683 2059658
9260 2059658 2138732 2205382 2143374 2077962 1962941 2045147 2055553 2056663 2138792 2283789 2311520
9249 2311520 2371024 2236380 2437407 2412419 2428425 2445050 2444297 2498942 2491291 2218716 2246166
9238 2246166 2325338 2325092 2174746 2275062 2224401 2197453 2265298 2443623 2438779 2288284 2096304
9227 2096304 2199777 2236229 2374072 2465306 2643272 2725925 2791985 2847024 2931190 3109395 3203117
9216 3203117 3320767 3404224 3506598 3484369 3604329 3581113 3448551 3250941 3318228 3272809
$$ packed form
9292B418024J8692m3849l682J36444J78050P4763J10514o243K71126O5144J32436
9281C351419N3471J14735J8090j89824j33980O8855l99050l11084l5708j80404
9271B356520m1797k15993j13817L7977L1080N2275J309J6669j08786J0246L3975
9260B059658P9074O6650o2008o5412j15021Q2206J0406J110Q2129J44997K7731
9249B311520N9504j34644K01027k4988J6006J6625p53N4645p651k72575K7450
9238B246166P9172k46j50346J00316n0661k6948O7845J78325m844j50495j91980
9227B096304J03473L6452J37843R1234J77966Q2653O6060N5039Q4166J78205R3722
9216C203117J17650Q3457J02374k2229J19960k3216j32562j97610O7287m5419
$$ plain form
9206 3272809 3160568 3200223 3189616 3141982 3174745 3241390 3417996 3069784 3102016 3170628 3335012
9195 3335012 3342602 3355060 3435268 3503232 3436951 3458665 3402303 3642193 3560168 3688321 3834736
9184 3834736 3880902 3799609 3785293 3760343 3735214 3655830 3847658 3967779 4010861 4146237 4274041
9173 4274041 4255862 4242395 4357783 4535732 4687726 4748077 4787000 5029013 5263333 5192202
9163 5192202 5347810 5425093 5449205 5513071 5748922 5938933 6011385 6076338 6265174 6270342 6447530
9152 6447530 6521383 6793909 6775344 6822918 7006921 7332993 7257243 7380929 7564709 7860561
9142 7860561 8098957 8380643 8609380 8901245 9121865 9427183 9708035 10103607 10397668 11012573
9132 11012573 11346384 11753268 12182502 12863920 13485882 14119755 14799000 15463648 16235277
$$ packed form
9206C272809j12241L9655j0607m7634L2763O6645J76606l48212L2232O8612J64384
9195C335012P590J2458Q0208O7964o6281K1714n6362K39890q2025J28153J46415
9184C834736M6166q1293j4316k4950k5129p9384J91828J20121M3082J35376J27804
9173D274041j8179j3467J15388J77949J51994O0351L8923K42013K34320p1131
9163E192202J55608P7283K4112O3866K35851J90011P2452O4953J88836N168J77188
9152F447530P3853K72526j8565M7574J84003L26072p5750J23686J83780K95852
9142G860561K38396K81686K28737K91865K20620L05318K80852L95572K94061O14905
9132A1012573L33811M06884M29234O81418O21962O33873O79245O64648P71629
$$ plain form
9123 16235277 17252171 18199120 19439138 20729420 22362628 24580685 27125711 30359268
9115 30359268 35100015 41579550 49181855 56288853 60941039 62516403 62154499 62922439
9107 62922439 65130152 66695360 65364310 60127098 53055883 46799041 42021672 38470687
9099 38470687 35630380 34002229 32909856 32726003 32739284 33310530 34042018 35505636 37231674
9090 37231674 39294223 41523789 44688312 49060915 54980215 62668900 72184274 81986999
9082 81986999 89910271 93565495 93812302 92930695 94563217 100159392 110451887 124086858
9074 124086858 138730206 150362171 155967253 156114881 152890333 147421019 139044910 126238902
9066 126238902 109555819 93182281 80005932 69958586 62275133 56440141 52219163
$$ packed form
9123A6235277J016894R46949J240018J290282J633208K218057K545026L233557
9115C0359268M740747O479535P602305P106998M652186J575364l61904P67940
9107F2922439K207713J565208j331050n237212p071215o256842m777369l550985
9099C8470687k840307j628151j092373j83853J3281N71246P31488J463618J726038
9090C7231674K062549K229566L164523M372603N919300P688685R515374R802725
9082H1986999P923272L655224K46807q81607J632522N596175J0292495J3634971
9074A24086858J4643348J1631965N605082J47628l224548n469314q376109j2806008
9066A26238902j6683083j6373538j3176349j0047346p683453n834992m220978
$$ plain form
9059 52219163 49457240 47917987 46972381 46481927 46682875 47221561 48389643 49868360 52214974
9050 52214974 55172654 59257290 64593596 72419388 83255654 98294267 116370160 133730176
9042 133730176 144936777 147519267 143937594 141703809 143428316 145513983 141911028 129671232
9034 129671232 111288662 93452489 78888851 67345838 58089972 50872526 45366129
9027 45366129 41485925 38199772 35710384 33740466 32073976 30483788 29333948 28294351
9019 28294351 27138359 26226987 25613340 25010972 24265669 23680761 23189578 22847491 22551435
9010 22551435 22467886 22480966 22410820 22242944 22234607 22046159 22081120 22225957 22371651 22459297 22717904
8999 22717904 22885343 23286777 23507641 23949836 24322336 24778444 24939879 25190746 25577473
$$ packed form
9059E2219163k761923j539253r45606m90454K00948N38686J168082J478717K346614
9050E2214974K957680M084636N336306P825792J0836266J5038613J8075893J7360016
9042A33730176J1206601K582490l581673k233785J724507K085667l602955j2239796
9034A29671232j8382570j7836173j4563638j1543013r255866p217446n506397
9027D5366129l880204l286153k489388j969918j666490j590188j149840j039597
9019B8294351j155992r11372o13647o02368p45303n84908m91183l42087k96056
9010B2551435q3549J3080p0146j67876q337j88448L4961J44837J45694Q7646K58607
8999B2717904J67439M01434K20864M42195L72500M56108J61435K50867L86727
$$ plain form
8990 25577473 26199225 26506191 26941365 27404200 28161621 28592495 29285093 29837781 30747543
8981 30747543 31743722 33014548 34223378 35668099 37088953 38751023 40607866 42860230
8973 42860230 45457849 48386220 51800763 55528817 59815843 64456273 69389893 75139286
8965 75139286 81863889 89721726 99065268 110539837 124485097 141583338 163266120 191686709
8957 191686709 228180360 270001294 310141622 339858837 356160809 364406851 369168330
8950 369168330 364661064 342478325 302623186 257892463 219050315 187932312 162215456
8943 162215456 140812810 123793065 111277220 102070079 95437187 90486925 87431634 85742402
8935 85742402 85374399 85821736 87314094 89447310 92810989 97280853 103907826 113383016
$$ packed form
8990B5577473O21752L06966M35174M62835P57421M30874O92598N52688R09762
8981C0747543R96179J270826J208830J444721J420854J662070J856843K252364
8973D2860230K597619K928371L414543L728054M287026M640430M933620N749393
8965G5139286O724603P857837R343542J1474569J3945260J7098241K1682782K8420589
8957A91686709L6493651M1820934M0140328K9717215J6301972Q246042M761479
8950C69168330m507266k2182739l9855139m4730723l8842148l1118003k5716856
8943A62215456k1402646j7019745j2515845r207141o632892m950262l055291j689232
8935H5742402l68003M47337J492358K133216L363679M469864O626973R475190
$$ plain form
8927 113383016 126351241 142313870 159643252 176955622 194895685 216671090 241097045
8920 241097045 263804238 283197251 300596963 316447239 325448876 322610569 309951019
8913 309951019 290873088 266466723 237370677 204000201 170678742 142863038 120994803
8906 120994803 104032127 90930666 80925312 73251025 67383675 62905772 59388472 56664423
8898 56664423 54497302 52740256 51521293 50454072 50165382 50179317 50924558 52420592 55188053
8889 55188053 59408173 65852137 74769944 84379136 91444722 94300826 92710534 91007281
8881 91007281 90516562 88744355 82913776 72999162 61908000 52536800 45231551 39478079
8873 39478079 34821706 31266688 28590987 26558186 24847308 23293924 22026224 20948044
$$ packed form
8927A13383016J2968225J5962629J7329382J7312370J7940063K1775405K4425955
8920B41097045K2707193J9393013J7399712J5850276R001637k838307j2659550
8913C09951019j9077931k4406365k9096046l3370476l3321459k7815704k1868235
8906A20994803j6962676j3101461j0005354p674287n867350m477903l517300k724049
8898E6664423k167121j757046j218963j067221k88690J3935P45241J496034K767461
8889E5188053M220120O443964Q917807R609192P065586K856104j590292j703253
8881I1007281m90719j772207n830579r914614j1091162r371200p305249n753472
8873C9478079m656373l555018k675701k032801j710878j553384j267700j078180
$$ plain form
8865 20948044 19999452 19097081 18370342 17664144 17016971 16249629 15703255 15081297 14432549
8856 14432549 13855236 13537780 13145921 12789767 12434988 12159642 11535363 11130205 10901328
8847 10901328 10739859 10320124 9940418 9616561 9610658 9273194 8821846 8520038 8289423 7881927
8837 7881927 7713226 7559988 7514110 7361649 7097949 6850873 6706875 6558602 6515729 6433573
8827 6433573 6423926 6162580 5992072 5876083 5680423 5479538 5405519 5212398 5113061 4961736
8817 4961736 4882792 4794197 4664790 4479759 4234216 4051945 3974697 3922126 3774235 3672630
8807 3672630 3557666 3523934 3454612 3437372 3177192 3082902 3053832 3123639 2956069 3009538 3069265
8796 3069265 2994597 2825473 2922200 2852084 2907672 2786301 2800028 2734004 2715421 2677992 2840165
$$ packed form
8865B0948044r48592r02371p26739p06198o47173p67342n46374o21958o48748
8856A4432549n77313l17456l91859l56154l54779k75346o24279m05158k28877
8847A0901328j61469m19735l79706l23857n903l37464m51348l01808k30615m07496
8837G881927j68701j53238m5878j52461k63700k47076j43998j48273m2873q2156
8827F433573r647k61346j70508j15989j95660k00885p4019j93121r9337j51325
8817D961736p8944q8595j29407j85031k45543j82271p7248n2571j47891j01605
8807C672630j14964l3732o9322j7240k60180r4290k9070O9807j67570N3469N9727
8796C069265p4668j69124R6727p0116N5588j21371J3727o6024j8583l7429J62173
$$ plain form
8785 2840165 2495402 2479069 2478506 2603373 2283730 2196288 2225125 2392379 2261575 2163833 2227027
8774 2227027 2227566 2069468 2077972 2156601 2047418 2098108 2194789 2237004 2103610 1900762 1797324
8763 1797324 1744924 1788169 1807292 1817381 1815030 1779406 1782729 1806852 1790073 1581253 1537772 1504702
8751 1504702 1538580 1572567 1593843 1530334 1579093 1587346 1724724 1624557 1858093 1776485 1759439
8740 1759439 1768309 1924920 1777819 1823613 1774976 1792099 1674999 1630969 1538752 1452384 1461478
8729 1461478 1569626 1478155 1467765 1386418 1542867 1519441 1558631 1714897 1721678 1630534 1627815
8718 1627815 1622657 1509960 1407460 1397014 1381669 1486352 1400290 1265967 1370569 1431253 1286164
8707 1286164 1267116 1333343 1350469 1365217 1213007 1174397 1262792 1432805 1288531 1150225 1193107
$$ packed form
8785B840165l44763j6333n63J24867l19643q7442K8837J67254j30804r7742O3194
8774B227027N39j58098Q504P8629j09183N0690R6681M2215j33394k02848j03438
8763A797324n2400M3245J9123J0089k351l5624L323K4123j6779k08820m3481l3070
8751A504702L3878L3987K1276o3509M8759Q253J37378j00167K33536q1608j7046
8740A759439Q870J56611j47101M5794m8637J7123j17100m4030r2217q6368R094
8729A461478J08148r1471j0390q1347J56449k3426L9190J56266O781r1144k719
8718A627815n158j12697j02500j0446j5345J04683q6062j34323J04602O0684j45089
8707A286164j9048O6227J7126J4748j52210l8610Q8395J70013j44274j38306M2882
$$ plain form
8696 1193107 1072614 982394 1020669 1099497 995873 858451 996260 909979 1026742 1000053
8686 1000053 996850 995123 1082006 1088613 1093893 952079 854000 720454 811835 683196 772269 761425
8674 761425 899907 823645 669066 550842 631070 624934 580091 565295 714957 732975 669005
8663 669005 561407 475077 378159 347675 422052 448013 185762 152873 297274 292017 348947
8652 348947 253241 333849 252156 233453 204284 344545 426990 330169 144602 142326 251443
8641 251443 257434 184061 284753 261799 325404 229759 285310 272835 291963 246713 125356
8630 125356 123062 326480 188390 231155 116545 57694 33673 41566 176543 160198 171761
8619 171761 134779 -38396 118491 239467 360678 313797 376321 340510 260521 324593 347023
$$ packed form
8696A193107j20493r0220L8275P8828j03624j37422J37809q6281J16763k6689
8686A000053l203j727Q6883O607N280j41814r8079j33546R1381j28639Q9073j0844
8674G61425J38482p6262j54579j18224Q0228o136m4843j4796J49662J8018o3970
8663F69005j07598q6330r6918l0484P4377K5961k62251l2889J44401n257N6930
8652C48947r5706Q0608q1693j8703k9169J40261Q2445r6821j85567k276J09117
8641B51443N991p3373J00692k2954O3605r5645N5551j2475J9128m5250j21357
8630A25356k294K03418j38090M2765j14610n8851k4021P893J34977j6345J1563
8619A71761l6982j73175J56887J20976J21211m6881O2524l5811p9989O4072K2430
$$ plain form
8608 347023 203094 47162 111786 247169 344651 375430 436654 542308 658123 678985 855477
8597 855477 903164 1163386 1179634 1208361 1403740 1510560 1352569 1297338 1352831 1434340 1511771
8586 1511771 1266636 1058725 1062624 918844 790965 678130 612254 589473 427538 296272
8576 296272 489700 555050 155157 21351 428308 342964 245061 228396 393514 374884 377920
8565 377920 461163 603045 610338 599601 774486 997626 1279937 1325857 1495788 1579983 1559180
8554 1559180 1698410 1762983 1641490 1547502 1627994 1620581 1352117 1061965 917252 739083
8544 739083 602956 335808 401010 566542 460951 282381 257733 275007 226688 175766 182880
8533 182880 385667 297233 144592 149819 118175 35429 7067 115332 108426 143687 480811
$$ packed form
8608C47023j43929j55932O4624J35383R7482L0779O1224J05654J15815K0862J76492
8597H55477M7687K60222J6248K8727J95379J06820j57991n5231N5493Q1509P7431
8586A511771k45135k07911L899j43780j27879j12835o5876k2781j61935j31266
8576B96272J93428O5350l99893j33806M06957q5344r7903j6665J65118j8630L036
8565C77920Q3243J41882P293j0737J74885K23140K82311M5920J69931Q4195k0803
8554A559180J39230O4573j21493r3988Q0492p413k68464k90152j44713j78169
8544G39083j36127k67148O5202J65532j05591j78570k4648J7274m8319n0922P114
8533A82880K02787q8434j52641N227l1644q2746k8362J08265o906L5261L37124
$$ plain form
8522 480811 749921 668856 487017 518390 382449 321011 309114 407893 387156 298550 266396
8511 266396 9507 -159795 -91908 -80065 79980 99387 146208 241232 90728 -23013 -96150
8500 -96150 -130375 -91521 17122 51494 169359 121193 106781 68250 -81400 -167874 -30356
8489 -30356 -50136 -59308 112186 93071 -52000 -47020 -157307 -210705 -198637 -106969 14268
8478 14268 40289 -77066 -48651 52521 -20935 -289884 -214865 -37048 -21732 60098 25935
8467 25935 80232 -41380 -269277 -334868 -193268 -13145 1511 93334 142256 59649 28094
8456 28094 -117103 -128127 -272897 -253915 -63302 36817 26589 -25879 124068 188064 23216
8445 23216 132505 30846 -60639 -45267 142454 124318 49649 -190715 -247599 -83049 -188650
$$ packed form
8522D80811K69110q1065j81839L1373j35941o1438j1897R8779k0737q8606l2154
8511B66396k56889j69302O7887J1843J60045J9407M6821R5024j50504j13741p3137
8500i6150l4225L8854J08643L4372J17865m8166j4412l8531j49650q6474J37518
8489c0356j9780r172J71494j9115j45071M980j10287n3398J2068R1668J21237
8478A4268K6021j17355K8415J01172p3456k68949P5019J77817J5316Q1830l4163
8467B5935N4297j21612k27897o5591J41600J80123J4656R1823M8922q2607l1555
8456B8094j45197j1024j44770J8982J90613J00119j0228n2468J49947O3996j64848
8445B3216J09289j01659r1485J5372J87721j8136p4669k40364n6884J64550j05601
$$ plain form
8434 -188650 -232087 -86531 -183474 -180978 -298915 -217126 -152126 -93743 -119638 -60345 23564
8423 23564 -64419 -170804 -244609 -367502 -171426 -127441 53763 -70434 -24775 164900 78843
8412 78843 -137766 -95660 -43867 -144526 -192715 12957 171830 -41106 -109881 -210645 -178195
8401 -178195 -410982 -273088 -76406 47295 104251 -55522 -10685 -68021 -272014 -251843
8391 -251843 -103578 -204817 -327100 -165519 -197278 -73268 -187054 -102430 -55956 -118046
8381 -118046 -172725 -62142 -134999 -73366 -95016 55283 -131294 -194950 -175696 -119518 -88246
8370 -88246 -53784 14487 -34910 -278534 -355590 -207657 -153980 -223818 -90579 -111507 -113338
8359 -113338 -133560 -103682 -64704 -74416 -150071 -37542 128102 175643 35392 -122864 -139891
$$ packed form
8434a88650m3437J45556r6943K496j17937Q1789O5000N8383k5895N9293Q3909
8423B3564q7983j06385p3805j22893J96076M3985J81204j24197M5659J89675q6057
8412G8843k16609M2106N1793j00659m8189K05672J58873k12936o8775j00764L2450
8401a78195k32787J37894J96682J23701N6956j59773M4837n7336k03993K0171
8391b51843J48265j01239j22283J61581l1759J24010j13786Q4624M6474o2090
8381a18046n4679J10583p2857O1633k1650J50299j86577o3656J9254N6178L1272
8370h8246L4462O8271m9397k43624p7056J47933N3677o9838J33239k0928j831
8359a13338k0222K9878L8978r712p5655J12529J65644M7541j40251j58256j7027
$$ plain form
8348 -139891 -184021 -93585 -3478 -33306 -148494 -180753 -250836 -265577 -152320 -134881 -93191
8337 -93191 -67783 -92069 -87307 23215 -42545 -27413 50634 81468 90305 83734 242658 5481
8325 5481 -69869 40347 194592 -87971 -237513 -12172 19140 -3469 82428 15246 -31281
8314 -31281 -198413 -132592 -66313 29119 -65007 -70384 -3831 32076 -95151 -174368 -326201
8303 -326201 -352461 -274141 -71879 11757 47536 -87435 -94388 -41105 45478 111650 54646
8292 54646 -13565 -109625 22562 114162 -21372 -63394 -29192 -51267 -150120 -327664 -164959
8281 -164959 -49924 68100 49443 25701 -689 -120057 -201343 -152449 -224129 -190004 -96117
8270 -96117 -153266 -309886 -320162 -258247 -226127 -256888 -151055 -39355 -85305 -85765 41043
$$ packed form
8348a39891m4130R0436R0107k9828j15188l2259p0083j4741J13257J7439M1690
8337i3191K5408k4286M762J10522o5760J5132P8047L0834Q837o571J58924k37177
8325E481p5350J10216J54245k82563j49542K25341L1312k2609Q5897o7182m6527
8314c1281j67132O5821O6279R5432r4126n377O6553L5907j27227p9217j51833
8303c26201k6260P8320K02262Q3636L5779j34971o953N3283Q6583O6172n7004
8292E4646o8211r6060J32187R1600j35534m2022L4202k2075r8853j77544J62705
8281a64959J15035J18024j8657k3742k6390j19368q1286M8894p1680L4125R3887
8270i6117n7149j56620j0276O1915L2120l0761J05833J11700m5950m60J26808
$$ plain form
8259 41043 -102894 -214608 -302993 -107771 13319 -16280 9612 -9691 -60683 -68370 -39235
8248 -39235 -156599 -192988 -60619 71623 54870 -43902 -215069 -186100 -212356 -272299 -70433
8237 -70433 -9620 -41199 -45259 -162273 -82292 -203947 -195199 -170483 -33824 -68226 -213255
8226 -213255 -232947 -72280 -105627 -139859 -119618 -230349 -175743 -144956 36990 169647 132612
8215 132612 20177 -32089 -86138 -25067 -21817 40586 152988 25364 42603 149483 1286
8204 1286 -188794 -98111 94158 60592 64754 156187 -18614 -98100 -118248 291307 315333
8193 315333 489041 -634159 -920197 -265101 -352192 -310348 -437759 -261356 -240736 -171048
8183 -171048 -45464 50917 41389 -510 -89484 -54422 -59891 24586 77524 -39168 -150734
$$ packed form
8259D1043j43937j11714q8385J95222J21090k9599K5892j9303n0992p687K9135
8248c9235j17364l6389J32369J32242j6753r8772j71167K8969k6256n9943K01866
8237g0433O0813l1579m060j17014P9981j21655Q748K4716J36659l4402j45029
8226b13255j9692J60667l3347l4232K0241j10731N4606L0787J81946J32657l7035
8215A32612j12435n2266n4049O1071L250O2403J12402j27624J7239J06880j48197
8204A286j90080R0683J92269l3566M162R1433j74801p9486k0148M09555K4026
8193C15333J73708j123200k86038O55096q7091M1844j27411J76403K0620O9688
8183a71048J25584R6381r528m1899q8974L5062n469Q4477N2938j16692j11566
$$ plain form
8172 -150734 89125 -108764 -65805 -115612 -257444 -346244 -234171 -179034 -15151 -43833 -51921
8161 -51921 124329 -43164 -270489 -387232 -253623 -122713 -129988 -22218 58199 33635 -6768
8150 -6768 -14368 -149865 -152473 -89081 -125003 -122457 -99532 -152968 -120631 -218776 -179243 -143334
8138 -143334 -70502 -8961 8815 79096 25114 -594 -80486 -108397 -114510 -38346 3253 -11315
8126 -11315 -166197 -170014 -201170 -176898 -133619 -131487 -248702 -225568 -128089 -120776 -129975 -105050
8114 -105050 -124455 -162264 -212263 -167962 -160990 -54915 -101339 -112622 -111372 -252872 -307872 -153673
8102 -153673 -50215 -986 -43348 -100484 -39435 -130654 -152996 -149503 -125496 -207245 -284242 -173512
8090 -173512 -255439 -249715 -331002 -241792 -65964 -171284 -105852 -162600 -155009 -158167 -110739 -57587
$$ packed form
8172a50734K39859j97889M2959m9807j41832q8800J12073N5137J63883k8682q088
8161e1921J76250j67493k27325j16743J33609J30910p275J07770Q0417k4564m0403
8150f768p600j35497k608O3392l5922K546K2925n3436L2337r8145L9533L5909
8138a43334P2832O1541J7776P0281n3982k5708p9892k7911o113P6164M1599j4568
8126a1315j54882l817l1156K4272M3279K132j17215K3134R7479P313r199K4925
8114a05050j9405l7809m9999M4301O972J06075m6424j1283J250j41500n5000J54199
8102a53673J03458M9229m2362n7136O1049r1219k2342L493K4007q1749p6997J10730
8090a73512q1927N724q1287Q9210J75828j05320O5432n6748P591l158M7428N3152
$$ plain form
8078 -57587 -137008 -179407 -67514 -47810 -30296 66341 -86391 -196652 -167580 -167611 -201591 -51957
8066 -51957 -182110 -233475 6479 26181 -17347 -77764 -66134 -87321 20034 83338 -28468
8055 -28468 -244925 -220741 -270230 -275985 -239452 -183143 -152455 -206179 -172571 -200177 -168049 -126975
8043 -126975 -202524 -128585 -99604 -166816 -257465 -139244 -216085 -325598 -266571 -59615 51065
8032 51065 -37569 -81692 -106968 -212827 -193151 -60850 -125226 -226788 -130913 72857 103796
8021 103796 -1931 -134988 -87508 -176449 -221858 -157640 -213735 -198389 -161723 -136791 -68155
8010 -68155 -53588 -34832 -224228 -224446 -126105 -137637 -282847 -285714 -120504 -127339 -278178 -228628
7998 -228628 -122499 -25420 -127731 -97709 -126988 -55707 -100286 -108996 -98741 44891 54201
$$ packed form
8078e7587p9421m2399J11893J9704J7514R6637j52732j10261K9072l1l3980J49634
8066e1957j30153n1365K39954J9702m3528o0417J1630k1187J07355O3304j11806
8055b8468k16457K4184m9489n755L6533N6309L0688n3724L3608k7606L2128M1074
8043a26975p5549P3939K8981o7212r0649J18221p6841j09513N9027K06956J10680
8032E1065q8634m4123k5276j05859J9676J32301o4376j01562R5875K03770L0939
8021A03796j05727j33057M7480q8941m5409O4218n6095J5346L6666K4932O8636
8010f8155J4567J8756j89396k18R8341j1532j45210k867J65210o835j50839M9550
7998b28628J06129R7079j02311L0022k9279P1281m4579q710J0255J43632R310
$$ plain form
7987 54201 12089 25210 47323 -106253 -160766 -190901 -66730 31614 -50309 -32998 -63861
7976 -63861 -109694 -138232 -172218 -98117 -31148 -18512 44028 18153 26636 49257 125141 6220
7964 6220 -51180 -14503 -49743 -151688 -97728 -173970 -294673 -267073 -171105 -2821 -86225
7953 -86225 -10281 -81237 -181064 -175439 -185002 -264019 -271093 -87955 -220244 -201964 -179535 -75532
7941 -75532 -163252 -140300 -227863 -214810 -167699 104520 47689 40245 -87761 -65713 -44019 -277672
7929 -277672 -99620 -7933 -131369 -138273 -64943 11166 -98227 -163737 -279248 -171822 -125055
7918 -125055 -85027 -15218 -49256 -192849 -150952 -34510 33494 94127 73446 -8673 -114448
7907 -114448 -877 -84605 -160151 -135132 49783 25757 -54128 -191181 -58658 -175886 -236864
$$ packed form
7987E4201m2112J3121K2113j53576n4513l0135J24171R8344q1923J7311l0863
7976f3861m5833k8538l3986P4101O6969J2636O2540k5875Q483K2621P5884j18921
7964F220n7400L6677l5240j01945N3960p6242j20703K7600R5968J68284q3404
7953h6225P5944p0956r9827N625r563p9017p074J83138j32289J8280K2429J04003
7941g5532q7720K2952q7563J3053M7111K72219n6831p444j28006K2048K1694k33653
7929b77672J78052R1687j23436o904P3330P6109j09393o5510j15511J07426M6767
7918a25055M0028O9809l4038j43593M1897J16442O8004O0633k0681q2119j05775
7907a14448J13571q3728p5546K5019J84915k4026p9885j37053J32523j17228o0978
$$ plain form
7896 -236864 -53921 55704 -18613 -146223 -200955 -164601 -22514 -78367 -252899 -154141 -198642
7885 -198642 -104017 -99068 -81926 -123629 -91146 -111247 -131976 -122868 -30893 -1744 -130383 -143475
7873 -143475 -217621 -123994 61108 74669 -23386 -49164 -145145 -166183 -133845 -102208 -252573
7862 -252573 -123365 -70281 -108087 -167672 -100699 -46334 -233536 -62264 -19966 -8320 -72278
7851 -72278 -174327 -173144 -180948 -94400 -151475 -52351 -28584 -76516 -28893 75038 -112853 -114875
7839 -114875 -48304 -27366 -83629 -54076 -173691 -107215 -35378 -118773 4896 -2471 -263698
7828 -263698 -247961 -158234 51764 -87664 -259310 -238348 -98634 -127953 -112940 -39519 -24540
7817 -24540 -89414 -137585 -85155 -123606 -143020 -102154 -376447 -542210 -34844 45320 45316 -107488
$$ packed form
7896b36864J82943J09625p4317j27610n4732L6354J42087n5853j74532R8758m4501
7885a98642R4625M949J7142m1703L2483k0101k0729R108R1975K9149j28639j3092
7873a43475p4146R3627J85102J3561r8055k5778r5981k1038L2338L1637j50365
7862b52573J29208N3084l7806n9585O6973N4365j87202J71272M2298J1646o3958
7851g2278j02049J183p804Q6548n7075R9124K3767m7932M7623J03931j87891k022
7839a14875O6571K0938n6263K9553j19615O6476P1837q3395J23669p367k61227
7828b63698J5737Q9727K09998j39428j71646K0962J39714k9319J5013P3421J4979
7817b4540o4874m8171N2430l8451j9414M0866k74293j65763N07366Q0164mj52804
$$ plain form
7805 -107488 -136605 18075 84881 -112786 1350 -103764 -108355 -112513 20405 146514 48374
7794 48374 -229739 -177755 -179783 -141293 12008 1799 -54633 -116363 -96904 -61053 -250021
7783 -250021 -123051 -134436 -79667 -63127 -52749 -25893 23894 -98037 -89806 -44239 -42207 -82146
7771 -82146 -172606 -63930 -54536 -46037 -149299 -129843 -56412 25190 -20896 71327 106406 -13388
7759 -13388 -35947 -57319 -104099 -141139 -30399 -3515 -16242 45683 74573 66021 -37172 -16647
7747 -16647 -98309 34334 10465 72640 59819 63288 -205547 -140860 22253 -141260 -190988
7736 -190988 -111969 -21678 186294 24427 2233 -124168 -85741 -89395 52448 19656 30722
7725 30722 58144 42271 -3795 -110785 -12850 109019 26831 54822 95113 -10669 -51079
$$ packed form
7805a07488k9117J54680O6806j97667J14136j05114m591m158J32918J26109r8140
7794D8374k78113N1984k028L8490J53301j0209n6432o1730J9459L5851j88968
7783b50021J26970j1385N4769J6540J0378K6856M9787j21931Q231M5567K032l9939
7771h2146r0460J08676R394Q499j03262J9456P3431Q1602m6086R2223L5079j19794
7759a3388k2559k1372m6780l7040J10740K6884j2727O1925K8890q552j03193K0525
7747a6647q1662J32643k3869O2175j2821L469k68835O4687J63113j63513m9728
7736a90988P9019R0291K07972j61867k2194j26401L8427l654J41843l2792J1066
7725C0722K7422j5873m6066j06990R7935J21869q2188K7991M0291j05782m0410
$$ plain form
7714 -51079 -48930 -145392 -196855 -213365 -123134 -18774 -192347 -98148 -152895 -210621 -273492 -92581
7702 -92581 -97857 -63732 -73959 -51514 -90162 -60114 -290860 -177220 -190479 -120149 -70946 -34268
7690 -34268 -76290 -89229 -98384 95304 -47894 -199707 -213053 -87063 31470 -31231 -57058
7679 -57058 -120759 -154099 -111804 -102276 -19835 32897 -23788 10810 16594 -76155 -3867 172398
7667 172398 81555 -13028 -20542 180458 112815 161842 44991 -16661 -35023 -84491 -42554
7656 -42554 512 -90981 -44038 -31713 -14496 -60057 67700 -13849 48672 142312 208654 129649
7644 129649 115862 -68064 -61416 -27984 -4296 8653 82345 185934 87465 -91071 -115905
7633 -115905 -111526 -99598 -87406 -39861 -80471 -259604 -174250 -15725 -31534 -61208 79547
$$ packed form
7714e1079K149r6462n1463j6510R0231J04360j73573R4199n4747n7726o2871J80911
7702i2581n276L4125j0227K2445l8648L0048k30746J13640j3259P0330M9203L6678
7690c4268m2022j2939r155J93688j43198j51813j3346J25990J18533o2701k5827
7679e7058o3701l3340M2295R528Q2441N2732n6685L4598N784r2749P2288J76265
7667A72398r0843r4583p514K01000o7643M9027j16851o1652j8362m9468M1937
7656d2554M3066r1493M6943J2325J7217m5561J27757q1549O2521R3640O6342p9005
7644A29649j3787j83926O648L3432K3688J2949P3692J03589r8469j78536k4834
7633a15905M379J1928J2192M7545m0610j79133Q5354J58525j5809k9674J40755
$$ plain form
7622 79547 87825 -106768 -118047 10563 5964 -12128 51842 -18867 8026 -113022 -26734 60997
7610 60997 -75300 -143130 -53469 76604 15627 -63219 -166758 -157589 -238328 -137038 -72523
7599 -72523 -120422 -218839 -171909 -196479 -170635 -209370 -78049 46943 10955 -116458 75768
7588 75768 -62479 -171890 -235061 -138863 -127009 -199037 -205999 46857 -6641 -101036 -49177
7577 -49177 -20928 -47439 -41477 -29906 122792 284 -31760 -23361 -112946 -140923 -109129 -16693
7565 -16693 36177 10396 -90688 -98616 -307313 -202509 -55657 34174 -10355 -19288 -6788
7554 -6788 84738 -19836 -117900 -55076 -43971 -83789 -28394 59001 76518 -85283 21894
7543 21894 -56816 -102165 -88105 -157994 -89130 -41224 -90527 33853 5322 -206469 -242617
$$ packed form
7622G9547Q278j94593j1279J28610m599j8092O3970p0709K6893j21048Q6288Q7731
7610F0997j36297o7830Q9661J30073o0977p8846j03539R169q0739J01290O4515
7599g2523m7899r8417M6930k4570K5844l8735J31321J24992l5988j27413J92226
7588G5768j38247j09411o3171R6198J1854p2028o962K52856n3498r4395N1859
7577d9177K8249k6511N962J1571J52698j22508l2044Q399q9585k7977L1794R2436
7565a6693N2870k5781j01084p928k08697J04804J46852Q9831m4529q933J2500
7554f788R1526j04574r8064O2824J1105l9818N5395Q7395J7517j61801J07177
7543B1894p8710m5349J4060o9889O8864M7906m9303J24380k8531k11791l6148
$$ plain form
7532 -242617 -182154 -241279 -60963 69208 -81361 -128431 95194 11211 28444 -47418 -105197
7521 -105197 -86225 -108191 -98885 -86705 -139484 -171646 -170505 -158443 -61991 -40178 82650 47610
7509 47610 16134 -92056 25484 -24790 -38076 -66101 53898 -161957 -175177 -189103 -26937
7498 -26937 30981 23348 5595 -79462 -219879 -174142 18995 78566 56977 -77941 -108858
7487 -108858 -96323 -24011 -54878 -39629 41236 2247 140261 179233 122765 131000 13229
7476 13229 -137506 -60075 20591 99243 183923 50012 21266 -28916 8761 -71864 -65979 14248
7464 14248 -105130 -34411 125320 5595 -128507 -202072 -119161 23588 -6849 -151213 55869
7453 55869 -61996 -79847 -91258 -2403 -135391 -153854 -35672 60460 -18915 -146197 -95172
$$ packed form
7532b42617O0463n9125J80316J30171j50569m7070K23625q3983J7233p5862n7779
7521a05197J8972k1966R306J2180n2779l2162J141J2062R6452K1813J22828l5040
7509D7610l1476j08190J17540n0274j3286k8025J19999k15855j3220j3926J62166
7498b6937N7918p633j7753q5057j40417M5737J93137N9571k1589j34918l0917
7487a08858J2535P2312l0867J5249Q0865l8989J38014L8972n6468Q235j17771
7476A3229j50735P7431Q0666P8652Q4680j33911k8746n0182L7677q0625N885Q0227
7464A4248j19378P0719J59731j19725j34102p3565Q2911J42749l0437j44364K07082
7453E5869j17865j7851j1411Q8855j32988j8463J18182R6132p9375j27282N1025
$$ plain form
7442 -95172 -101885 -242724 -148667 -16420 38590 -132595 -29057 11072 43984 -19647 -80061
7431 -80061 -201158 -132368 -175863 17260 155316 -60946 -68152 -90600 -85616 -99364 -85506
7420 -85506 43825 92696 21483 40963 66669 -68818 -225618 -199734 -160769 -36704 -76992
7409 -76992 -27882 67787 62918 -107389 55743 -12968 -42980 -88438 74067 37104 5771
7398 5771 98493 91214 -80963 -128684 -141535 -29372 64159 18036 46402 110972 -104651 43681
7386 43681 -57817 -87559 -231457 -105294 -46024 -79591 -195711 -150120 -116907 -32668 -236056
7375 -236056 -165556 -36841 -111218 -119328 -135752 -31114 -167738 -43176 118406 120776 46950
7364 46950 176643 124753 11384 -200743 -108628 -16923 -15926 5147 175618 46572 -32011
$$ packed form
7442i5172o713j40839R4057J32247N5010j71185J03538M0129L2912o3631o0414
7431h0061j21097O8790m3495J93123J38056k16262p206k2448M984j3748J3858
7420h5506J29331M8871p1213J9480K5706j35487j56800K5884L8965J24065m0288
7409g6992M9110R5669m869j70307J63132o8711l0012m5458J62505l6963l1333
7398E771R2722p279j72177m7721j2851J12163R3531m6123K8366O4570k15623J48332
7386D3681j01498k9742j43898J26163N9270l3567j16120M5591L3213Q4239k03388
7375b36056P0500J28715p4377q110j6424J04638j36624J24562J61582K370p3826
7364D6950J29693n1890j13369k12127R2115R1705R97K1073J70471j29046p8583
$$ plain form
7353 -32011 -96906 72362 -36334 -40967 -82241 91764 -23786 -77546 80554 145177 -20471
7342 -20471 -16409 40046 93380 -43745 -51440 -36310 -28712 -50118 88815 167672 16992 -107305
7330 -107305 -100474 52588 8541 -66019 -82785 11774 29298 -40151 -24293 -17479 40519 220527
7318 220527 220540 215701 85810 -148484 -235500 -154913 -134563 108534 78894 72717 38372 -58954
7306 -58954 -90030 -67036 -96833 -43569 -215653 -147520 -20460 80148 -17015 -125494 -67150
7295 -67150 19478 -90343 125369 109880 75015 -103538 -76670 29474 3810 -137883 73709
7284 73709 255128 53913 45065 99814 58717 -115213 -61764 22758 101780 108392 52069 90949
7272 90949 128757 209878 262095 213250 139483 -49479 72507 43984 59937 -37223 -68874
$$ packed form
7353c2011o4895J69268j08696m633m1274J74005j15550n3760J58100O4623j65648
7342b0471M062N6455N3334j37125p695J5130P598k1406J38933P8857j50680j24297
7330a07305O831J53062m4047p4560j6766R4559J7524o9449J5858O814N7998J80008
7318B20527J3m839j29891k34294q7016Q0587K0350K43097k9640o177l4345r7326
7306e8954l1076K2994k9797N3264j72084O8133J27060J00608r7163j08479N8344
7295f7150Q6628j09821K15712j5489l4865j78553K6868J06144k5664j41693K11592
7284G3709J81419k01215q848N4749m1097j73930N3449Q4522P9022O612n6323L8880
7272I0949L7808Q1121N2217m8845p3767j88962J21986k8523J5953r7160l1651
$$ plain form
7261 -68874 -137408 -173384 -83701 -102304 -211514 -211080 -193218 -157205 -66293 -432 23663 30144
7249 30144 170836 173154 118338 134479 69237 64614 -40641 -32770 -70616 58344 20267 99363
7237 99363 10414 57363 89213 31474 71230 162703 194852 166970 87843 42287 14176 91321
7225 91321 -28572 -21845 -138060 -110409 129073 212803 53622 -89151 -81034 -111270 -189326
7214 -189326 -197142 101567 134022 76187 107926 173065 168323 28357 -72148 126446 -9234
7203 -9234 67613 -19924 -80342 -26496 -34120 -58816 25641 71517 168099 171112 173830 76763 2368
7190 2368 102851 178414 93276 241227 265672 277023 98166 6077 23495 -8733 39869
7179 39869 -13793 -13688 -1938 -25607 9915 150344 201655 94802 -65526 -81323 47511
$$ packed form
7261f8874o8534l5976Q9683j8603j09210M34J7862L6013R0912O5861K4095O481
7249C0144J40692K318n4816J6141o5242m623j05255P871l7846J28960l8077P9096
7237I9363q8949M6949L1850n7739L9756R1473L2149k7882p9127m5556k8111P7145
7225I1321j19893O727j16215K7651K39482Q3730j59181j42773Q117l0236p8056
7214a89326p816K98709L2455n7835L1739O5139m742j39966j00505J98594j35680
7203i234P6847q7537o0418N3846p624k4696Q4457M5876R6582L013K718r7067p4395
7190B368J00483P5563q5138J47951K4445J1351j78857r2089J7418l2228M8602
7179C9869n3662J05J1750k3669L5522J40429N1311j06853j60328j5797J28834
$$ plain form
7168 47511 117370 81056 81243 -45479 7863 187335 334464 320226 288145 307782 290253 239719
7156 239719 354160 395334 564993 632778 773412 1021015 1287623 1696971 2102498 2126237
7146 2126237 1818526 1291820 999844 843159 791082 440899 260108 282705 336497 255021
7136 255021 270840 263354 305777 216587 196069 186682 120088 240745 293178 374146 157592 65123
7124 65123 113291 214387 284017 68318 -52597 86510 167480 183116 105482 147332 -28422
7113 -28422 -66309 -28031 52706 26666 111279 100851 40982 -14945 67424 71928 58270 41123
7101 41123 132643 57738 112776 -34675 46289 18291 -17082 150484 260205 121410 37916
7090 37916 93701 224447 11532 -65645 -13823 83151 110616 -103418 56890 197520 102542
$$ packed form
7168D7511O9859l6314J87j26722N3342J79472J47129j4238l2081J9637j7529n0534
7156B39719J14441M1174J69659O7785J40634K47603K66608M09348M05527K3739
7146B126237l07711n26706k91976j56685n2077l50183j80791K2597N3792q1476
7136B55021J5819p486M2423q9190k0518r387o6594J20657N2433Q0968k16554r2469
7124F5123M8168J01096O9630k15699j20915J39107Q0970J5636p7634M1850j75754
7113b8422l7887L8278Q0737k6040Q4613j0428n9869n5927Q2369M504j3658j7147
7101D1123R1520p4905N5038j47451Q0964k7998l5373J67566J09721j38795q3494
7090C7916N5785J30746k12915p7177N1822R6974K7465k14034J60308J40630r4978
$$ plain form
7079 102542 80825 108828 80154 127931 215090 200865 19265 132460 -20090 -35946 -14782
7068 -14782 -24244 -108219 106399 25486 -132895 -38479 140016 53942 40944 38023 82068 -3643
7056 -3643 59565 157533 43431 -32557 130518 154901 270351 165521 48651 155981 96778
7045 96778 29232 36346 170566 140031 110486 231669 48812 -85229 -98147 68063 161322
7034 161322 173178 233467 89757 -24048 -103537 38903 197978 163154 84091 85147 167679
7023 167679 81580 40451 12678 22906 47568 65614 79226 89678 4348 -16046 40998 -74639
7011 -74639 2973 28584 215012 35856 -48820 10736 159071 -7758 16017 -16602 -17176
7000 -17176 -151210 33901 69919 57055 -80583 -82827 4064 -2126 -28383 -22132 108925 87581
$$ packed form
7079A02542k1717K8003k8674M7777Q7159j4225j81600J13195j52550j5856K1164
7068a4782r462q3975K14618q0913j58381R4416J78495q6074j2998k921M4045q5711
7056c643O3208R7968j14102p5988J63075K4383J15450j04830j16870J07330n9203
7045I6778o7546P114J34220l0535k9545J21183j82857j34041j2918J66210R3259
7034A61322J1856O0289j43710j13805p9489J42440J59075l4824p9063J056Q2532
7023A67679q6099m1129k7773J0228K4662J8046J3612J0452q5330k0394N7044j15637
7011g4639P7612K5611J86428j79156q4676N9556J48335j66829K3775l2619n74
7000a7176j34034J85111L6018j2864j37638k244Q6891o190k6257O251J31057k1344
$$ plain form
6988 87581 39650 159080 5329 -128576 19391 136383 202867 190096 199981 171036 84646
6977 84646 -78508 15568 116672 146003 13077 130260 114535 124439 122749 21366 -73932
6966 -73932 -50448 -43064 161684 107818 146093 38081 21816 43133 -76034 -10296 80060
6955 80060 4593 56205 121934 298862 80681 -73666 9415 12060 43851 178590 85603
6944 85603 107060 66689 66312 67422 32610 45818 20374 193502 169182 140469 58961 51630
6932 51630 103065 -31315 50732 11698 68095 209847 56471 67065 175826 164691 -100901
6921 -100901 -85987 -86876 39795 164948 89562 61382 65839 3569 42333 16119 37696 235991
6909 235991 196946 165448 388296 229005 299595 293293 135916 119923 230061 394046 406652
$$ packed form
6988H7581m7931J19430j53751j33905J47967J16992O6484j2771R885k8945q6390
6977H4646j63154R4076J01104K9331j32926J17183j5725R904j690j01383r5298
6966g3932K3484P384K04748n3866L8275j08012j6265K1317j19167O5738R0356
6955H0060p5467N1612O5729J76928k18181j54347Q3081K645L1791J34739r2987
6944H5603K1457m0371l77J110l4812J3208k5444J73128k4320k8713q1508p331
6932E1630N1435j34380Q2047l9034N6397J41752j53376J0594J08761j1135k65592
6921a00901J4914q89J26671J25153p5386k8180M457o2270L8764k6214K1577J98295
6909B35991l9045l1498K22848j59291P0590o302j57377j5993J10138J63985J2606
$$ plain form
6898 406652 229223 304063 195133 170200 270128 231906 195757 26807 105018 188992 277740
6887 277740 184122 32741 97483 238665 299067 237192 221582 189584 193210 131461 241593
6876 241593 197756 183491 238357 201749 16593 57802 154397 111291 273310 209936 312598
6865 312598 306377 136566 161121 111280 -83445 10335 211996 204964 167217 153263 234847
6854 234847 262480 127065 244318 153456 200769 181853 83270 126832 75326 61192 38275
6843 38275 68143 183505 271818 410680 316605 313935 292370 280145 179861 164933 190431
6832 190431 48804 232272 325302 244676 85436 70541 128977 114057 288454 274832 150998
6821 150998 225442 305957 353625 250275 260503 177112 209091 239050 291577 353769 371921
$$ packed form
6898D06652j77429P4840j08930k4933R9928l8222l6149j68950P8211Q3974Q8748
6887B77740r3618j51381O4742J41182O0402o1875j5610l1998L626o1749J10132
6876B41593m3837j4265N4866l6608j85156M1209R6595m3106J62019o3374J02662
6865C12598o221j69811K4555m9841j94725R3780K01661p032l7747j3954Q1584
6854B34847K7633j35415J17253r0862M7313j8916r8583M3562n1506j4134k2917
6843C8275K9868J15362Q8313J38862r4075k670k1565j2225j00284j4928K5498
6832A90431j41627J83468R3030q0626j59240j4895N8436j4920J74397j3622j23834
6821A50998P4444Q0515M7668j03350J0228q3391L1979K9959N2527O2192J8152
$$ plain form
6810 371921 403479 354225 281975 297014 211829 275991 151779 236329 297831 228049 147558
6799 147558 146911 156921 90156 47823 241359 306305 170683 209349 217907 247171 303911 338990
6787 338990 270697 254647 298033 300611 345766 250066 226745 146047 132763 138691 153195 252205
6775 252205 222787 201131 198928 297403 356745 307453 229345 278744 333647 358337 370390 370243
6763 370243 404109 366510 231514 300178 211626 201373 272122 319012 251763 516258 425496
6752 425496 307194 250866 379033 514340 635425 560854 530004 392697 340437 235601
6742 235601 316982 387507 391076 436938 568855 520912 565031 544879 454295 434214 390240 479608
6730 479608 514246 583750 596226 636441 448870 265728 292742 466088 382772 410249 661380
$$ packed form
6810C71921L1558m9254p2250J5039q5185O4162j24212Q4550O1502o9782q0491
6799A47558o47J0010o6765m2333J93536O4946j35622L8666Q558K9264N6740L5079
6787C38990o8293j6050M3386K578M5155r5700k3321q0698j3284N928J4504R9010
6775B52205k9418k1656k203R8475N9342m9292p8108M9399N4903K4690J2053j47
6763C70243L3866l7599j34996O8664q8552j0253P0749M6890o7249K64495r0762
6752D25496j18302n6328J28167J35307J21085p4571l0850j37307n2260j04836
6742B35601Q1381P0525L569M5862J31917m7943M4119k0152r0584k0081m3974Q9368
6730D79608L4638O9504J2476M0215j87571j83142K7014J73346q3316K7477K51131
$$ plain form
6719 661380 573058 461225 548562 597743 541540 434114 393678 403626 486812 507276 593126
6708 593126 516072 536543 573427 638030 628000 633760 585026 754541 717329 681027 715875 783540
6696 783540 777187 801615 780267 845255 875419 881561 928643 985436 783826 735465 905089 1021031
6684 1021031 1045207 1029731 920424 885410 911651 835536 730944 830017 835670 955981 1048451
6673 1048451 1067750 1171141 1192988 1101587 1108292 1273672 1317310 1363403 1347011 1367042 1447254
6662 1447254 1390030 1303087 1375052 1479485 1482061 1443514 1622743 1626028 1682702 1805107 1779319
6651 1779319 1672174 1723058 1784422 1861496 1835248 1917506 2062101 2128039 2053416 2027004 2133805
6640 2133805 2332641 2246015 2235678 2399923 2785642 2787141 2872780 3091100 3255874 3445481
$$ packed form
6719F61380q8322j11833Q7337M9181n6203j07426m0436R948Q3186K0464Q5850
6708E93126p7054K0471L6884O4603j0030N760m8734J69515l7212l6302L4848O7665
6696G83540o353K4428k1348O4988L0164O142M7082N6793k01610m8361J69624J15942
6684A021031K4176j5476j09307l5014K6241p6115j04592R9073N653J20311R2470
6673A048451J9299J03391K1847r1401O705J65380M3638M6093j6392K0031Q0212
6662A447254n7224q6943P1965J04433K576l8547J79229L285N6674J22405k5788
6651A779319j07145N0884O1364P7074k6248Q2258J44595O5938p4623k6412J06801
6640B133805J98836q6626j0337J64245L85719J499Q5639K18320J64774J89607
$$ plain form
6630 3445481 3652366 3966493 4162019 4359445 4699213 5068396 5343670 5594188 5744440 5976093
6620 5976093 6056035 6088404 6111941 6130978 5969915 5963204 6063587 6061834 6239696 6454665 6629789
6609 6629789 6752501 7134310 7618622 8037441 8506147 9179262 10195747 10890343 11525238
6600 11525238 12136231 12766112 13024048 13212412 13436773 13673950 13655807 13636734 13873669 14149406
6590 14149406 14217420 14377434 14602017 14615100 14729590 14847539 14930065 15146279 15204880 15265706
6580 15265706 15484623 15860522 16276084 16769295 17247309 17640580 18097866 18497055 19075834
6571 19075834 19736932 20505847 21518662 22623633 23663570 24534332 25245159 25202573 24821229
6562 24821229 24281291 23229788 22299301 21512060 21092440 20378804 19945509 19589947 19377764
$$ packed form
6630C445481K06885L14127J95526J97426L39768L69183K75274K50518J50252K31653
6620E976093P9942L2369K3537J9037j61063o711J00383j753J77862K14969J75124
6609F629789J22712L81809M84312M18819M68706O73115J016485O94596O34895
6600A1525238O10993O29881K57936J88364K24361K37177j8143j9073K36935K75737
6590A4149406O8014J60014K24583J3083J14490J17949Q2526K16214N8601O0826
6580A5265706K18917L75899M15562M93211M78014L93271M57286L99189N78779
6571A9075834O61098P68915J012815J104971J039937Q70762P10827m2586l81344
6562B4821229n39938j051503r30487p87241m19620p13636m33295l55562k12183
$$ plain form
6553 19377764 19160392 18829946 18740020 18667670 18685027 18797236 18953528 19191758 19295613 19588967
6543 19588967 19910514 20080973 20195452 20230370 20131859 20060634 19949324 20002673 20004599 19873691
6533 19873691 19809621 19784311 19404227 18779658 18169787 17247450 16145102 14991054 14127394
6524 14127394 13393437 12623691 11990773 11510895 11062096 10771673 10685341 10469442 10422162 10417242
6514 10417242 10660119 10872928 11003165 11166423 11460230 11592795 11292726 10880324 10424382
6505 10424382 9871211 9176663 8654711 8139025 7569477 6985116 6470379 6037446 5771730
6496 5771730 5309149 5117709 4967682 4665181 4382774 4421371 4266100 4065386 3781740 3690578
6486 3690578 3642444 3668183 3407808 3430692 3436325 3326876 3301568 3382952 3424326 3412490 3407720
$$ packed form
6553A9377764k17372l30446q9926p2350J7357J12209J56292K38230J03855K93354
6543A9588967L21547J70459J14479L4918r8511p1225j11310N3349J926j30908
6533A9873691o4070k5310l80084o24569o09871r22337j102348j154048q63660
6524A4127394p33957p69746o32918m79878m48799k90423q6332k15899m7280m920
6514A0417242K42877K12809J30237J63258K93807J32565l00069m12402m55942
6505A0424382n53171o94548n21952n15686n69548n84361n14737m32933k65716
6496E771730m62581j91440j50027l02501k82407L8597j55271k00714k83646r1162
6486C690578m8134K5739k60375K2884N633j09449k5308Q1384M1374j1836m770
$$ plain form
6475 3407720 3418873 3135293 3095112 3172196 3120358 3064734 3121380 3402197 3401720 3402430 3385389 3397420
6463 3397420 3253710 3121739 3229577 3445473 3552080 3566271 3446227 3619980 3480026 3414079
6453 3414079 3522325 3540155 3418902 3779350 3843902 3949240 3866004 3824518 3899159 4125260
6443 4125260 4210041 4481216 4637527 4696936 4863120 5124955 5267021 5313391 5600318 5972298
6433 5972298 6254077 6482042 6948249 7443414 7741940 8085150 8696217 9436567 10048030 10806489
6423 10806489 11943476 13084478 14439588 16158511 18349907 21354241 24934605 28961888
6415 28961888 32722763 35240907 35966201 34625396 31618434 27622002 23994027 20907947
6407 20907947 18321674 16227140 14774282 13521008 12683329 11907584 11340586 10730196 10255735
$$ packed form
6475C407720J1153k83580m0181P7084n1838n5624N6646K80817m77P10j7041J2031
6463C397420j43710j31971J07838K15896J06607J4191j20044J73753j39954o5947
6453C414079J08246J7830j21253L60448O4552J05338q3236m1486P4641K26101
6443D125260Q4781K71175J56311N9409J66184K61835J42066M6370K86927L71980
6433E972298K81779K27965M66207M95165K98526L43210O11067P40350O11463P58459
6423A0806489J136987J141002J355110J718923K191396L004334L580364M027283
6415B8961888L760875K518144P25294j340805l006962l996432l627975l086080
6407B0907947k586273k094534j452858j253274q37679p75745n66998o10390m74461
$$ plain form
6398 10255735 9890398 10031034 10145821 10270526 10307263 10562897 10800379 11046551 11353353 11866323
6388 11866323 12489800 13347900 14420927 15512532 16945530 18564077 20313653 21843701
6380 21843701 22956812 23446965 22988164 21761579 20007395 18392164 17134791 15999517
6372 15999517 15276749 14827669 14718591 14781671 14627526 14744731 15000016 15356726 15998186 16732034
6362 16732034 17705473 18668848 19805127 21299215 23072197 24976117 27185957 29817786
6354 29817786 32926194 36811330 42026773 48345046 56232921 65482940 74812968 82463445
6346 82463445 86435698 85599447 80504768 72765607 64383768 56472257 49514847 43443568
6338 43443568 38716166 34719474 31665533 29377969 27668411 26412860 25409749 24483920
$$ packed form
6398A0255735l65337J40636J14787J24705L6737K55634K37482K46172L06802N12970
6388A1866323O23477Q58100J073027J091605J432998J618547J749576J530048
6380B1843701J113111M90153m58801j226585j754184j615231j257373j135274
6372A5999517p22768m49080j09078O3080j54145J17205K55285L56710O41460P33848
6362A6732034R73439R63375J136279J494088J772982J903920K209840K631829
6354B9817786L108408L885136N215443O318273P887875R250019R330028P650477
6346H2463445L972253q36251n094679p739161q381839p911511o957410o071279
6338D3443568m727402l996692l053941k287564j709558j255551j003111r25829
$$ plain form
6330 24483920 24046545 23973406 23999752 24271377 25007032 26022900 27117322 28356648 29951250
6321 29951250 31844564 34241096 37191304 41130702 46074227 51897387 58131796 64084105
6313 64084105 68462049 70294542 69581222 66374507 61230426 55366455 49593053 44257705
6305 44257705 39801883 36022856 33075974 30526169 28686113 27417073 26623876 26021860
6297 26021860 25713659 25661776 25992512 26478171 27333810 28541239 30125098 32065222 34489502
6288 34489502 37299673 41155810 45847862 51722729 59184000 67795742 76439194 83835248
6280 83835248 87940863 87396801 82671235 75491403 67743551 60570315 54220904 49184572
6272 49184572 45268013 42334497 40452854 39501172 39129998 39465266 40436672 42307547 45206214
$$ packed form
6330B4483920m37375p3139K6346K71625P35655J015868J094422J239326J594602
6321B9951250J893314K396532K950208L939398M943525N823160O234409N952309
6313F4084105M377944J832493p13320l206715n144081n863971n773402n335348
6305D4257705m455822l779027k946882k549805j840056j269040p93197o02016
6297B6021860l08201n1883L30736M85659Q55639J207429J583859J940124K424280
6288C4489502K810171L856137M692052N874867P461271Q611742Q643452P396054
6280H3835248M105615n44062m725566p179832p747852p173236o349411n036332
6272D9184572l916559k933516j881643r51682l71174L35268R71406J870875K898667
$$ plain form
6263 45206214 49051879 53818843 59320324 64767892 69290442 72054849 72372523 70216363
6255 70216363 65866665 60046444 53321290 46745061 40851547 35919392 31396485 27901136
6247 27901136 25133672 22872738 20962282 19315108 17915263 16832974 15791311 15056943
6239 15056943 14394842 13891655 13264779 13001701 12703265 12447794 12177747 11984289 11782076
6230 11782076 11709512 11641038 11784436 11745312 11956872 12192879 12670707 13181390 13727484 14372930
6220 14372930 15064702 16435981 18226679 20566338 23427236 26779479 30087895 32342849
6212 32342849 33106103 31756190 28961497 25972561 23087954 20535036 18484401 16667202
6204 16667202 15272353 14401299 13690222 13534466 13419311 13631216 13801878 14383661 15126515
$$ packed form
6263D5206214L845665M766964N501481N447568M522550K764407L17674k156160
6255G0216363m349698n820221o725154o576229n893514m932155m522907l495349
6247B7901136k767464k260934j910456j647174j399845j082289j041663p34368
6239A5056943o62101n03187o26876k63078k98436k55471k70047j93458k02213
6230A1782076p2564o8474J43398l9124K11560K36007M77828N10683N46094O45446
6220A4372930O91772J371279J790698K339659K860898L352243L308416K254954
6212C2342849P63254j349913k794693k988936k884607k552918k050635j817199
6204A6667202j394849q71054p11077j55756j15155K11905J70662N81783P42854
$$ plain form
6195 15126515 16360369 18084076 19965393 21801503 23334271 24272482 24289910 23106228 21180618
6186 21180618 18670711 16356977 14298174 12597481 11009916 9722833 8683487 8128619
6178 8128619 7297991 6691115 6311289 5963989 5425915 5152682 5055278 4905589 4596888 4270298
6168 4270298 4073973 3906590 3704227 3612895 3539690 3462757 3273987 3247621 3205724 2955136
6158 2955136 2739235 2710954 2760858 2614364 2635458 2669493 2561104 2098559 1942261 2045243
6148 2045243 1999781 1891792 2009369 1983725 2067878 1895997 1971013 1819434 1580257 1563789
6138 1563789 1734022 1690078 1591062 1627450 1632792 1413744 1228137 1284060 1497139 1322121 1256466
6127 1256466 1330726 1469461 1502323 1418601 1336013 1369126 1322625 1209173 1239005 1322990 1220714
$$ packed form
6195A5126515J233854J723707J881317J836110J532768R38211J7428j183682j925610
6186B1180618k509907k313734k058803j700693j587565j287083j039346n54868
6178H128619q30628o06876l79826l47300n38074k73233r7404j49689l08701l26590
6168D270298j96325j67383k02363r1332p3205p6933j88770k6366m1897k50588
6158B955136k15901k8281M9904j46494K1094L4035j08389m62545j56298J02982
6148B045243m5462j07989J17577k5644Q4153j71881P5016j51579k39177j6468
6138A563789J70233m3944r9016L6388N342k19048j85607N5923K13079j75018o5655
6127A256466P4260J38735L2862q3722q2588L3113m6501j13452K9832Q3985j02276
$$ plain form
6116 1220714 990024 1033772 1125806 1208482 1177741 1042700 952980 931431 1001671 941727 916554
6105 916554 810507 769614 758742 802801 992324 1066812 947851 902387 851820 845542 933134
6094 933134 816101 909378 861680 969613 704212 647194 702175 725152 653210 731140 653530
6083 653530 600935 464631 547435 687557 679872 740177 678043 560918 527656 544819 552898
6072 552898 600063 513926 362775 548305 653512 485667 499140 462763 415161 475894 582544
6061 582544 500611 437557 412216 584388 518714 512824 533662 447729 391349 333177 275908 435113
6049 435113 463581 274043 239804 481033 442988 522599 468920 470719 464851 477865 526080 513575
6037 513575 472182 538893 521277 593424 635517 668917 707102 684078 702568 612372 653901 635011
$$ packed form
6116A220714k30690M3748R2034Q2676l0741j35041q9720k1549P0240n9944k5173
6105I16554j06047m0893j0872M4059J89523P4488j18961m5464n0567o278Q7592
6094I33134j17033R3277m7698J07933k65401n7018N4981K2977p1942P7930p7610
6083F53530n2595j36304Q2804J40122p685O0305o2134j17125l3262J7163Q079
6072E52898M7165q6137j51151J85530J05207j67845J3473l6377m7602O0733J06650
6061E82544q1933o3054k5341J72172o5674n890K0838q5933n6380n8172n7269J59205
6049D35113K8468j89538l4239K41229l8045P9611n3679J799n868J3014M8215j2505
6037E13575m1393O6711j7616P2147M2093L3400L8185k3024J8490r0196M1529j8890
$$ plain form
6025 635011 561191 414858 394781 606561 488188 409931 305370 410168 383322 266347
6015 266347 459869 599878 456783 400996 342692 441200 424477 214845 207907 427354 514833
6004 514833 467572 563059 458601 399534 428274 441043 490910 596085 546218 611989 534452
5993 534452 563803 473658 488615 422989 228148 209497 339003 345282 370635 329038 306890
5982 306890 229704 319929 294187 490170 368643 382931 526622 661760 660015 519895 434850
5971 434850 435922 442111 342207 383099 464679 371429 351986 436228 446965 378424 460463 394468
5959 394468 297647 342837 462049 361489 184821 252460 221823 457284 441411 492641 520688
5948 520688 374997 450765 560873 524010 397329 299687 298206 241459 295687 338592 270380
$$ packed form
6025F35011p3820j46333k0077K11780j18373p8257j04561J04798k6846j16975
6015B66347J93522J40009j43095n5787n8304R8508j6723k09632o938K19447Q7479
6004E14833m7261R5487j04458n9067K8740J2769M9867J05175m9867O5771p7537
5993E34452K9351r0145J4957o5626j94841j8651J29506O279K5353m1597k2148
5982C06890p7186R0225k5742J95983j21527J4288J43691J35138j745j40120q5045
5971D34850J072O189r9904M0892Q1580r3250j9443Q4242J0737o8541Q2039o5995
5959C94468r6821M5190J19212j00560j76668O7639l0637K35461j5873N1230K8047
5948E20688j45691P5768J10108l6863j26681r7642j481n6747N4228M2905o8212
$$ plain form
5937 270380 243956 182802 163592 238536 191056 136469 219641 142344 124647 -20965 128639
5926 128639 231198 82434 167346 320724 381738 331126 387886 261289 195394 130255 244242
5915 244242 168516 78968 279649 190816 152741 233242 6235 4652 168258 31373 173517
5904 173517 211455 183607 89780 21791 228631 237776 234343 136539 117513 297765 170950
5893 170950 79341 107926 39790 -54267 141658 239757 98761 149253 139446 100993 94375 133220
5881 133220 57567 170548 223162 114584 226036 279303 276413 281995 179947 123452 75818
5870 75818 150751 246522 -3502 -17125 165134 4666 61018 -9626 32762 79066 28492
5859 28492 44217 115584 -11266 64935 -36338 -17228 6837 -318 -17140 -18965 155142 126257
$$ packed form
5937B70380k6424o1154j9210P4944m7480n4587Q3172p7297j7697j45612J49604
5926A28639J02559j48764Q4912J53378O1014n0612N6760j26597o5895o5139J13987
5915B44242p5726q9548K00681q8833l8075Q0501k27007j583J63606j36885J42144
5904A73517L7938k7848r3827o7989K06840R145l433r7804j9026J80252j26815
5893A70950r1609K8585o8136r4057J95925R8099j40996N0492r807l8453o618L8845
5881A33220p5653J12981N2614j08578J11452N3267k890N582j02048n6495m7634
5870G5818P4933R5771k50024j3623J82259j60468N6352p0644M2388M6304n0574
5859B8492J5725P1367j26850P6201j01273J9110K4065p155j6822j825J74107k8885
$$ plain form
5847 126257 77453 -65030 -40344 206827 115126 162718 164130 272748 92660 -119354 -141946
5836 -141946 110643 301674 192202 74149 204888 285620 130942 140860 -34418 45947
5826 45947 193195 296148 389969 221944 117607 45374 64469 141535 176718 230197 184784
5815 184784 171476 100283 259152 155377 31343 -64590 105977 210097 194156 189685 182621
$$ packed form
5847A26257m8804j42483K4686K47171r1701M7592J412J08618j80088k12014k2592
5836a41946K52589J91031j09472j18053J30739Q0732j54678R918j75278Q0365
5826D5947J47248J02953R3821j68025j04337p2233J9095P7066L5183N3479m5413
5815A84784j3308p1193J58869j03775j24034r5933J70567J04120j5941m471p064
$$ [...]
##END NTUPLES=NMR SPECTRUM
##END=
