##TITLE=1H_DE-80H_X3
 200.13MHz, d2o
 8 sc
 
 19ns.26.2.2025
##JCAMPDX= 6.0         $$ Bruker NMR JCAMP-DX V2.0
##DATA TYPE= NMR SPECTRUM
##DATA CLASS= NTUPLES
##ORIGIN= UXNMR, Bruker Analytische Messtechnik GmbH
##OWNER= pz
$$ XWIN-NMR		Version 3.5
$$ Wed Dec 17 10:39:17 2025 Russian Standard Time (UT+4h)  Yarkov@DPX200
##.OBSERVE FREQUENCY= 200.1313
##.OBSERVE NUCLEUS= ^1H
##.ACQUISITION MODE= SIMULTANEOUS
##.ACQUISITION SCHEME= undefined
##.AVERAGES= 8
##.DIGITISER RES= 18
##SPECTROMETER/DATA SYSTEM= spect
##.PULSE SEQUENCE= zg30
##.SOLVENT NAME= CDCl3
##.SHIFT REFERENCE= (INTERNAL, CDCl3, 0, 15.4681)
##AUDIT TRAIL= $$ (NUMBER, WHEN, WHO, WHERE, WHAT)
$$ ##TITLE= Audit trail, XWIN-NMR		Version 3.5
$$ ##JCAMPDX= 5.01
$$ ##ORIGIN= Bruker BioSpin GmbH
$$ ##OWNER= Yarkov
$$ C:/Bruker/XWIN-NMR/data/yarkov2/nmr/H-C/1/pdata/1/auditp.txt
$$ ##AUDIT TRAIL=  $$ (NUMBER, WHEN, WHO, WHERE, WHAT)
(   1,<2025-12-17 10:38:38.95 +0400>,<Yarkov>,<DPX200>,
      <created by zg, POWCHK disabled, PULCHK disabled
       configuration hash MD5:
       00 E9 B6 7A A2 85 ED C7 34 08 36 98 17 FE 4E 26
       data hash MD5: 16K
       49 D8 D5 24 2A 40 14 31 88 1B D1 F3 5E FF 5A 72>)
(   2,<2025-12-17 10:38:44.70 +0400>,<Yarkov>,<DPX200>,
      <Start of raw data processing
       efp BC_mod = 2 LB = 0.25 FT_mod = 6 PKNL = 1 PHC0 = -5301.728 PHC1 = 12.22193 SI = 16K 
       data hash MD5: 16K
       71 11 CE 00 2D 07 2D 1F B2 62 19 54 6E D4 45 E4>)
$$ ##END=
$$ 
$$ hash MD5
$$ 02 DF BC 96 E7 2A 4D 73 79 A6 34 F0 35 30 BB DB
##$RELAX= 
##$RELAX= 
##$RELAX= 
##$RELAX= 
##$RELAX= 
##$RELAX= 
$$ Bruker specific parameters
$$ --------------------------
##$DU= <C:/Bruker/XWIN-NMR>
##$EXPNO= 1
##$NAME= <H-C>
##$PROCNO= 1
##$TYPE= <nmr>
##$USER= <yarkov2>
##$AMP= (0..31)
100 100 100 100 100 100 100 100 100 100 100 100 100 100 100 100 100 100 
100 100 100 100 100 100 100 100 100 100 100 100 100 100 
##$AQSEQ= 0
##$AQ_mod= 1
##$AUNM= <au_zg>
##$AUTOPOS= <>
##$BF1= 200.13
##$BF2= 200.13
##$BF3= 200.13
##$BF4= 200.13
##$BF5= 200.13
##$BF6= 200.13
##$BF7= 200.13
##$BF8= 200.13
##$BYTORDA= 1
##$CFDGTYP= 0
##$CFRGTYP= 5
##$CHEMSTR= <none>
##$CNST= (0..31)
1 1 145 1 1 1 1 1 1 1 1 1 1 1 1 1 1 1 1 1 1 1 1 1 1 1 1 1 1 1 1 1 
##$CPDPRG= <>
##$CPDPRG1= <>
##$CPDPRG2= <>
##$CPDPRG3= <>
##$CPDPRG4= <mlev>
##$CPDPRG5= <mlev>
##$CPDPRG6= <mlev>
##$CPDPRG7= <mlev>
##$CPDPRG8= <mlev>
##$CPDPRGB= <>
##$CPDPRGT= <>
##$D= (0..31)
0 0.7 0 0 0 0 0 0 0 0 0 0.03 0 0 0 0 0 0 0 0 0 0 0 0 0 0 0 0 0 0 0 0 
##$DATE= 1765953518
##$DBL= (0..7)
120 120 120 120 120 120 120 120 
##$DBP= (0..7)
150 150 150 150 150 150 150 150 
##$DBP07= 0
##$DBPNAM0= <>
##$DBPNAM1= <>
##$DBPNAM2= <>
##$DBPNAM3= <>
##$DBPNAM4= <>
##$DBPNAM5= <>
##$DBPNAM6= <>
##$DBPNAM7= <>
##$DBPOAL= (0..7)
0.5 0.5 0.5 0.5 0.5 0.5 0.5 0.5 
##$DBPOFFS= (0..7)
0 0 0 0 0 0 0 0 
##$DE= 6
##$DECBNUC= <off>
##$DECIM= 32
##$DECNUC= <off>
##$DECSTAT= 4
##$DIGMOD= 1
##$DIGTYP= 9
##$DL= (0..7)
0 120 120 120 120 120 120 120 
##$DP= (0..7)
$$ [...]
##$SUBNAM2= <"">
##$SUBNAM3= <"">
##$SUBNAM4= <"">
##$SUBNAM5= <"">
##$SUBNAM6= <"">
##$SUBNAM7= <"">
##$SUBNAM8= <"">
##$SUBNAM9= <"">
##$SW= 18.0517328524113
##$SWIBOX= (0..15)
0 0 2 0 0 0 0 0 0 0 0 0 0 0 0 0 
##$SW_h= 3612.71676300578
##$TD= 16384
##$TD0= 1
##$TE= 0
##$TE2= 300
##$TE3= 300
##$TEG= 300
##$TL= (0..7)
0 120 120 120 120 120 120 120 
##$TP= (0..7)
150 150 150 150 150 150 150 150 
##$TP07= 0
##$TPNAME0= <>
##$TPNAME1= <>
##$TPNAME2= <>
##$TPNAME3= <>
##$TPNAME4= <>
##$TPNAME5= <>
##$TPNAME6= <>
##$TPNAME7= <>
##$TPOAL= (0..7)
0.5 0.5 0.5 0.5 0.5 0.5 0.5 0.5 
##$TPOFFS= (0..7)
0 0 0 0 0 0 0 0 
##$TUNHIN= 0
##$TUNHOUT= 0
##$TUNXOUT= 0
##$USERA1= <user>
##$USERA2= <user>
##$USERA3= <user>
##$USERA4= <user>
##$USERA5= <user>
##$V9= 5
##$VALIST= <valist>
##$VCLIST= <CCCCCCCCCCCCCCC>
##$VD= 0
##$VDLIST= <DDDDDDDDDDDDDDD>
##$VPLIST= <PPPPPPPPPPPPPPP>
##$VTLIST= <TTTTTTTTTTTTTTT>
##$WBST= 1024
##$WBSW= 4
##$XGAIN= (0..3)
0 0 0 0 
##$XL= 0
##$YL= 0
##$YMAX_a= 242767
##$YMIN_a= -234148
##$ZGOPTNS= <>
##$ZL1= 120
##$ZL2= 120
##$ZL3= 120
##$ZL4= 120
##$ABSF1= 0
##$ABSF2= 0
##$ABSG= 0
##$ABSL= 0
##$ALPHA= 0
##$AQORDER= 0
##$ASSFAC= 0
##$ASSFACI= 0
##$ASSFACX= 0
##$ASSWID= 0
##$AUNMP= <proc_1d>
##$AZFE= 0.1
##$AZFW= 0.1
##$BCFW= 0
##$BC_mod= 2
##$BYTORDP= 0
##$COROFFS= 0
##$CY= -3
##$DATMOD= 1
##$DC= 0
##$DFILT= <>
##$DTYPP= 0
##$F1P= 0
##$F2P= 0
##$FCOR= 1
##$FTSIZE= 16384
##$FT_mod= 6
##$GAMMA= 0
##$GB= 0
##$INTBC= 1
##$INTSCL= 3.241238e-09
##$ISEN= 128
##$LB= 0.25
##$LEV0= 0
##$LPBIN= 0
##$MAXI= 10000
##$MC2= 0
##$MEAN= 0
##$ME_mod= 0
##$MI= 1.114404
##$NCOEF= 0
##$NC_proc= -7
##$NLEV= 6
##$NOISF1= 3.799351
##$NOISF2= 2.8
##$NSP= 0
##$NTH_PI= 0
##$NZP= 0
##$OFFSET= 15.46813
##$PC= 1
##$PHC0= -5301.728
##$PHC1= 12.22193
##$PH_mod= 1
##$PKNL= yes
##$PPARMOD= 0
##$PSCAL= 0
##$PSIGN= 0
##$REVERSE= no
##$SF= 200.130010719697
##$SI= 16384
##$SIGF1= 3
##$SIGF2= 2
##$SINO= 0.751879
##$SIOLD= 32768
##$SREGLST= <19F.Aceton>
##$SSB= 0
##$STSI= 16384
##$STSR= 0
##$SW_p= 3612.71676300578
##$SYMM= 0
##$S_DEV= 0
##$TDeff= 16384
##$TDoff= 0
##$TI= <>
##$TILT= no
##$TM1= 0
##$TM2= 0
##$TOPLEV= 0
##$USERP1= <user>
##$USERP2= <user>
##$USERP3= <user>
##$USERP4= <user>
##$USERP5= <user>
##$WDW= 1
##$XDIM= 16384
##$YMAX_p= 309060421
##$YMIN_p= -1080697
$$ End of Bruker specific parameters
$$ ---------------------------------
##NTUPLES= NMR SPECTRUM
##VAR_NAME=  FREQUENCY,     SPECTRUM/REAL,   SPECTRUM/IMAG
##SYMBOL=    X,             R,               I
##VAR_TYPE=  INDEPENDENT,   DEPENDENT,       DEPENDENT
##VAR_FORM=  AFFN,          ASDF,            ASDF
##VAR_DIM=   16384,         16384,           16384
##UNITS=     HZ,            ARBITRARY UNITS, ARBITRARY UNITS
##FACTOR=    0.220516191357247, 1,           1
##FIRST=     3095.63704506706, 0,            0
##LAST=      -517.079717938725, 0,           0
##MIN=       -517.079717938725, -1080697,    0
##MAX=       3095.63704506706, 309060421,    0
$$ Real data points
##PAGE= N=1
##DATA TABLE= (X++(R..R)), XYDATA
$$ [...]
8780 41835805 46000033 48252203 47592119 44650877 39806474 34151685 28997197 24692227
8772 24692227 21113081 18187217 15875736 14828406 13715051 12761517 11926054 11686823 11276843
8763 11276843 10907755 10906834 11305029 11097458 11165661 11835860 12619276 13038849 13925621 15324312
8753 15324312 16988661 19298552 23025493 27917996 33344998 38504076 42662022 44396592
8745 44396592 43466618 40359849 36796826 34001220 32139458 31921915 33924525 37658735
8737 37658735 41771815 44770065 46347362 44866516 40464577 34983059 29633232 24261267
8729 24261267 19711615 16750046 14581649 12276188 10580931 9662619 8952833 7970357 7325511
8720 7325511 6854447 6503124 6008940 5581294 5466447 5460250 5061459 4531583 4733316 4564250
8710 4564250 3929347 3829206 4101209 3764468 3538563 3729071 3656444 3337518 3175730 3216484
8700 3216484 3098418 3098458 3136610 3046578 2914255 2687105 2498120 2880089 2890353 2639926 2542963
8689 2542963 2593225 2168549 1880954 2382991 2536875 2075666 2159733 2332320 2194766 2264041
8679 2264041 2351858 2324332 2010278 1870438 1856513 2259344 2342053 2295880 2054002 2104963 2054559
8668 2054559 1858969 2178626 2412895 1992435 2125549 2364749 2231322 1979068 2328666 2356847
8658 2356847 2150056 1912064 2174515 2319757 2300680 2182982 2246710 2340753 2363206 2008812
8648 2008812 2339572 2553588 2470214 2480058 2516614 2470666 2469824 2363693 2474178 2512216 2525888
8637 2525888 2506634 2677547 2688264 2757313 2641454 2603865 2513876 2753721 3117355 3146566 3147457
8626 3147457 3460463 3260702 3345783 3747964 3984003 4043739 4377095 4481125 4478834 4508052
8616 4508052 5130303 5678706 6254773 6717811 6791059 7405935 8472573 9527136 10896285
8607 10896285 13103189 15565026 18630987 22377187 26009658 27665246 27375373 25755973
8599 25755973 23375166 21056209 19734043 19056264 19101854 20306624 22317259 24598486 26483651
8590 26483651 26458331 24821019 22114825 19222728 16481586 14528046 13008296 11716677
8582 11716677 10897425 10401213 9722161 9327657 9232429 9299147 9070691 9137548 9585064 10187317
8572 10187317 10749277 11698360 12755174 14076409 15639969 17865623 21077494 25138504
8564 25138504 29620881 34830859 39911459 43648515 44913683 43886248 40936045 37212205
8556 37212205 34136103 32665693 32533079 33717051 35678198 38077566 40066641 40756892
8548 40756892 39707704 36725863 31888160 26855321 22529656 19246819 16812028 14910955
8540 14910955 13338238 11820142 10479646 9872316 9596070 9129766 8839406 8524793 8274465
8531 8274465 8210148 8241024 8635671 9129084 9548285 10265142 11583578 13218377 15021486
8522 15021486 17385882 20264872 22233878 22765994 21898412 20268216 18209777 16276452
8514 16276452 15122760 15031951 15584969 16764702 18607329 19910903 20064718 19129520 17278173
8505 17278173 14888051 12500013 10585930 9049433 7898388 6970320 6250461 5619549 5067414
8496 5067414 4449709 4204719 4075320 3814280 3495136 3305917 3112581 2789568 2808496 2917874
8486 2917874 2760450 2463250 2572330 2426139 2227259 2085557 2230890 2200484 2077590 1860387
8476 1860387 1917378 2002311 1805230 1686404 2036585 1867111 1416256 1442991 1868928 1655241
8466 1655241 1522946 1799862 1903869 1254787 1127466 1244926 1342107 1426327 1531805 1293537
8456 1293537 1270220 1180417 965895 1276806 1545837 1212097 1007523 1099118 1284115 1099145
8446 1099145 1334267 1413043 986683 674177 1074246 1038721 1120721 1253586 1086429 853704
8436 853704 963249 1019011 1005079 1098742 993887 545747 553737 537445 519679 689895 901114
8425 901114 776734 832155 964185 835169 612438 754546 978933 1011268 902573 779093
8415 779093 880764 789805 740802 803550 1125006 931656 788529 801411 1015068 738685
8405 738685 674340 788677 694806 508449 523510 562251 639988 493588 543022 590632 719082
8394 719082 639439 528265 559236 777992 438198 431431 610380 791380 814277 688283 655424
8383 655424 923610 1008924 976966 796764 770666 563847 571329 752335 849035 670771 477891
8372 477891 474689 526701 638488 636829 525508 528334 430644 401803 635389 782156 445509
8361 445509 417870 301613 52942 101992 458657 663402 293724 141768 171375 273244
8351 273244 462956 527736 308855 283744 145992 48968 138875 418883 285232 73513
8341 73513 185108 229659 -88091 120818 463599 179358 215285 326859 260425 87506
8331 87506 299940 389323 224550 15051 74132 182731 43190 124434 259998 134197
8321 134197 242230 169395 33073 238427 333668 245651 264927 269640 143156 50970 317557
8310 317557 475095 66321 221745 517973 196713 292084 557677 410445 27689 44430
8300 44430 398793 390409 219473 377245 178197 54811 364546 465205 440573 499789 180744
8289 180744 -139108 243958 389665 472839 373829 346317 -89979 -135512 436590 551176
8279 551176 184512 239323 144698 -61290 43065 422787 388960 363573 128797 45811 111896
8268 111896 407703 387156 127896 144999 247854 177354 465790 638219 326828 185004
8258 185004 384127 358690 538180 550418 562024 364041 222420 430110 323154 298321
8248 298321 643324 567113 301915 442821 379467 284784 298313 594037 475772 94023
8238 94023 159844 36748 -33908 431616 601588 455149 528219 443511 -7290 151986 582377
8227 582377 767500 461951 439565 236359 -42544 283861 689949 317035 475633 311265
8217 311265 -108602 -28103 486709 257840 346677 518087 345591 -96760 256773 394756
8207 394756 168436 277594 612947 331628 475638 411984 -31044 83805 630436 544709
8197 544709 732191 960848 618432 -124029 1785053 7278858 3572989 1365756 1344339
8188 1344339 281770 24760 315019 805946 909784 919764 196705 -108748 212602 634519
8178 634519 507755 549713 474526 -26983 -164087 621354 442331 55916 -30878 135708
8168 135708 160054 521283 743806 608931 51733 131015 -45204 139564 448216 497656
8158 497656 161698 -93981 41618 346512 575901 583023 46537 -116414 103666 277707
8148 277707 284649 451568 499776 72699 -173141 335494 303033 -90798 -104191 219164 42946
8137 42946 50515 260649 253255 32821 -53830 66216 247030 436897 187566 -202751 -204240
8126 -204240 -186314 -105350 178326 533955 41949 -497013 -238902 69112 124878 271395
8116 271395 289915 -103701 -236462 60545 138304 56422 138195 -33089 -118116 20595 219262
8105 219262 106091 -202272 -143341 -105605 -152880 270129 206685 -103605 -65828 -119420 -221936
8094 -221936 61939 34859 123126 -62211 -82706 -129510 -111629 289223 534370 -36476 -36783
8083 -36783 121595 -126942 -40569 223782 -14434 -141828 -185118 -48678 178808 294599
8073 294599 114460 -77820 44761 312574 -10179 111659 100156 -177498 -115586 137825
8063 137825 263776 187034 293731 236983 -79434 30129 336035 22094 -62360 163859
8053 163859 106259 24164 216252 200109 27446 74516 28789 53074 388909 227425 -48134
8042 -48134 -82344 163388 -151600 10434 395830 124806 -317940 -55807 117725 -135308
8032 -135308 39306 305420 140497 -87621 -84294 52638 35918 264221 208053 90030
8022 90030 321870 193533 157330 351717 179412 -89885 -186027 -9205 55888 149589 336993
8011 336993 191307 -60479 -313993 -201696 -16368 109389 257399 286408 -73185 -295500
8001 -295500 5166 199002 144459 268055 285251 95252 -190757 234666 520946 285989
7991 285989 27253 -39787 -190337 -11197 270830 264215 128802 4251 -285225 -5716
7981 -5716 642703 412638 -5176 151264 2584 -389349 24083 518312 201577 -135523
7971 -135523 -60326 -84947 -55687 194907 383933 65738 17885 -156476 -55849 305364
7961 305364 306995 135907 262584 -5393 -122105 -42022 353846 241127 -69963 215326
7951 215326 282775 -126602 53040 191426 145660 162361 212172 419696 389578 68237 202065
7940 202065 341654 281179 173334 115366 92113 -36662 32215 405990 154508 34136
7930 34136 167269 188382 62971 60958 277816 411630 128142 -132253 19860 86718 120950
7919 120950 -43721 30490 117459 -201872 -147079 448350 286591 -142794 -89161 66066
7909 66066 110142 51100 259125 386403 -87016 -36800 52529 297581 270424 314249 245060
7898 245060 254177 -84753 -156434 175754 362981 165535 377414 390559 -3991 -331503
7888 -331503 119092 335879 113313 81492 315962 74704 -191850 -124375 125273 311522
7878 311522 264888 9394 -41018 -134766 -143788 121768 361150 306956 -43909 -200140 40047
7867 40047 -188787 -162697 343911 149913 -58537 65092 140138 -38531 94054 386222
7857 386222 328886 147078 -19540 31291 -87542 -65413 -4775 -8452 234456 -21523 -52231
7846 -52231 224190 209553 -158631 174653 310569 202335 -5416 220310 363342 -9103
7836 -9103 58273 360225 68685 -45543 -59829 121355 118818 165009 130102 238117 130117
7825 130117 155554 132815 239638 186636 15648 49015 308655 259671 197636 94577 15664
7814 15664 4025 -43721 181708 381088 276229 294672 30750 -256434 -23400 133285
7804 133285 37326 -214287 92043 139436 -145354 -6442 334869 359185 360147 258540 20234
7793 20234 45949 120653 132104 410317 367729 -12252 -190847 -54122 158371 83594 230917
7782 230917 408264 32589 53717 223476 20345 -521 222540 19630 -32187 301276
7772 301276 230534 -35731 110123 216985 -17250 35190 269586 -18067 -66707 82650
7762 82650 -92295 -63988 307144 130027 202966 360874 196078 -277574 -136916 239315
7752 239315 152688 215508 404738 148662 -220133 -4357 109061 114938 423056 199892
7742 199892 -23151 -50215 -102875 66156 505788 508556 47752 -129718 144425 171470 59958
7731 59958 202061 210798 3548 -76978 34536 215655 284393 89486 -83363 -85700 -64202
7720 -64202 -1327 202978 266855 112234 -173545 -133441 -228475 -96900 194025 264298 208590
7709 208590 234853 9480 -150732 -28593 179099 4062 93274 199502 94147 33120
7699 33120 39455 -30921 -20859 114896 82122 -161669 121064 215309 -35569 61922 52337
7688 52337 -244009 -271538 67347 350348 215774 128338 -75061 -260275 -20271 60030
7678 60030 149830 316861 220139 -195093 -274238 -265653 -73130 142838 318167 457987 130678
7667 130678 -83270 -57517 -104566 90818 224246 154346 165347 75647 -226705 -15187 165582
7656 165582 134966 116142 107450 -147174 -106716 16934 262836 48634 4847 -122645 -308368
7645 -308368 170333 254040 4358 -10417 -54754 -119495 17317 164125 127468 -45891 -38225
7634 -38225 207769 78785 138366 298236 64482 -28872 -60715 30555 95168 214945 67505
7623 67505 -61033 27185 192823 215019 347152 302918 -34805 -7476 137349 174472 138542
7612 138542 208808 182483 24265 -93810 136031 165517 -126483 -111415 -90493 -75090 -72048
7601 -72048 -9863 117539 36045 -50212 53857 -59868 -139470 -339805 -219100 126063 175133
7590 175133 -25425 -82323 -32902 -59898 -136140 113941 128081 -171362 -216028 39755 144754
7579 144754 26898 -10005 -169457 -300538 -201183 80098 169118 140938 -14332 -321196
7569 -321196 -288096 6040 183255 297738 225768 -247570 -462783 -176190 64707 159072
7559 159072 308444 278914 69161 -222728 32912 217898 199425 177287 135533 142931 -67816
7548 -67816 80502 322538 80925 -43735 120545 210745 136400 -97422 -53933 -17094 -5987
7537 -5987 -68891 97568 -127199 -232110 -124641 18124 172437 56148 -43606 -31566 -88295
7526 -88295 -50403 71246 223515 88899 -296583 -309828 -79211 -217986 -77611 293660
7516 293660 131879 91517 92452 7164 -364163 -299324 80179 208220 91024 291371 272506
7505 272506 -51816 -312896 -155730 134256 334936 266940 202966 163835 81727 36161 186704
7494 186704 383080 152078 -160299 53778 95022 -48437 4922 175937 87785 -153535
7484 -153535 52950 366800 146737 -119893 -83435 -135466 -120874 89113 278262 334688
7474 334688 67862 -46690 36149 140350 135588 67107 127615 71839 -67328 -188110 56700
7463 56700 96508 -183817 157923 323016 -105318 -158643 3094 81154 -66264 62070
7453 62070 225274 -62563 -324591 28014 261526 227606 222805 205320 129455 197648 -37614
7442 -37614 172246 268065 204702 133182 160779 215111 210094 69522 339986 81886 -222289
7431 -222289 187622 416658 202284 152473 165488 140926 -134177 -34635 328694 113938
7421 113938 -77216 -28735 -30836 237704 225112 122942 108922 -122903 -423228 -22804 294318
7410 294318 216979 -148028 -198856 135557 -100424 174509 727200 267365 -300999 -283703
7400 -283703 -49472 237903 400319 389335 131119 -159518 -47249 239910 378355 302368
7390 302368 -140233 -255674 110287 60947 55423 405248 170630 -115545 -135077 271755
7380 271755 334411 134381 431825 176978 -178849 187261 216563 97718 182619 190265 11466
7369 11466 142461 406289 323456 -25263 122365 110507 -46561 299309 242235 -158728
7359 -158728 -77536 34917 332329 506335 504871 122209 -264899 23108 518311 310421
7349 310421 504701 559340 142647 -177361 47551 330450 483643 466086 229937 -233043
7339 -233043 6303 262766 295982 246295 291587 -48842 -37977 339383 183739 -62077
7329 -62077 264258 230237 259574 471155 285685 89954 -51950 -3066 224511 419774
7319 419774 624801 277247 -142717 -49122 192319 284228 605354 569536 152104 -59341
7309 -59341 110884 389106 564207 539290 381794 82305 111837 121453 104985 200594 262459
7298 262459 165758 188490 296957 233377 53956 39043 322006 291083 225173 355707 343617
7287 343617 4702 96922 271491 374748 479527 233064 -36541 40991 249960 615231
7277 615231 425251 313330 113741 -67574 241873 561183 462155 598944 231767 9859
7267 9859 65059 397995 492839 355701 13588 21872 14137 394452 513727 306501 156182
7256 156182 223802 -86503 269681 469922 453846 475431 538433 301595 151856 446294
7246 446294 867467 350856 209273 400324 66682 -99155 359761 316361 371258 495628
7236 495628 297605 -64288 -3957 233955 287031 548509 572579 145429 142998 475364 536738
7225 536738 568459 809967 537450 207732 299795 555936 471074 545205 701993 394204
7215 394204 179417 232748 371376 521591 789308 654249 234412 132531 330337 293947
7205 293947 517445 806150 702040 380493 206553 -32858 227274 600043 999603 743069
7195 743069 532583 449021 148074 145442 692694 919795 869016 678750 528899 376721
7185 376721 533503 622143 749450 648405 727663 686715 741808 707566 943510 916748 841157
7174 841157 912271 1177392 822661 954235 1034182 810377 936836 1279842 1177426 1163413
7164 1163413 1326482 1302182 1392081 1729041 1955935 1853660 1755314 2058684 2127992 2427293
7154 2427293 3021635 3377759 3545055 4285035 5468602 6935876 9095012 12462991 17169436
7145 17169436 22888656 27027761 26915801 22979534 18452938 14236785 10394488 7976381
7137 7976381 6391935 4954286 3911060 3385857 3052475 2543712 2258871 2077591 1848325
7128 1848325 1742326 1658622 1534449 1353437 1573388 1217535 934052 1249387 1251599 1113302
7118 1113302 1153229 1096976 939659 781584 863561 884176 864845 887969 685485 721727 818530
7107 818530 675835 652707 742294 687145 784429 647453 743601 745891 532238 523745 540057
7096 540057 574350 734043 706627 517457 604872 534273 555877 535693 641545 598925 388522
7085 388522 335826 543658 295674 386246 473534 527461 410520 485670 553178 606541 510376
7074 510376 498673 420866 410933 464523 522830 515709 673214 518715 478485 404704 267971
7063 267971 170790 371461 692873 687137 503203 338419 307409 421539 565291 691063
7053 691063 546553 494758 253000 309693 499304 587572 399681 314707 254173 246512 180778
7042 180778 541884 426947 71180 46247 186895 297545 526970 493955 455482 294456
7032 294456 253556 200657 364837 707536 585610 128829 194161 182581 139264 321603 545484
7021 545484 314719 244365 305056 220551 402548 557856 281107 256455 351720 458496 286536
7010 286536 416055 357132 56860 217473 427666 446380 360907 591853 420547 251800
7000 251800 381370 577309 598530 565711 415822 220436 269297 559869 487412 614834
6990 614834 309427 -80197 13424 484267 405019 324697 456403 328377 4497 271237
6980 271237 553025 614139 573648 517709 139539 161445 186435 431664 510633 621706 259953
6969 259953 307135 456192 536189 84853 384696 559226 290808 -24264 354158 308041
6959 308041 148176 193898 376395 235448 175028 119463 185679 381943 498854 156578
6949 156578 333862 419421 306598 200397 539411 399281 133295 177149 457283 401005
6939 401005 511647 712872 461605 193260 148699 224094 448473 574085 599233 201169
6929 201169 94367 100829 202008 470276 709405 675039 302080 375464 98293 78543 526895
6918 526895 657095 458997 572396 526909 302017 -213098 345504 550228 326341 266457
6908 266457 547397 205872 296284 316314 399478 424595 327826 215137 263752 243585 386719
6897 386719 309400 496256 447060 69594 85698 586923 226268 29618 211086 304940
6887 304940 5031 132961 461043 463200 274802 338670 153181 220173 366399 322289 172135
6876 172135 448686 290222 72525 232463 289410 85321 257483 590037 480223 130243
6866 130243 226676 305729 107584 187228 467393 346822 344270 262503 277026 266153 194830
6855 194830 355780 300575 122135 195448 337502 383663 413064 115213 196289 327440 349619
6844 349619 417640 480437 323856 157668 120542 233514 461796 297639 321440 347479 297557
6833 297557 216716 116114 266354 339215 307590 278509 290192 282384 277611 342251 264247 162279
6821 162279 37293 152367 545450 469160 253912 85882 256907 264776 142267 346535
6811 346535 499594 262492 101536 104256 234550 327283 246587 364034 480751 217541
6801 217541 143058 235683 235212 212542 85311 137234 277935 36002 15860 275473 638829
6790 638829 496761 152867 -130157 42342 231114 452452 508350 491848 230105 87170
6780 87170 265183 521277 454354 564434 413103 50833 30262 359456 445679 404904 260032
6769 260032 140537 -140963 227907 497987 443613 348523 400149 138175 157304 411511
6759 411511 453812 211227 245390 295371 304835 462731 580485 201037 115787 542589 472587
6748 472587 170125 301529 386009 -85379 44836 652144 604639 332014 292802 159911
6738 159911 72648 536987 793731 671738 467398 226810 -27445 155000 544541 520934
6728 520934 336714 392430 157586 -121167 446211 995525 395201 7073 151102 127995
6718 127995 138698 599840 788675 434032 213355 274378 139758 199826 545397 402203
6708 402203 341136 380957 98480 -129250 314802 488246 532751 526206 573381 115007 -135763
6697 -135763 280836 606423 377659 412954 335868 132902 4377 403810 511086 549074
6687 549074 246908 84516 110602 415366 562117 460019 332922 274014 248902 340929
6677 340929 415867 585635 455654 411975 366817 344353 380660 509861 405259 219417 136034
6666 136034 270844 387677 530218 285023 227107 284121 294575 315228 430495 492098 530140
6655 530140 274524 236086 465297 641665 587178 403679 324284 248580 228598 354918 357902
6644 357902 417541 370743 322488 203791 380533 469871 485136 440647 362054 477037 543776
6633 543776 615335 544680 549971 515208 458445 340866 474542 711044 534018 430752 456577
6622 456577 341767 481696 631464 744439 765822 564267 381643 457880 667150 912996
6612 912996 834004 713068 459302 161152 214930 642583 805325 837040 604342 442921
6602 442921 391381 377725 452121 775556 905504 668985 323998 546343 756762 719011
6592 719011 489631 756481 807410 685642 446418 443296 477046 465911 349179 398041 510352
6581 510352 546332 529141 870282 737228 642506 377962 456100 707714 611678 576456 874287
6570 874287 814955 677635 599709 818183 1083573 1005110 777409 1022419 772221 604782
6560 604782 660247 957024 961896 824072 640380 692153 624933 557098 712177 772536 962542
6549 962542 687045 545536 729718 862673 1039269 1224524 966771 738614 708547 816838
6539 816838 988914 993417 719150 779137 564883 635902 684511 897925 925091 955012 913784
6528 913784 636967 441016 835840 893779 800054 839368 848697 618070 660696 557877 608663
6517 608663 692182 820961 769787 791415 861984 738945 419884 854063 1129926 763518
6507 763518 731770 837598 681595 633684 721543 831452 640733 556189 580587 510744 726783
6496 726783 1047483 940431 894804 734139 395137 506204 829878 725824 589926 659324
6486 659324 538668 345845 552456 813440 632348 578608 771333 529880 522236 796960
6476 796960 579009 270032 484783 650752 634733 778163 619191 380937 355296 534176
6466 534176 508445 715831 754553 361321 141758 755038 784482 456605 553976 841999
6456 841999 481171 313901 476991 717880 696063 721145 552894 522574 788328 903955
6446 903955 644599 746620 703026 345703 348964 789075 560102 207366 638769 906414
6436 906414 552726 493091 837304 743264 498943 608196 667489 509893 529510 455903 519312
6425 519312 753501 851194 326093 363925 638621 423542 256252 768846 751808 394568
6415 394568 476333 755059 442767 564882 794253 671601 428501 734936 793956 694163
6405 694163 673153 857146 534819 586607 698133 338080 241154 644928 662685 785249
6395 785249 983298 749641 332162 676068 903658 508783 494041 816612 509883 152487
6385 152487 330876 662868 692463 595063 834320 661192 572252 626114 564461 540243 605085
6374 605085 414541 501491 668251 486141 418972 771030 559119 338890 383104 694267
6364 694267 565715 558923 668771 779753 381829 472091 673416 786073 641071 689864
6354 689864 944228 801199 337715 341079 537707 561309 522350 804143 864812 737140 366279
6343 366279 695921 803107 777691 575512 829484 870861 541011 485442 763189 722494
6333 722494 490879 435418 922904 954160 515406 419192 734718 520584 413815 807465
6323 807465 1139917 795209 339806 455425 724866 726200 536852 910199 909113 656409
6313 656409 301347 718854 827295 648762 607909 774744 659586 701958 790163 1059393
6303 1059393 917501 750257 764336 1013693 983141 853154 831088 904025 576585 643240
6293 643240 989218 1099554 891535 750723 837615 789745 605685 1172831 1388717 948077
6283 948077 709857 830688 714076 945351 1128060 1351513 1208904 1064833 932398 918712
6273 918712 1102150 1423221 1385043 1435553 1256190 910564 859086 1235104 1406481 1385977
6263 1385977 1658904 1743138 1104384 962573 1431855 1349698 1335111 1458571 1175878 864841
6253 864841 1291893 1476644 1538211 1585012 1626449 1203624 1065516 1445781 1808580 1742399
6243 1742399 1939718 1655552 1322931 1264050 1463410 1653213 2038109 1912845 1480248 1094937
6233 1094937 1435665 1514289 1454418 1676153 1799907 1185401 1122934 1213870 1305779 1360857 1446161
6222 1446161 1484805 1422048 1306868 1250460 1461592 1656635 1634598 1507266 1432421 1474249 1455888
6211 1455888 1595587 1725501 1720105 1489787 1257904 1420942 1512942 1648590 1773735 1640554
6201 1640554 1356115 1444587 1218234 1408862 1461339 1566115 1500233 1188443 1028567 1288467
6191 1288467 1435563 1758032 1596406 1548191 1259902 1129799 1399027 1837522 1719911 1614214
6181 1614214 1539566 1297135 1253266 1609390 1888045 1935097 1408629 1348115 1368172 1438022 1529471
6170 1529471 1608162 1556855 1304185 1110045 1266021 1582569 1695086 1509250 1541565 1629132
6160 1629132 1507769 1458074 1912035 1825292 1508571 1657319 1703834 1630344 1608062 1579643 1633258
6149 1633258 1770556 1798175 1842321 1736661 1756808 1626974 1670598 1732749 1765844 1571881 1682897
6138 1682897 1673459 1611253 1685805 2001482 1759783 1589189 1723053 1910068 1743585 2031550
6128 2031550 2153487 2058455 1609857 1614940 1694742 1825576 1779479 1892003 1902236 1998437 1549972
6117 1549972 1567488 1795384 1834955 1513799 1616586 1796693 1763564 1755643 1904718 2044056
6107 2044056 2020515 1964784 2268851 2181274 2036532 1948964 2072778 1978945 1984092 2108032 2053152
6096 2053152 2071249 2242630 2119271 2251093 2386127 2442006 2359212 2253368 2136368 2140539
6086 2140539 2411167 2496104 2492931 2452685 2637920 2272721 2296015 2748494 2864046 2602067
6076 2602067 2710329 2831575 2813511 2693344 3057616 3061846 2903153 2909333 3230807 3375202
6066 3375202 3523892 2977083 2814116 3142108 3307725 3272695 3597182 3536624 3248573 2883664
6056 2883664 3441770 3802103 3909730 3882887 3907038 3662622 3741898 3900449 4539041 4620091
6046 4620091 4389340 4461743 4722480 4954231 5468084 5803608 5895728 6107959 6588048 7128435
6036 7128435 7467525 7396585 7104998 6672083 6302392 5864817 5721181 6010190 5754832 5238559
6026 5238559 5230070 5574226 5482258 5412799 5584137 5576122 5279829 5674902 6053690 5797206 5789744
6015 5789744 5895104 6002353 6319768 6584210 6922910 6934320 7013516 7183171 7781060 8800590
6005 8800590 9518869 9545935 9945942 10118564 9761240 9632699 9768661 9597046 9358383 9078000
5995 9078000 9175272 9150833 9187906 9722540 10085600 10220554 10627041 10866590 11185474 11638712
5985 11638712 12508069 13555441 14458840 15572829 16812293 18050255 19586270 21534202
5977 21534202 24150326 27388373 30675524 34393325 39013580 43245741 46710208 48856003
5969 48856003 49373722 48248659 45903423 43894296 42479823 40955690 40153276 40649728 41630307
5960 41630307 43228755 45849332 49680345 53981109 58136009 61546072 63888848 64768870
5952 64768870 63997320 61935153 60232745 58706078 57230300 57099822 58534433 60695365
5944 60695365 63973358 69236877 76118262 84642555 95115105 106923817 118756590 128997512
5936 128997512 136125236 138822156 136973023 130777623 120650696 108525182 95857994 83316868
5928 83316868 72019612 62981748 55373547 48710090 43395686 39241456 35103806 31695848
5920 31695848 29421568 27508029 25450946 24047533 22844464 21446660 20553957 19927609
5912 19927609 19395176 19030637 18542960 18263045 18206758 18243086 18101363 18238592 18881495 19419888
5902 19419888 19653975 20747477 22030197 22605181 22983735 23941328 24167207 24050867 23876031
5893 23876031 23815706 23657686 23824957 24384325 25006069 25539732 26106197 26619343 27128314 27882241
5883 27882241 28539145 28941097 29291529 29298563 28979820 28457340 27924821 27102904 25848913 24924411
5873 24924411 24193627 23677239 23716801 23978573 24480682 25272963 26061116 27066734 28269565
5864 28269565 29555794 30738137 31806344 32549739 32950263 32697608 32015957 30802933 29645253
5855 29645253 28656548 27517412 26720886 26560970 26354293 26648437 27033030 27579487 27842630
5846 27842630 28249148 28532234 28832958 29142387 29351061 29226905 29086814 28791556 28001065
5837 28001065 27364900 27037615 25916847 24657801 23654876 23149222 22712861 22989746 23557229
5828 23557229 23859709 23968271 24200435 24065136 24119309 24222632 23633792 22730854 21903025 20645110
5818 20645110 19511542 18744129 18321873 17581199 17011152 16723985 16586209 16523658 16820349
5809 16820349 16377346 15914412 15814632 15244333 14728121 14406929 13773402 13013817 12125152 11451364
5799 11451364 10878251 10308405 10161466 9900848 9724744 9684992 9558265 9591124 9889634 9898287
5789 9898287 9955089 9811890 9237730 8455802 8101005 7682923 7240640 6793181 6594575 6070406
5779 6070406 5776337 5685235 5369968 5122340 5099747 4746292 4753023 4509898 4317027 4218251
5769 4218251 4392847 4289527 4012577 4034390 4235966 3931428 3722962 3800512 3888130 3802049
5759 3802049 3712781 3857834 3791894 3665786 3749124 3887797 3795889 3514936 3356851 3484307
5749 3484307 3432819 3541654 3719084 3644336 3379776 3003729 3027145 3500774 3782132 3574893
5739 3574893 3394933 3251472 3326678 3337624 3533585 3711965 3464591 3155548 3119874 3189310
5729 3189310 3376129 3373655 3225126 3274783 3393618 3281745 3439703 3175049 2931408 2805806
5719 2805806 2956606 3098695 3261690 3322519 3139882 2737376 2748549 2861863 3043928 3113890
5709 3113890 3052757 2649080 2516841 2849603 3084640 2916487 2999283 2865855 2550321 2500226
5699 2500226 2581316 2692424 2843657 2832411 2450506 2471555 2697959 2718285 2555799 2503566
5689 2503566 2608870 2235375 2310299 2753336 2718869 2362896 2415497 2267470 2187845 2486925
5679 2486925 2546772 2588619 2320612 2342835 2210686 2335320 2459320 2378372 2388167 2494862 2317622
5668 2317622 2285641 2472563 2530365 2366289 2508438 2617810 2555015 2330146 2567233 2375574
5658 2375574 2329989 2463139 2497363 2297412 2372201 2448900 2573522 2518491 2700048 2614792 2609212
5647 2609212 2591913 2749042 2657947 2732468 2475301 2326641 2325100 2494325 2388123 2365062 2352151
5636 2352151 2231530 1858221 2018351 2374730 2274308 2253217 2299661 2150144 2073577 2057473
5626 2057473 2136066 2445726 2471919 2301857 2231024 2109293 2135797 2161062 2419187 2625286
5616 2625286 2331719 2138603 2221798 2255291 2347532 2499027 2486379 2291530 2142185 2146206 2115806
5605 2115806 2359861 2655721 2609381 2575745 2688199 2634282 2711033 2893000 3014410 2981389
5595 2981389 3027313 2702867 2510029 2474442 2575398 2608446 2805062 2685958 2209702 2093036
5585 2093036 2113419 2050603 2180471 2137065 2225446 2130189 2024266 1893592 2079141 2260448
5575 2260448 2177978 2207300 2404445 2155611 2168762 2317852 2313713 2138509 2058445 1998267 2302807
5564 2302807 2278730 2192913 2120912 2083745 2186361 2346480 2390182 2317379 2038508 2032082 2225290
5553 2225290 2245835 2323646 2550290 2375861 2240283 2476167 2558783 2788429 2970620 2862086
5543 2862086 2770332 2896013 3280029 3233382 3276680 3559831 3346915 3044036 2949216 2955412 3005596
5532 3005596 2932503 2900036 2632997 2508814 2521842 2470631 2557271 2814479 2744278 2751079 2897343
5521 2897343 2920926 3091574 3204805 3086448 3035867 2941615 2921818 3006240 3055951 2891116 2741699
5510 2741699 2833023 3046423 2915538 3031389 3107200 2694017 2477174 2496268 2487847 2646288
5500 2646288 2748381 2546700 2292831 2251263 2231179 2292781 2340077 2329534 2276850 2392642 2313076
5489 2313076 2034973 2261628 2533937 2604035 2404818 2385032 2303161 1935595 1900611 2176564
5479 2176564 2297067 2242892 2192505 2111820 2033408 2048811 2038989 2098026 2155932 2239686 2266322
5468 2266322 2493816 2265496 2254979 2383865 2366889 2156546 2431788 2643376 2555437 2304069
5458 2304069 2154580 2054784 2233715 2221617 2410721 2485055 2312577 1909209 1970693 2220541
5448 2220541 2379128 2132079 2166429 2001725 1852524 2204880 2540764 2258303 2095061 1971132
5438 1971132 2170378 2301246 2333089 2339907 2249204 2045287 1970333 2184712 2572053 2505699 2158925
5427 2158925 2033803 1982389 1716001 1816410 2260453 2223276 1816470 1892652 2274024 2137348
5417 2137348 1991168 2276066 2130335 1915497 1855836 2085205 2133354 1949178 1818496 1869975
5407 1869975 2063096 2125364 2131145 2360451 2431119 2105314 1975761 2219255 2235776 1778951
5397 1778951 2037574 2205520 1992800 1874327 1972622 1919750 1943667 1957580 2222632 2249932
5387 2249932 2199478 2002393 2058826 2234644 2258013 1952903 2211451 2257774 2030039 1981028
5377 1981028 2315732 2221069 2085903 2068893 2213970 2072754 2198786 2204180 2209912 2044438 2136486
5366 2136486 1893134 1822399 1976244 2037511 1960688 2039667 1957113 1987611 2096803 2053371 2047968
5355 2047968 2066997 2083945 2065723 1939569 2197364 2174050 2060137 2187450 2298817 2164209
5345 2164209 2145093 2298386 2390142 2156964 2043440 2260313 2311300 2182675 2153893 2087560
5335 2087560 2095480 1990764 1801726 2003849 2246083 2474958 2266621 2140513 2107383 1962939
5325 1962939 2102445 2652089 2678294 2326446 2104427 2059695 2065276 2437612 2783459 2706738
5315 2706738 2415284 2333499 2327885 2392589 2747881 2816253 2358886 2337435 2491825 2456540 2334759
5304 2334759 2441455 2331584 2370212 2403431 2543889 2318875 2325123 2245925 2202934 2636919 2755354
5293 2755354 2340747 2238435 2288045 2207495 2162044 2585813 2866114 2586917 2097596 2028097
5283 2028097 2240837 2673598 2786074 2728857 2384432 2119377 2192756 2727802 2806098 2628813
5273 2628813 2318912 2080840 2182675 2387823 2620055 2712586 2704608 2477012 2377582 2668676
5263 2668676 2741461 2360514 2324789 2604660 2598963 2615551 2622206 2423452 2114816 2171684 2472265
5252 2472265 2572904 2904385 2947026 2274159 1904917 2290810 2540277 2662422 2586139 2382073
5242 2382073 2249274 2224150 2190117 2502674 2746526 2600298 2306791 2386711 2641152 2499707
5232 2499707 2610779 2799646 2517102 2287689 2541428 2644486 2702121 2590346 2430018 2568419
5222 2568419 2622889 2658787 2728109 2935900 2821038 2642583 2709539 2932345 2593755 2426062
5212 2426062 2538275 2699955 2477835 2532672 2715613 2684078 2532593 2332437 2531297 2813719
5202 2813719 2755409 2634739 2650554 2350725 2268420 2565068 2880243 2856757 2654823 2528726
5192 2528726 2347592 2412638 2596541 2587689 2672921 2663240 2358645 2330799 2470099 2696695 2947092
5181 2947092 2866225 2736125 2670129 2616661 2627914 2544681 2665135 2783668 2480743 2451543 2659147
5170 2659147 2478813 2450920 2511678 2647209 2864865 2945732 2784734 2664710 2437585 2220293
5160 2220293 2480968 2968297 3180936 2872089 2622427 2627918 2523690 2820118 3123852 3160827
5150 3160827 2960226 2660728 2767710 3057360 3056066 2873354 2752715 2756839 2698668 2818506
5140 2818506 3180130 3274391 2750773 2596937 2584162 2842000 3235727 3340984 3134419 2871429
5130 2871429 2710757 2839111 3065843 3295494 3343177 3062977 2832522 2901321 3162125 3340391
5120 3340391 3373715 3178845 3242434 3083518 2942977 3195397 3246980 3072902 2859128 3051081
5110 3051081 3369336 3220537 3205029 3338405 3393452 3301508 3340120 3478472 3455402 3245198
5100 3245198 3357485 3619946 3727782 3550658 3411916 3308923 3535462 3592150 3717439 3759746
5090 3759746 3546002 3417513 3441806 3664263 3861807 3919244 3799388 3322193 3144069 3641120
5080 3641120 3847574 3761806 3662581 3333391 3152093 3295463 3475953 3627622 3878752 3541337
5070 3541337 3358795 3318909 3674332 3886116 3983404 3960566 3716889 3404315 3636403 3862313
5060 3862313 3653695 3536572 3660689 3691386 3424056 3535507 3916416 3852728 3804020 3940785
5050 3940785 4018026 4135768 3982778 3874738 4375279 4503625 4004225 3884229 4184494 4042242
5040 4042242 3903421 4044210 4360508 4148198 3831341 4105319 4257691 4233500 4232677 4078422
5030 4078422 4132852 4032450 3826152 3997946 4169101 4042931 3905155 4059043 4133454 4126385
5020 4126385 4155729 4417965 4198012 4140139 4123636 3975666 4124696 4206955 4207074 4271706 4086627
5009 4086627 4073368 4087111 4266531 4373638 4541967 4529916 4505805 4354380 4143632 4029958
4999 4029958 4172403 4311069 4510386 4302910 4261558 3967633 4122036 4457359 4565914 4423631
4989 4423631 4619537 4129957 3895721 4208340 4641552 4770729 4751264 4403801 4248807 4266341
4979 4266341 4471450 4617546 4897476 4848545 4234249 4193078 4859592 5244418 4923645 4892774
4969 4892774 4801653 4428716 4570640 5013322 5309750 5472568 5279097 5136650 5225117 5535143
4959 5535143 5467432 5536206 5819448 5800395 5560913 6176035 6526320 6276225 6462300 6913462
4949 6913462 7027921 7159096 7598995 7924781 7976220 8415114 8437962 8611514 9134147 9351680
4939 9351680 9004733 9503564 9812047 9514398 9530925 9914409 9732919 9814713 10183351 10355796
4929 10355796 10073564 10201204 10148179 10159701 10864864 11594700 11714710 12098478 12373929 12608092
4919 12608092 12830509 13318463 13707725 13868737 14236739 14297985 13897841 13870188 13908151 13655005
4909 13655005 13461025 13693580 13438391 13052233 12991887 12791063 12256882 12289576 12489917 12326769
4899 12326769 12130754 11946909 12013740 12015202 12261008 12611998 13020863 13268545 13436883 13470536
4889 13470536 13999185 14563654 14487604 14482571 14945446 15082576 15196428 15700383 16526618 16626372
4879 16626372 16855340 17675060 18461049 18935634 19806568 20598043 21149186 22167469 23279415
4870 23279415 23991302 25184926 26033165 26484324 26675195 27526473 27651548 27589624 28075208
4861 28075208 28167950 27596637 27692139 28204227 28340482 28606254 29400137 29957572 30408768 31266664
4851 31266664 32228847 33219043 34599139 36171678 37214900 38744021 40316700 41545002
4843 41545002 43151685 45171559 46537187 47257059 47619945 47552725 47554998 47289340 46686295
4834 46686295 46068139 45404149 44697209 43920706 43501030 43391921 43201331 43182210 43601633 44100021
4824 44100021 44941997 45955634 47029742 47955833 48918972 49826303 50815937 52046335 53346254
4815 53346254 54437590 55819265 57379350 58533559 59855334 61794309 64143916 66699829
4807 66699829 69349464 71665575 72929031 73373416 73165951 72692019 72396987 72245382 72084992
4798 72084992 72159752 72876966 74044960 75648327 77426975 79178281 80727506 81870533 82709337
4789 82709337 82683341 81665000 79974017 77787514 75674945 74063775 73255074 72819658 72957402
4780 72957402 73315639 73885529 74785315 76019174 77198010 78007703 78480109 79008315 79215111
4771 79215111 79156865 79004643 78716755 78115678 77824186 77879337 78235930 78736548 79677763 81333824
4761 81333824 83652884 86952175 91445115 96646081 102833274 109643908 116798007 124633255
4753 124633255 132211843 138305474 141923548 143152263 142092701 139403826 135797456 131873386
4745 131873386 127468069 123065110 119200738 115911323 113624854 112604787 111824315 110869576
4737 110869576 109388410 107371640 104424032 100637117 96894508 93079870 89488518 86767587
4729 86767587 84541621 82780191 81339818 79997175 78661893 77357463 75661181 73590563
4721 73590563 70772267 67551663 63296529 59387751 55973201 52532459 48651748 45399845
4713 45399845 42303685 39145194 36507853 34374167 32446360 30871275 29179069 27704488
4705 27704488 26545612 26038517 25246883 24208587 23594545 23085577 22313505 21935703 21616177
4696 21616177 21080309 20638470 20359495 19716400 19265696 18884390 18280287 17572928 17100993
4687 17100993 16773375 16115161 15773378 15501957 14830398 14389175 14265799 13742562 13529953
4678 13529953 13395134 13122962 12621923 12296282 11976493 11809578 11709925 11770076 11270641 11065347
4668 11065347 10979782 10785432 10724118 10985697 11056532 10987188 10632181 10592698 10434198 10544239
4658 10544239 10561530 10523805 10060890 10091469 10031434 9959397 10050216 10390727 10429222 10314699 10018073
4647 10018073 10148229 10245809 10638865 10841171 10729104 10670051 10957841 10878435 11249986 11745817
4637 11745817 12060925 12193841 12670564 13258615 13572490 14161398 15022547 15780364 17067909
4628 17067909 18787039 20373324 22253186 24756983 27455250 30809037 34736985 37969701
4620 37969701 40742513 42353700 42319481 40435920 38011555 35234874 31808584 28524207
4612 28524207 26166644 24188421 22272260 20536323 19110584 18037429 17444865 16768045
4604 16768045 16332414 16179381 15712592 15042151 15319204 15700844 15933102 16090496 16705434
4595 16705434 17110836 17455679 18236703 18962478 19391913 20220094 21050180 22247125 24057253
4586 24057253 26262746 28368863 31434634 34899225 38091968 40534815 42530888 42724470
4578 42724470 41183296 39249864 36936351 34265413 32398098 30868361 29648741 29132834
4570 29132834 29525920 30071689 30881304 32274380 33067191 32680960 31525087 29895335 27514290
4561 27514290 25190395 23334686 21297412 19377954 18019922 16677685 15363233 14680936
4553 14680936 14333682 13763227 13448294 13451597 12747430 12373889 12982470 13320154 13053510 13022250
4543 13022250 13231555 12992556 12834368 13060336 13297941 13198672 13353052 13533089 14115451 15393743
4533 15393743 16647984 17710053 19555559 21632916 23400501 25083512 26557261 26688776
4525 26688776 25342657 23456754 21281621 19043247 17360038 15976425 14342041 12926117
4517 12926117 11768927 10757113 10261079 10089074 9540840 8886528 8546807 7996385 7530837
4508 7530837 7720932 7954965 7709857 7295842 7014137 6687276 6586108 6682060 6519861 6422494
4498 6422494 6356507 5985600 5833338 6125411 6434931 6399593 6380036 6282452 5812838 5841541
4488 5841541 6131114 6027488 6015778 6291473 6345891 6371877 6651737 6959791 6841248 6581351
4478 6581351 6353726 6157912 6159303 6448429 6167413 5842807 5651451 5376569 5287653 5634984
4468 5634984 6002188 5746849 5344924 5274587 5115996 5206691 5500550 5833909 5545701 5344062
4458 5344062 5275972 5187081 5484639 5698763 5441665 5368682 5332605 5255089 5213486 5481602 5630143
4447 5630143 5268087 5046674 5475765 5403044 5232898 5253663 5355774 5211634 5391605 5838511
4437 5838511 5626489 5260856 5219109 5194214 5201241 5442035 5567479 5302620 4957147 4930443
4427 4930443 5037998 5534932 5751098 5323416 4978249 4779295 4674978 4989146 5549384 5667977
4417 5667977 5090688 4562220 4574873 4755469 5065882 5423747 5121965 4786887 4650558 4627765
4407 4627765 4821518 4923903 4655725 4586338 4717288 4672965 4802616 4790353 4817236 4569813
4397 4569813 4407122 4739285 4805896 4827627 4721773 4565537 4524867 4790522 4807144 4762891
4387 4762891 4547249 4410946 4429192 4755770 4751649 4486206 4251741 4386433 4249755 4463630
4377 4463630 5009157 4886643 4409708 4326225 4343571 4658555 4758427 4930836 4731763 4363824
4367 4363824 4203949 4499957 4759307 4993903 4878881 4471410 4305702 4296032 4505883 4897699
4357 4897699 4978431 4612469 4352467 4498061 4740363 4661625 4744991 4914489 4646279 4660084
4347 4660084 4945882 4950107 4836068 4772769 4784875 4789489 4850821 4814989 4806606 4659938 4704330
4336 4704330 4744878 4795506 5027537 4926200 4883150 4825536 4682430 4898603 4961644 4865380 4812126
4325 4812126 4789877 5047017 5440497 5445466 5180883 4985145 4850194 4785434 5004776 5342347
4315 5342347 5292362 5018200 5063941 5035881 5199680 5334998 5520563 5442384 5200972 5073930
4305 5073930 5229029 5242229 5308072 5330088 5265626 5302143 5436648 5345282 5459532 5527897 5364030
4294 5364030 5287164 5468002 5539418 5442649 5324663 5421368 5483451 5509104 5628219 5697053 5758880
4283 5758880 5672650 5591751 5495525 5752021 5834462 5999446 5993906 5885331 5806421 5775729 5793451
4272 5793451 6103119 6192110 6066545 6191167 6294981 6028780 6082046 6529118 6530981 6227665
4262 6227665 6273758 6396152 6279979 6491073 6644773 6689042 6833579 6779582 6541964 6594468
4252 6594468 6699909 6700243 6618858 6991886 6947483 6764509 6850967 7126959 7016588 7067676 7553267
4241 7553267 7587335 7329907 7504813 7431036 7371471 7610028 8245791 8086377 7856736 7983753
4231 7983753 7950160 8109704 8508170 8596329 8420270 8286984 8446532 8868792 9345201 9356790
4221 9356790 9180038 9015670 9242433 9306742 9623271 10059569 9996208 9525355 9490755 9898289
4211 9898289 10422219 10480159 10593888 10878990 10726956 10675719 11108338 11712274 11832244 11709949
4201 11709949 12014282 12578010 12775949 13296221 13541089 13692945 13985849 14432521 15010110
4192 15010110 15771025 15883981 16029372 16606345 17609841 18188357 18955382 19887044 20367402
4183 20367402 20950266 22316206 23621451 24937824 26100222 27385347 28404100 30181338
4175 30181338 32406747 34546997 36445251 38598875 40573036 42872270 45823592 48955351
4167 48955351 51853684 54742543 57411521 60559695 64107861 67985802 71607437 75412102
4159 75412102 79447092 84069077 89357228 95444050 102276077 110561611 120445693 129944096
4151 129944096 136263254 137758813 136096059 134195491 133038860 132680887 133317348 134858232
4143 134858232 136770277 138535473 140400270 142394818 144169723 145321599 146012619 146105153
4135 146105153 145802503 145251004 144369086 143148351 142315526 141190756 140068561 138787970 137497611
4126 137497611 135991301 134505871 132823797 130682946 128196094 125463476 122176180 119136027
4118 119136027 116325046 113204346 110138706 107411670 104484245 101532022 99094153 96893460
4110 96893460 94151911 91605084 89356442 86954383 84674774 83019515 81179605 79736048
4102 79736048 78726212 77795593 77115077 77014384 76421444 75516577 74584393 73827125 72689302
4093 72689302 71822767 71414720 70592813 69639242 69283570 68916714 68242468 68236921 68208019 67818234
4083 67818234 67638846 67677287 67494349 67466000 67403711 67534894 67667797 68732687 70256097 71686202
4073 71686202 73559230 75502552 77084421 79037902 81225901 82733038 83820432 85038916
4065 85038916 85858729 86409463 87265417 87831049 87971707 88428998 88884672 88891664 88809192 88805734
4055 88805734 88340529 88058273 87911121 87897843 87983966 88219761 88445321 88614496 88992163 89446250
4045 89446250 89634851 89170142 88306133 87086200 86281981 85820475 85426911 85210789 85307194
4036 85307194 85498667 85650715 86043925 87062018 87571224 87695892 87483566 86652049 85433253
4027 85433253 84260096 82690646 81288172 80004933 78508347 76972674 75392062 73301061
4019 73301061 70818361 68300867 66128911 64118293 62534955 61369246 60440500 59188602
4011 59188602 58619016 58306960 58052562 57842192 57476597 56901267 56126174 55495787 54973774
4002 54973774 54409204 53672502 52813294 52003758 51594777 51598480 51678481 51868730 51659295 50822091
3992 50822091 49797285 48734898 47281504 45530095 43977512 42559393 41045483 39818748
3984 39818748 39106140 37991731 36666673 35569311 34667735 33750516 33136743 32514092 31928571
3975 31928571 31270358 30857497 30109289 29736915 29696308 29243297 28532163 28349315 27581696 26762750
3965 26762750 26187595 25555615 24370865 23607410 23084639 22562462 21257533 20737938 20280333
3956 20280333 19481599 19058806 18997317 18439111 17903131 17587910 17409165 17140673 17156428 16968409
3946 16968409 16542548 16088785 15647349 15186138 15155343 14968562 14239700 13891336 13979660 13365815
3936 13365815 12886493 13060301 13092120 12738612 12399020 12661473 12437663 12158632 12060616 11946994
3926 11946994 11815096 11770260 11642153 11495624 11622175 11289625 11154303 11402441 11298408 10971139
3916 10971139 10956186 11167459 10819263 10687259 10863235 10860358 10440078 10239401 10225969 10399064
3906 10399064 10558756 10501626 10233262 10161519 10026471 10349899 10454152 10802867 10735240 10613082
3896 10613082 10588813 10661559 10513092 10933998 10921722 10755995 10856561 11237364 11326187 11350693
3886 11350693 11547413 11756441 11878900 12159863 12561348 12838829 12977983 13205658 13570450
3877 13570450 14224848 14543857 14952936 15624589 16180168 16452279 17177387 18363325 19224414
3868 19224414 20018203 21256683 22554369 23458628 24848832 26665768 28171930 29751366
3860 29751366 31427219 33086029 35034716 36941301 38739344 40424729 42232148 43892692
3852 43892692 45485919 47125749 48748710 50080728 51339360 52605762 53575338 54665635
3844 54665635 55673966 56385992 57061757 57411826 57264510 56855762 56527755 55891670 54959320
3835 54959320 54236825 53708854 52437350 51265555 50395968 49203787 48194702 47421918 46422968
3826 46422968 45448674 44803527 43745547 42593943 42281761 41954941 41208375 41167419 41681733
3817 41681733 41736037 42327764 43555432 44718799 45987816 47919934 50221001 52769194 55886945
3808 55886945 59159342 62435229 66129790 70413594 74433226 78815469 83452711 87602812
3800 87602812 91860833 96397506 100492132 104294970 108548334 112669153 115988215 119296380
3792 119296380 122683645 125410025 127632843 130064554 131806138 132734715 133125077 132998352
3784 132998352 132249112 130992529 129451528 127172726 124520662 121623274 118246956 115007994
3776 115007994 111831538 108085425 104272971 100619881 96743503 92487296 88603436 84997410
3768 84997410 81456817 77498258 73775193 70379117 67039563 63834622 61445082 59306507
3760 59306507 57403738 55666882 54412206 53361717 52752169 52700189 53395671 54169638 55051726
3751 55051726 56259151 58369682 60774640 63463740 66660299 70285435 73812632 77328354
3743 77328354 81290666 85971730 90201148 94393990 98588380 102381980 105793534 109683435
3735 109683435 113656200 117419594 121058236 124473994 127722276 130811176 133784313 136621011
3727 136621011 139048117 140691434 141748707 142343484 142757471 142398967 141486085 140435326 138574739
3718 138574739 136088570 133492351 130883600 128231380 125229610 122197196 119182976 116347509
3710 116347509 113169589 110046317 106853307 103293454 99489303 95835579 92427873 89021193
3702 89021193 85493651 82433656 79430160 76674434 74574311 72843691 71151346 70173296
3694 70173296 69397521 68924681 68907511 68897130 68852843 69468007 70502581 71256231 71931391 73196398
3684 73196398 73951919 74547141 75802278 77176288 78335159 80114073 82172212 84192735
3676 84192735 86330472 89437889 92380300 95513647 99054827 102599218 105821695 109675627
3668 109675627 113852188 118409919 123522961 128990141 134214704 139969072 146388675 153292275
3660 153292275 160783033 169204562 178254460 187203025 196671994 206386772 215898352 225996613
3652 225996613 236339135 246325238 256208953 265498359 274034911 281781829 288872162 295071294
3644 295071294 300332829 304676499 307709277 309060421 308822742 307250657 304291594 300133619
3636 300133619 294729478 287881282 280315990 271523784 261877872 251971569 241594542 230828710
3628 230828710 219847664 208794171 197544549 186248657 175798811 165402020 155039745
3621 155039745 145086570 135186833 125456025 116809255 108744938 101063636 94083650 87640619
3613 87640619 81243574 75250122 70439511 66226477 62064171 58712518 55859391 52697976
3605 52697976 50261333 48455141 46584418 45155960 44148239 43134983 42432963 41994144
3597 41994144 41525093 40956578 40614794 40768205 40554099 40670230 40821249 40177898 39927246
3588 39927246 40158497 40030675 40019940 39959052 39727353 39192969 38622435 38479651 38384014 37743527
3578 37743527 37374582 36788615 35931483 35310529 34654023 34035160 33499738 32601574 31762663
3569 31762663 31012798 30186346 29125729 28002298 27321369 26375994 25121406 24113895 23198952
3560 23198952 22144050 21153976 20359733 19664954 19106107 18220025 17733802 17323157 16526341
3551 16526341 16200842 15981054 15563736 15207390 14888920 14868251 14561424 14213177 14052888 13854301
3541 13854301 13694353 13520804 13517235 13555041 13292328 12988016 12886354 12965552 12743121 12666294
3531 12666294 12601977 12365174 12129102 12115297 12057700 11959948 11760502 11986827 11860384 11809687
3521 11809687 11810910 11737274 11653500 11626700 11499910 11758182 11582457 11196485 11210361 11666628
3511 11666628 11670508 11466060 11806858 11990438 11801510 11668867 11943856 12044669 12140886 12568426
3501 12568426 12852108 13174148 13488018 13485144 13965898 14479678 14875810 15497674 16390941 17044697
3491 17044697 17327555 17861259 19042539 19519943 20448187 21592416 22478686 22911330 23608873
3482 23608873 24108562 24156969 24022590 23524400 22460950 21501081 20247307 19101375 17837361
3473 17837361 16796447 15455245 14717959 14161089 13518300 12509110 12170091 11583563 11010115
3464 11010115 10860861 10953772 10410937 9844044 9665498 9701198 9495238 9572890 9463469 9271737
3454 9271737 9001120 8752693 8857595 9029113 8933523 8913062 8843361 8546738 8439089 8442203
3444 8442203 8363783 8188030 8043634 8150796 7927109 7862925 8025720 7880811 7873659 7918308
3434 7918308 7931208 8114654 8313994 7961667 7763236 7868984 8156486 8062922 8336518 8327780
3424 8327780 8022572 7904389 8113454 8058190 7996364 8005506 7923517 7539522 7391750 7308784 7321748
3413 7321748 6867637 6703739 6393540 6528318 6471454 6319034 6206402 6200541 5753155 5715050
3403 5715050 5840705 5819291 5632747 5631896 5499655 5300798 5336991 5484405 5169696 5036405
3393 5036405 5149995 5089433 5007375 5051969 4734562 4774697 4852358 4649738 4706190 4775425 4898096
3382 4898096 4813812 4829196 4855692 4608824 4692317 4976251 4690394 4705179 4812955 4869252 4854710
3371 4854710 4597329 4465041 4579111 4842520 4953810 4803111 4796085 4636881 4512411 4826654
3361 4826654 5283432 5282708 5300291 5063638 4874701 4828881 5007611 5352307 5397213 5150200 4866416
3350 4866416 4801702 4947511 4974254 4940212 5012017 4802337 4530239 4609697 4823272 4829578 4770479
3339 4770479 4865058 4672816 4488437 4601874 4667329 4480539 4595179 4667631 4310651 4400426
3329 4400426 4565304 4303748 4059313 4113922 3833784 3796023 3756197 3845484 3759494 3912598
3319 3912598 3969422 3784061 3779006 3963561 3892538 4097992 4409933 4201997 3785662 3709362
3309 3709362 3944722 4084544 4023201 4246151 4018500 3574647 3545990 3652236 3655400 3789316
3299 3789316 3598440 3367305 3176700 3119253 3180150 3041771 3102291 3118045 2917098 2746619
3289 2746619 3184824 2949845 2768388 2657593 2513580 2504385 2725361 2846555 2832387 2616184
3279 2616184 2693569 2319386 2234657 2895148 3113478 2485527 2726813 2662427 2353417 2393957
3269 2393957 2869704 2994121 2717105 2589671 2640816 2505852 2798761 2829416 2810857 2940033
3259 2940033 2879775 2483197 2886720 3227401 3145309 2986627 3307950 3381882 3233037 3532199
3249 3532199 3974986 4087008 4250480 4689805 4827930 5041177 5445295 5673975 6011640 5930470
3239 5930470 5693477 5520513 5315662 5237968 5268975 5349943 5364748 4896771 4565749 4454868
3229 4454868 4221847 4320005 4367366 4266788 4195146 4056248 3950002 4066162 4245127 4581077
3219 4581077 4793922 4863221 4607269 4666892 5285377 5952323 6237719 6787366 7379348 7661844
3209 7661844 8164731 9431799 10175087 10723273 11046051 11030203 10453959 9782417 9265161 9010841
3199 9010841 8552832 8173050 7313993 7108875 7204540 6697415 5854796 5366019 4928848 4643627
3189 4643627 4682018 4968813 4809272 4400776 4160192 4374988 4337137 4784981 5123240 4969956
3179 4969956 4871363 4999275 5193644 6080734 6367878 6598744 6784346 7341541 7765174 8068956
3169 8068956 8243387 8293354 7810220 7367965 7147706 7097576 6839082 6315901 5957962 5828563
3159 5828563 5639778 5615793 5441280 4933715 4408904 4201493 4385455 4602660 4905764 4787116
3149 4787116 4465457 4059608 4298559 4764851 5166766 5241950 4953171 4700395 4709560 4617997
3139 4617997 4778877 4643278 4110182 3758762 3769541 3858470 3960134 4000950 4192472 4114556
3129 4114556 3956639 3953380 4368414 4308737 4238223 4384146 4740056 4826981 4837866 4924541 5028036
3118 5028036 4941006 5261715 5703814 6120413 5849063 5658435 5590430 5713511 5630051 5777907
3108 5777907 5340007 5161402 4877645 4581588 4875093 5454252 5304128 4926970 5060523 5631499
3098 5631499 5638502 6282026 7072546 7355887 7700056 8770457 10093099 11151546 11857867
3089 11857867 11590813 10645986 9736112 9108263 8406479 7760168 7313751 6593910 6034102
3080 6034102 5707622 5436633 5096877 4794344 4336802 3583462 3647735 3950705 3874315 3477952
3070 3477952 3352141 3057886 2608689 2565963 2917527 2766839 2539094 2381490 2404980 2153694
3060 2153694 2141051 2327432 2290873 1830392 1694454 1750732 1795949 1853669 1975282 1890862 1659827
3049 1659827 1517248 1503921 1745690 2055572 1836913 1665884 1603389 1583636 1348783 1652000
3039 1652000 1819342 1452835 1191397 1312442 1482747 1475619 1589480 1631382 1390044 1294979
3029 1294979 1211532 1279467 1393624 1449676 1335404 1239394 1398363 1282622 1108511 1255272
3019 1255272 1293672 1066329 1170494 1232086 1108230 1072682 1054272 923570 1137361 1210993
3009 1210993 1062118 908620 990336 958614 1009523 1218439 1244082 1105988 1180470 984235
2999 984235 894960 1360737 1507981 1158759 1162117 1089072 1019303 1097510 1307298 1070801 673122
2988 673122 882662 1036737 1101261 1293322 1133227 624241 647082 857557 838109 948637
2978 948637 1137305 618605 459205 716474 1107654 895613 940784 912884 533108 466197
2968 466197 864149 808837 923972 792478 559884 552014 889089 993751 803163 533561
2958 533561 749003 704929 792040 1102222 985046 557305 454287 688222 946772 947129 934165
2947 934165 988183 587542 404588 716463 754567 1115105 1036290 460481 588565 705587
2937 705587 572910 631164 928582 1095345 983023 841740 1003012 830533 474520 730688
2927 730688 745983 623514 1022472 1006147 711068 560279 619047 711724 853883 994011
2917 994011 1038694 698983 762730 655708 629486 881642 1093766 858953 891360 867766 1062254
2906 1062254 999972 1067158 1232827 1061297 836135 1119853 1020734 1208502 1416689 1230641
2896 1230641 1014745 1056234 1176574 1494836 1581804 1592856 1207903 1030121 1361247 1560454
2886 1560454 1694188 2084573 1603307 1342051 1417505 1599438 1755219 1900598 1648402 1328936
2876 1328936 1272357 1808332 2005117 2166574 2094720 1914966 1501041 1961114 2496529 2623879
2866 2623879 2867604 2671219 2086111 1908568 2358649 2764941 2864925 2725591 2553687 2187334
2856 2187334 2302492 2721629 2811642 3003667 3061110 2495428 2576800 2930309 2928494 2531395
2846 2531395 2796878 3121286 2787564 2591168 2942874 2654375 2619973 2995486 3346493 3311994
2836 3311994 3399599 3310734 3238171 3341940 3711583 3725366 3950956 4107925 4003581 3717800
2826 3717800 4292470 4145988 3819288 3668976 3550541 3080355 3019887 3396799 3636137 3228329
2816 3228329 3032929 2965034 2961860 2811376 2931035 2788917 3146622 3344941 3168555 2804112
2806 2804112 2869014 2737089 2572628 2919387 3359845 3305180 3040856 3011251 2626756 2471595
2796 2471595 3156327 3546963 3228513 3067670 3002336 2834570 2992843 3465742 3321187 2761568
2786 2761568 2348012 2022522 1846004 2285340 2574628 2151953 1636349 1416880 1375308 1955153
2776 1955153 2488818 2193535 1639449 1549515 1414852 1653350 1987817 2199825 1754837 1298280
2766 1298280 1173754 1362698 1684608 1792593 1574212 1456127 1279854 1300279 1370211 1607466
2756 1607466 1316063 1039918 1097175 1436664 1485176 1600764 1373468 1130071 1042977 1254544
2746 1254544 1295956 1425291 1151920 866126 653095 929503 1071925 1058397 1043123 1084718
2736 1084718 653897 627050 779792 884260 884060 844290 839557 605612 731345 789829 938657
2725 938657 819307 741648 691740 696675 791722 853709 672816 659228 744148 807591 741004
2714 741004 769255 796873 729541 750484 912154 670244 749915 842779 838371 868390 1065939
2703 1065939 755260 500946 715434 850288 659588 778582 834162 521178 281831 562915
2693 562915 944966 836721 774403 549290 404099 667394 725857 775762 769409 673602 476776
2682 476776 348040 537193 866165 668411 524476 680446 812775 783265 591253 615754
2672 615754 594653 501459 539978 725686 620681 641424 410311 249014 430107 570420
2662 570420 514782 638557 520821 389809 350630 677436 804442 464280 334440 632063
2652 632063 391936 687549 892488 683876 320917 324817 187368 363058 687879 913243
2642 913243 563087 215358 356902 267698 372890 949883 975869 568759 438669 363357
2632 363357 372499 576958 728353 705368 629358 404900 244807 210813 766955 993954 724157
2621 724157 519471 489719 251584 299583 635425 1128655 915270 689440 669719 810852
2611 810852 850609 1138297 1070028 1026634 734733 550674 530515 930925 900856 697808 556819
2600 556819 638517 618584 713947 893896 834682 348513 215407 403359 821287 623719
2590 623719 429871 426312 234713 177534 701072 1003635 841964 409372 174796 292714
2580 292714 671231 625144 711217 353882 143557 162088 372557 660929 749128 294949
2570 294949 120572 171648 166293 471721 716092 559835 163698 254660 581824 582996 691813
2559 691813 1027504 455637 74922 310270 628833 666187 661634 428564 234622 92996
2549 92996 343135 394603 606427 662536 367413 77766 724734 539717 286636 592172
2539 592172 632518 90184 337731 440343 338574 153993 490232 502821 426217 412384
2529 412384 370282 111570 548320 627577 509379 576396 643198 375564 497641 546883 426380
2518 426380 233633 542558 363040 171422 352426 442602 122192 410744 614521 440615
2508 440615 314120 338607 280204 34916 338440 564123 444498 350247 336321 261469 460755
2497 460755 577181 458199 491510 402887 -96141 -2958 576135 745202 202855 130831
2487 130831 268314 190709 169434 890142 883884 650739 304935 508380 441527 430368 459572
2476 459572 684746 501065 505410 366722 445123 367883 272806 101938 416330 736397 662973
2465 662973 453407 569132 533052 187025 361906 597972 422826 444896 572379 447525
2455 447525 262331 516422 724058 596549 619500 896501 728348 480138 500060 604418
2445 604418 583676 821573 937046 984809 937706 627639 545461 755321 895305 607614
2435 607614 744056 913220 753649 496940 677895 747029 609747 608020 1031603 1002675
2425 1002675 804601 590026 694768 850289 884468 984877 1239721 1002118 757495 762713
2415 762713 1031478 1095900 1058271 1136794 1273133 1192470 1058240 1129397 1413005 1337742 1079603
2404 1079603 1154478 1538844 1568163 1445045 1334441 1381950 1244204 1141579 1397719 1550982
2394 1550982 1639696 1518582 1508211 1619720 1760982 1751797 1904427 2066492 1986164 1961933 2106847
2383 2106847 2225014 2480300 2478807 2469333 2599650 2877742 2916844 3193061 3509209 3526400 3494231
2372 3494231 3731352 4067645 4433202 4755798 4984358 5295977 5764007 6063172 6596352 7403496
2362 7403496 8614955 9703805 10923178 11765824 11937532 12315600 13241942 14406341 16110458
2353 16110458 18573849 22212061 27327588 34006534 43595813 59311214 82711587 110348633
2345 110348633 130487779 131001249 113076006 90053858 70036450 54004016 42176266
2338 42176266 33347561 26785649 21745370 18370763 16106849 14835416 13830134 12925412
2330 12925412 12526882 11760813 10222155 9365903 8778369 8053438 6976363 6381244 6331438
2321 6331438 5705144 4980843 5030494 4923183 4550576 4414827 4279476 4284567 4087036 3513113
2311 3513113 3598694 3679910 3528724 3259652 3359730 3246643 2985922 2831617 3093909 2926130
2301 2926130 2521645 2525905 2735141 2664973 2489494 2251282 2441568 2266100 2118935 2245738
2291 2245738 2193135 1933565 1655915 1769836 1973796 1812492 1771634 1895793 1637369 1360151
2281 1360151 1537867 1675060 1554250 1398095 1358756 1466316 1337179 1203368 1308350 1390220
2271 1390220 1412309 1231806 1108384 1317709 1056226 938284 1223116 1055774 778315 1094932
2261 1094932 1249359 1149881 1001825 1244487 1304723 1155544 1045306 956225 687617 805008
2251 805008 894826 1113105 1203126 970709 681370 755999 754193 756203 970221 1149084 935207
2240 935207 613699 456976 674731 725365 1034288 1109374 1044588 816130 570134 609693
2230 609693 842816 723169 788615 792611 598615 187517 407529 694077 734177 678588 685637
2219 685637 455692 273230 544231 671696 594937 747949 581272 364764 420751 598126
2209 598126 858723 832906 626491 236203 303220 542666 810768 670711 773659 610002
2199 610002 117969 165445 662305 639250 546430 576387 574162 233544 219970 432052 431714
2188 431714 242932 329633 220173 338179 455777 331991 402412 510836 224121 194677
2178 194677 316916 582505 606776 255077 254547 185146 -54988 290648 448524 537007 279902
2167 279902 144333 -2980 17393 345431 505612 449612 413110 226756 -95424 38348
2157 38348 360017 415376 315226 403315 244978 61114 173003 543366 251220 12159
2147 12159 39938 103375 119017 254732 249351 264563 211804 55520 -136655 -32860 341711
2136 341711 213094 -53199 161183 93669 11109 326276 280654 7724 -45349 35469 91421
2125 91421 75895 280225 203428 -93998 106094 346549 152108 210088 324575 125214
2115 125214 -73619 148317 227410 -34443 32224 141092 17647 129368 240982 26764
2105 26764 23730 161229 -39952 -172182 215679 326376 38688 -74016 168511 -2423
2095 -2423 -21550 257453 298138 173047 241630 102366 153478 245494 64846 -51411 230167
2084 230167 420181 122668 -45954 130633 52601 8478 399491 733404 760695 620806
2074 620806 666546 547350 308327 308325 485221 461526 359002 235260 57002 124345 122069
2063 122069 89875 86889 309043 277592 12445 5942 65413 51790 83609 333046 130808
2052 130808 -119886 24375 -65949 -86980 141773 183017 116269 61916 134634 -46374 -4659
2041 -4659 167112 266630 272453 137408 -124071 -35690 103806 138311 174677 531088 184032
2030 184032 -129592 -216837 -79374 82385 257159 564333 463734 58441 -272174 -208654
2020 -208654 203196 583480 307424 55873 14924 -215459 -214612 191400 474156 219438
2010 219438 60264 351329 159599 -125179 144366 268546 307140 447852 304953 136268
2000 136268 152878 188611 222635 353633 457184 104264 -218524 -94393 137834 287909
1990 287909 460776 432617 108607 36163 80590 56540 413427 660300 463510 215766
1980 215766 110725 275751 197403 363408 491614 367254 159146 130199 281140 542739
1970 542739 384720 350922 381916 334916 326017 205756 333097 581518 272344 220707 312758
1959 312758 230480 181613 334105 365799 219330 -1247 295547 491529 284653 211074
1949 211074 205923 76024 198347 274975 406830 442807 120467 -33763 335410 396602 560891
1938 560891 558397 389104 261792 96207 340291 598236 454658 427732 462158 372225 319911
1927 319911 410118 635930 430419 15128 278030 836863 722430 507171 316253 318453
1917 318453 187808 175648 616597 673101 238102 -50931 -45905 260316 401509 612294
1907 612294 674170 412717 -97066 29569 325226 742076 679648 305057 221940 100610
1897 100610 23328 557833 742897 515320 165780 178320 247256 254548 421273 627667 486663
1886 486663 381191 350510 639949 619717 528666 433055 412606 280238 330014 327591 384812
1875 384812 484475 359773 157462 274307 136249 372093 707202 368247 195055 214620
1865 214620 165827 162813 93475 232918 447527 331907 404926 390083 334246 384486 295316
1854 295316 123101 159907 87546 370659 462627 423536 226312 208520 360959 415574 316750
1843 316750 545795 459332 210999 45879 255450 265709 434214 411069 230810 232982 349037
1832 349037 214331 91576 14145 262957 303809 456298 526755 304222 197963 37368
1822 37368 72910 427526 515122 328403 128361 -25213 35966 182336 366404 353354 131342
1811 131342 -46613 208617 420308 455991 453755 173751 -22123 -99267 136419 325469
1801 325469 271745 212487 -43670 -33783 -12003 122986 497049 491013 -29391 -167432 -140917
1790 -140917 46496 267282 311149 186313 127969 17465 86346 342419 407506 282109
1780 282109 125850 10552 -96414 -107955 268995 478156 43648 22414 47470 -83384
1770 -83384 -159383 -39141 254700 217524 -98142 -76863 24986 -134759 112769 290835
1760 290835 224441 153400 23541 136009 22432 -21084 48011 143678 231989 52136 -221441
1749 -221441 89321 112052 96 34830 147436 -56576 -262396 184654 367167 -37707
1739 -37707 -65332 237915 -40506 -211961 260718 192997 7977 -56478 -76052 -122818 -61705
1728 -61705 294107 328498 274039 163935 -269135 -301477 161932 284040 135716 273444
1718 273444 98712 -379362 -107183 283019 225425 45612 351026 90530 -157828 5479
1708 5479 222094 111103 99292 10658 -142773 -129239 63598 104518 -18610 45981 82810
1697 82810 -17936 218069 1342 -275339 -166895 172464 167271 157080 205423 111278 -309769
1686 -309769 -182731 222254 298778 14278 28270 -89789 -219524 -123175 128718 68128
1676 68128 56998 -31165 -93353 -49509 173508 105914 25827 126713 -50001 -35114 410810
1665 410810 283942 -147709 -61317 203775 58586 -67557 200941 24702 -394926 -255749
1655 -255749 199092 136654 190399 24424 -183213 -249811 45088 82799 155884 280143 55532
1644 55532 -153136 159890 358928 256888 296067 206829 -158573 -143684 118044 154839 188404
1633 188404 297046 105272 -57694 20011 198641 20524 99011 252291 307766 46847
1623 46847 218669 69273 -76244 12836 217985 268441 320561 118953 91017 52308 197282
1612 197282 198557 125778 261901 299174 -13831 91317 82754 22117 97263 200008 101136
1601 101136 -96926 27442 137544 -146095 -73293 203884 207011 163008 92465 -32075 -108118
1590 -108118 55484 215198 363067 387589 102440 -201464 107703 352552 69925 128687
1580 128687 349036 -110035 -213558 101636 294098 23651 -94594 76166 191859 154072
1570 154072 297420 353122 158092 -1679 18060 276031 448782 148978 -44082 189965
1560 189965 187046 -46028 168891 463221 169416 -59846 -5813 130398 265535 223886
1550 223886 334456 151847 9201 -58067 139673 324807 294882 242844 286243 207920 -33271
1539 -33271 -15820 340346 415236 310409 234500 126535 21429 33697 225757 319730 228239
1528 228239 187780 129649 145061 173230 323386 493460 564999 305467 232191 336564 273958
1517 273958 30919 151086 200743 141066 -175718 52838 104414 -16022 233157 435128
1507 435128 123488 -27057 132408 306021 353530 266384 311467 259973 200162 228312 -62104
1496 -62104 87800 396541 86399 197622 567936 285100 -12862 -76630 21756 191470
1486 191470 258099 408676 178935 -81789 -58509 122982 301296 474539 255319 -77405
1476 -77405 4356 142349 147340 349312 413086 125194 -197763 -23981 266159 365663 398238
1465 398238 180673 -129045 -89910 101230 373391 640037 325404 -8772 -103845 -68163
1455 -68163 140614 252783 302921 163519 47035 37970 -8250 111176 342891 -34442 -106535
1444 -106535 181778 41256 -37406 165990 283544 257922 411694 373666 -39668 -8228
1434 -8228 282807 135791 256371 435715 77538 -364906 -78221 196034 212188 459496
1424 459496 476352 3989 -172631 114805 161895 467934 516419 280371 -43350 -27558
1414 -27558 108842 85792 112009 262753 12230 -195438 -1172 218893 201238 128766 -32961
1403 -32961 163262 213130 244575 178632 258532 117490 -241600 -257161 275255 202205 -2979
1392 -2979 -75378 81818 -22091 -9554 265280 441889 111199 32019 -65958 163247 300254
1381 300254 62131 191739 440264 154897 -118159 -184348 69597 9659 -23065 50435
1371 50435 122047 -90579 -144402 -20986 179657 499727 227090 -38711 57353 92725 -58020
1360 -58020 130224 293947 74178 -193361 86711 170789 131320 199114 237986 -57190 -39328
1349 -39328 113475 148415 169292 351094 -16101 -64986 1035 138748 -168823 89547 198958
1338 198958 -17443 103800 400201 114549 -17062 -66808 121859 72867 300988 262105
1328 262105 117696 73681 92181 -101767 -17601 299442 441466 289873 265861 188489 161593
1317 161593 26850 44383 212257 239682 173950 36282 -211283 -25386 96416 122574
1307 122574 -61208 89332 26010 -103491 183075 469636 172125 -73078 -16639 53399
1297 53399 17856 32688 130471 67337 175837 169324 98813 314852 468316 -27685 -291586
1286 -291586 3608 117817 45688 449496 374776 -122371 -242949 102726 91365 132489
1276 132489 39483 152495 50508 95999 102205 96658 126540 192953 99198 279589 221772
1265 221772 -67274 -328171 -47572 85348 214778 330558 140933 -81471 -116200 -29684
1255 -29684 299123 354787 355432 138137 -93305 -48057 160033 278615 180026 -9232 4931
1244 4931 137015 10335 209394 201779 -157337 -139786 67146 350805 371219 177 28105
1233 28105 6205 -212185 67881 348788 325780 29188 -141980 75839 219796 94759
1223 94759 273224 204966 -15442 90117 -49120 211349 246371 -72079 -105821 141833
1213 141833 -37862 -211849 32270 155993 71844 113639 356421 101608 -76068 221652
1203 221652 161127 84821 336916 238045 49533 6105 88468 148387 243028 267467 191434
1192 191434 47093 92591 -24903 12228 178336 70924 -127385 145980 342199 121594
1182 121594 47771 117080 -26349 -109017 -530 524221 397357 127000 -201373 -25771
1172 -25771 211485 409532 532662 423405 131035 7250 107589 314479 256076 -209748
1162 -209748 -43097 175733 -42514 121087 291961 79892 -31887 -25483 100463 292460
1152 292460 322093 52643 185858 172284 160749 201310 242316 263789 76012 117292 412826
1141 412826 333765 269581 165715 -24386 -15990 228474 331779 497148 343001 198451
1131 198451 37482 125154 375779 425139 231112 362399 90362 56315 296791 231571
1121 231571 356423 420366 216990 116160 73953 308992 177687 121001 209835 198586 140090
1110 140090 434791 238205 94346 153635 186998 207048 299441 222784 119286 68100 208494
1099 208494 387472 393198 317802 376872 92513 268388 155294 123594 410476 404937 202600
1088 202600 110433 129500 261737 314342 310269 298599 304613 321344 318734 225134 281436 207828
1076 207828 302573 265626 107532 202145 297239 134374 167636 348723 438958 302058 377516
1065 377516 438665 102961 -126954 82541 240050 332755 330389 95698 112279 60567 140633
1054 140633 352820 688404 559762 212340 101934 441682 155167 169241 518752 441202
1044 441202 187414 309044 133337 204702 201614 382681 293293 405759 268964 -100180
1034 -100180 -69820 294141 110435 121870 552697 207320 -329473 -14247 144836 104956
1024 104956 126999 286192 -117083 -81849 28282 205333 239988 614610 82142 -347498
1014 -347498 -56458 263440 88849 367887 255103 8877 -163902 25436 106473 50701
1004 50701 86032 109967 -182722 39957 207538 15152 9094 64234 -117941 -211928 74622
993 74622 214421 -18146 38248 -25598 -44321 76938 77110 141440 54258 -48403 -70666 -2567
981 -2567 94491 325006 84204 3406 93969 24008 -124157 77015 163740 35735 -205793
970 -205793 90889 3732 -44916 -87455 100099 -58487 122317 8182 -173830 -106753 228750
959 228750 -105409 -57641 -20691 111966 -148851 96754 249158 -8168 -58498 63120
949 63120 -80490 112319 20426 -85816 -221423 -8871 29179 -174652 38408 241586
939 241586 -291268 -312554 -8682 59442 -17420 50461 -78593 -281701 -182664 -32190 -99526
928 -99526 -44871 92199 -113189 -1469 106423 -123447 -386535 -158708 -179101 -194725 50804
917 50804 273456 3020 -249993 -312101 -113824 74667 123103 -28075 -143122 -182652 -342344
906 -342344 -339498 506 36851 -123983 -52494 34604 -20561 -102487 -219821 -151544 37184
895 37184 53926 -91105 -48678 -57857 -350721 -496712 -185420 -27322 -120789 -57601 9485
884 9485 -178085 -162139 29732 -78530 -72163 -106690 -107872 -170407 26571 174626 -43229
873 -43229 -176373 -110054 -313560 -253088 -166204 -171433 -59512 -121155 -278945 -238677 -102994
862 -102994 -108715 -130220 -66834 82525 -202718 -433247 -101788 -82817 -237565 -142708 -110131
851 -110131 -177999 -257880 -266337 9171 -142556 -217461 -158012 -192907 46304 95649 -30400
840 -30400 9958 -20136 -84123 37523 78447 65551 -142696 -102561 105650 145019 -65037
829 -65037 177849 6673 46702 21607 -2254 -21935 205009 -5189 -29287 -187089 44986
818 44986 -23266 -91332 50197 152442 77830 80018 16448 202872 87133 57670 129014
807 129014 322188 234726 113329 -26110 332166 197220 175820 303764 299897 -62229 -212001
796 -212001 -31184 285861 283138 136377 109555 76993 -144519 -232432 -108208 28487 -106041
785 -106041 -87819 165965 146091 100025 54183 4335 -55894 51867 155756 185748 62321
774 62321 353907 297749 170799 113688 316818 355135 60162 16385 312048 319111 236721
763 236721 63190 257035 285767 186199 170630 319012 -20537 -39906 188202 582070 242350
752 242350 149755 124936 276025 129199 247671 416816 426204 -146456 -144013 75009 323466
741 323466 161840 395122 421376 99762 -190337 117388 430504 412881 233524 220867
731 220867 12065 139135 247690 602073 604576 309254 159825 282348 374711 269586
721 269586 365545 271744 98457 84556 317386 431992 278782 208046 173713 31659 8843
710 8843 351201 582132 244607 126546 190774 244129 302645 505312 467807 355505 119192
699 119192 -20569 127067 422937 320059 234733 309721 197802 -130013 176611 600215
689 600215 392133 -68814 270095 339568 109881 407489 561880 286487 112493 212628
679 212628 327860 254699 361561 307327 141264 190421 83636 73960 495268 360138 124080
668 124080 300969 437681 333905 282131 349137 288537 -93258 -5802 492697 473461 307616
657 307616 363183 170066 -113922 123550 711733 794159 493042 375615 343085 -34498
647 -34498 91671 263196 418383 519006 313625 -168243 -26694 77729 132148 420755
637 420755 763667 351916 -163035 155706 414851 213764 385145 501132 136102 -169934
627 -169934 128802 292465 142591 141118 174766 -83934 -65137 23529 66599 191917 247057
616 247057 -87901 41517 103257 148409 43429 234471 251828 -95854 -49101 338801 92406
605 92406 -231314 -13398 170330 -30604 123670 375028 213499 32570 -14162 83149
595 83149 183570 336940 296516 186937 1384 -47244 50020 127082 222172 107448 -23692
584 -23692 99620 -23124 51845 167873 172263 -159319 -193502 -102799 100837 13965 43108
573 43108 52543 -73899 -15133 299266 234338 207969 196732 99315 -8632 123088 182346
562 182346 -41173 -300263 -62056 25786 -3788 39824 -1306 -104487 -68516 67820 274783
551 274783 131834 38055 157580 154742 121197 105081 -82165 107745 87689 -96789 -99676
540 -99676 100448 158020 -91836 -47682 243929 66056 -102877 101434 -121027 -339273
530 -339273 3637 194947 176007 -168443 -160396 -87426 -76972 65403 59859 -170183 -232958
519 -232958 -313655 -242423 146277 40960 -241325 -150975 -98810 -274310 -312282 58947 -73725
508 -73725 -422445 -364943 -25287 -95442 25210 60721 -264247 -470227 -265236 -49549 2685
497 2685 71189 -46525 -131467 -2957 -85278 19867 89929 58663 -127466 -14298 -33258
486 -33258 -73674 -20665 73412 232262 126573 -49224 -22224 60414 93798 29802 78502
475 78502 190578 -35415 -260846 -288834 -195440 -82366 108552 -54356 -278190 -170058
465 -170058 138948 99264 210252 210823 -66487 -139274 78571 -44916 83303 -21527 -162446
454 -162446 -148991 31524 -68531 -68526 -30354 84187 -95807 174109 192818 90622 -4063
443 -4063 112644 14054 242047 233583 141143 -70886 -32110 -24904 157356 373808 422934 21187
431 21187 -37918 -168472 62885 486771 602798 205127 7758 -245938 -265458 132363
421 132363 552702 432286 255544 59016 22732 7106 174127 247073 30202 8246 -156399
410 -156399 -105322 90505 174998 29700 -129171 -98325 215501 170550 347245 638817 373845
399 373845 -45565 30842 131906 446268 503080 396851 114447 -116200 11482 135507
389 135507 195034 487367 194990 -66035 10579 120270 -120256 155768 181662 108713 -46602
378 -46602 302612 350501 211670 169292 97561 -88953 160115 338973 71076 214608 320977
367 320977 615 28025 213236 360235 101010 193478 367108 9535 61553 335895
357 335895 69941 118279 158576 14512 -52619 334289 434022 47495 70092 270045 47615
346 47615 186626 432042 293198 51497 102603 155530 138333 164177 168655 97910 134623
335 134623 335907 203629 91405 290383 171318 -109917 5881 351993 392653 258727
325 258727 136112 -14245 -4049 298546 384048 224042 181994 111994 -70636 -79279 419784
314 419784 385587 -8879 84726 114198 -92352 189279 456898 49358 -48848 74471 208986
303 208986 121468 288512 306159 100677 153227 181217 -44608 202996 390941 -61009 25786
292 25786 226583 164627 112290 107876 -113210 -135536 139069 303608 61088 47041 24808
281 24808 -157535 115368 506614 122556 -33532 -31666 -74126 -35676 276147 407402 363809
270 363809 -158291 -347577 -268851 279901 464545 187533 93000 -38974 -440398 -215020
260 -215020 122089 275769 77836 -99674 -175993 -97662 -13048 63967 -81038 9610 -36728
249 -36728 -133037 -53804 -56596 -251753 -47565 -31498 51104 133297 39735 -149347 -164065 -70450
237 -70450 121622 98926 74221 32 -240261 -166290 -37367 20817 7510 -51294 -86913
226 -86913 8955 -76223 -76052 -144608 -69933 -169338 -359126 -43031 87976 -45248 -87013 -68566
214 -68566 65459 -37444 9993 -19562 49334 -247757 -168776 26215 98680 -171843 -182655
203 -182655 -109002 -166640 -225792 64404 18045 -16373 -224742 -383603 -259892 53263 432
192 432 58412 -20257 -215563 -393564 -100582 293254 194948 -46265 -146923 -459753 -449718
181 -449718 -50605 -40876 -185953 -240920 -252943 -480938 -397079 -59342 -139087 -189482 -207151
170 -207151 -303163 -281918 -57156 -63432 -102521 -285024 -444263 -261931 -107127 -96587 -321295
159 -321295 -352329 -343465 -203829 -219929 -128721 -119575 -283173 -456344 -194488 3592 -104425
148 -104425 -285206 -199020 -301589 -403331 -133794 -55883 -129846 -267388 -447666 -519617 -226053
137 -226053 76810 -83633 -292807 -316525 -479633 -405385 27005 -5448 -177399 -242769 -272099
126 -272099 -306042 -135260 5460 -350775 -346853 -156546 -189940 -162468 82503 -72392 -288959
115 -288959 -324577 -316652 -316264 -125938 -158192 -145645 -99101 -191926 -302851 -267045 -85531 -256187
103 -256187 -384337 -148266 -30741 -288363 -199282 -113180 -284813 -340220 -158792 -107962 -106544
92 -106544 -252580 -306030 -268603 -46681 -155796 -283535 -257128 -358495 -455243 -318370 -28630
81 -28630 -160859 -369841 -320899 -433122 -450257 -57442 82756 -81425 -235000 -391619 -341710
70 -341710 -205297 5160 114154 20956 -261243 -425415 -410346 -109664 86023 11432 -60120
59 -60120 -254206 -443500 -242739 8967 76691 -219216 -177693 -127852 -216499 -229502 -104339
48 -104339 -122123 -331461 -506272 -226466 -41463 -202036 -448998 -430474 -296922 -294760 -339115
37 -339115 -188174 -137654 -197079 -225673 -157497 -322840 -364308 -329118 -314826 -251520 -226891 -294088
25 -294088 -288350 -180260 -293541 -396204 -227557 -226603 -334448 -261069 -274463 -388672 -347958
14 -347958 -282244 -411231 -417497 -354260 -338454 -439502 -170088 -333420 -528138 -443088 -280948
3 -280948 -456994 -395788 -390201
0 -390201
$$ Imaginary data points
##PAGE= N=2
##DATA TABLE= (X++(I..I)), XYDATA
16383 -1902363 -1813442 -1887101 -1819170 -1798288 -1848708 -1958396 -1798572 -1699129 -1892587 -1807222 -1601316
16372 -1601316 -1601596 -1534740 -1458094 -1666064 -1724058 -1624990 -1498662 -1378527 -1356914 -1351756 -1377862
16361 -1377862 -1418336 -1317220 -1304211 -1161151 -1096727 -1135592 -1010273 -960251 -1137943 -1115136
16351 -1115136 -1089199 -1086902 -1062740 -910030 -897772 -863198 -920777 -728392 -746039 -787264 -748824
16340 -748824 -685221 -736980 -745255 -702817 -569443 -642648 -684570 -645456 -332442 -342396 -478361
16329 -478361 -654208 -500292 -634542 -437373 -130079 -67225 -233318 -336145 -591651 -346767
16319 -346767 -16535 112536 25258 -105100 -288037 -280214 -90114 219244 187770 152453
16309 152453 11851 29095 -25828 113663 293862 296826 236733 115305 201035 378155 458018
16298 458018 429709 314116 307393 366141 329165 458881 655881 555150 288685 387110 547127
16287 547127 699085 840604 1019277 877256 623407 604797 729060 657506 858359 868608
16277 868608 666587 730683 778721 669536 906232 981739 1010019 889150 976878 891686 773080
16266 773080 1069562 1131933 658213 829357 1092619 1293046 1264721 1334852 1005020 961617
16256 961617 1068213 1237991 1283993 1484077 1361312 1054624 1044717 1328444 1167844 1506184
16246 1506184 1698244 1275119 1066755 1388172 1527316 1567860 1696731 1658934 1414522 1385855
16236 1385855 1531403 1633881 1615588 1563799 1383358 1522437 1790175 1728227 1817172 1966866
16226 1966866 1649219 1384810 1684820 1902902 1655354 1732124 2049102 1673856 1633460 1832360
16216 1832360 1797789 1719637 1919078 1858923 1831101 1849509 1913832 1922092 2083341 1973421 1780187
16205 1780187 1823839 2123585 1815113 1829982 2263375 2101665 1724645 1833145 2016995 2107140
16195 2107140 2174281 2269546 2279841 2176757 2048784 1843169 2010458 2258501 2184150 2333291
16185 2333291 2227422 2015584 1979463 2164856 2331389 2472351 2312405 2475041 2257049 1996873
16175 1996873 2024068 2237370 2382906 2411807 2370729 2298318 2253972 2104694 2261726 2432346
16165 2432346 2523449 2539119 2457092 2350626 2411564 2397636 2261252 2445305 2570393 2404390
16155 2404390 2485684 2534701 2564678 2467024 2391310 2319478 2414939 2474768 2330131 2227890 2578850
16144 2578850 2635316 2477630 2520948 2608311 2531658 2398488 2354023 2469302 2457406 2394683 2518274
16133 2518274 2663466 2726387 2539483 2214247 2353877 2412455 2564221 2743873 2746019 2605347
16123 2605347 2637470 2410672 2161632 2479092 2726483 2686610 2522812 2468757 2295840 2264128
16113 2264128 2580539 2887963 2628661 2688642 2614282 2532374 2681072 2825392 2564156 2684803
16103 2684803 2652928 2484003 2582431 2906630 3004059 2552408 2430354 2729625 2412845 2565731
16093 2565731 2955396 2763904 2547645 2540887 2255690 2586455 2646044 2480880 2326391 2439514
16083 2439514 2771102 2655453 2701020 3062847 2597990 2275534 2644341 2730480 2706218 2683002
16073 2683002 2548313 2608122 2605827 2449011 2661494 2834653 2917487 2612095 2495199 2828866
16063 2828866 2655726 2362092 2724473 2672728 2499684 2610153 2862793 2742779 2607363 2448167
16053 2448167 2551720 2743021 3094321 2759876 2403526 2629902 2619565 2476259 2834835 2836453
16043 2836453 2618879 2456861 2711144 2674153 2800185 2830533 2816741 2547785 2547768 2511891 2509233
16032 2509233 2754673 2859914 2490655 2588131 2695358 2612372 2502373 2784074 2650582 2444954
16022 2444954 2643688 2842239 2600764 2620847 2741378 2690665 2728616 2832952 2690075 2692015
16012 2692015 2829119 2702404 2465215 2558684 2602992 2434984 2541792 2641482 2635515 2639066 2573024
16001 2573024 2472854 2404734 2532097 2794310 2549521 2662976 2571103 2223751 2172969 2674608
15991 2674608 2783160 2916591 2902689 2718673 2045077 2161911 2568851 2881794 2930757 2834592
15981 2834592 2450228 2383200 2469476 2748599 3039523 2998980 2567099 2310210 2248755 2741565
15971 2741565 2624138 2670639 2855244 2584793 2236203 2455968 2485335 2541762 2632060 2756085
15961 2756085 2580139 2376603 2709265 2655291 2430417 2707946 2643757 2463936 2529025 2663706
15951 2663706 2615704 2666144 2795229 2755084 2510296 2577049 2582489 2596160 2894173 2941114 2754975
15940 2754975 2466552 2516667 2421134 2663515 2854008 2874450 2459521 2465579 2560327 2603605 2618919
15929 2618919 2844109 2791850 2757775 2525609 2672961 2824763 2709493 2629129 2622726 2457518
15919 2457518 2732092 2776888 2728170 2601479 2540802 2563056 2601078 2806366 2877435 2510239
15909 2510239 2527812 2606679 2489782 2618172 2702483 2302708 2304720 2770677 2918982 2710758
15899 2710758 2828789 2749454 2280285 2265724 2764003 2992923 2881997 2732065 2248770 2344879
15889 2344879 2620564 2704320 2684328 2789794 2641445 2478606 2543710 2964643 2881018 2721217
15879 2721217 2751487 2650573 2430743 2701595 2825237 2769434 2485070 2441889 2526896 2607101
15869 2607101 2596592 2721035 2810123 2827753 2588543 2519968 2517696 2434411 2542335 2941824 3026274
15858 3026274 2776046 2494768 2422478 2331728 2611674 2741993 2769178 2802597 2682380 2296996
15848 2296996 2691431 3181163 2937347 2761434 2802521 2457602 2491864 2796674 2803661 2703591
15838 2703591 2532239 2670928 2460437 2796817 3042159 2811416 2480443 2725538 2639794 2621242
15828 2621242 2810791 2965160 2473839 2251263 2604561 2731199 2749279 3152895 2770528 2504325
15818 2504325 2541749 2738717 2861932 3004648 2793915 2626519 2450733 2818836 2703698 2814503
15808 2814503 3085114 2936045 2418418 2707537 2774189 2529312 2531598 2549651 2624990 2745921
15798 2745921 2812823 2931275 2640294 2702254 2770680 2687726 2849138 2881753 2866491 2923019 2793641
15787 2793641 2551454 2749541 2876150 2869767 2719471 2843559 2819587 2648820 2614079 3036752
15777 3036752 2819204 2778139 2713399 2605612 2690543 2827209 2774131 2916943 2685259 2639988
15767 2639988 2469456 2742128 2810405 2752865 2870985 2900193 2519392 2523883 2914223 2970075
15757 2970075 2707046 2807673 2676832 2668911 2797374 2836094 2894557 2949438 2771114 2743889
15747 2743889 2699433 2934812 2889160 2781368 2781894 2746171 2518203 2774012 2822913 2701188 2662505
15736 2662505 2707588 2782100 2706254 2837615 2893759 2742046 2972518 2871973 2388968 2637054
15726 2637054 3066425 2926767 2734341 2914060 2696424 2559406 2673642 3060253 3004592 2820446
15716 2820446 2790545 2772189 2652528 2747990 2813670 2865113 3025754 2739877 2541633 2803448
15706 2803448 2653198 2686828 2733688 2974708 2971963 2694288 2780044 2852257 2674826 2854198
15696 2854198 2781883 2777530 2920970 2840949 2604096 2711655 2680515 2854142 2724630 2955216
15686 2955216 3173712 2888956 2706802 2805390 2775912 2848789 2726404 2771438 3011323 2748413
15676 2748413 2657769 2719232 2680878 2823601 2826210 2717922 2949654 2854559 2882248 2840226 2891915
15665 2891915 2814673 2674954 2789933 3067008 2870388 2631198 2662127 2623297 2780105 3090978
15655 3090978 3099217 2951769 2654929 2550167 2586647 2902662 3141767 3013554 2715668 2697920
15645 2697920 2497057 2636391 2911101 3174027 3090615 2678102 2476997 2474244 2798041 3291504
15635 3291504 3362960 3128895 2874288 2498596 2441657 2761965 3155693 3137364 2785897 2614872
15625 2614872 2569002 2425769 2852155 3252297 3037789 2801065 2881245 2863823 2864854 2945542
15615 2945542 2966944 2823744 2808936 2757375 2769262 2930490 3144599 2675331 2597626 2911238
15605 2911238 2862389 2723958 2958368 2931544 2562009 2419594 2804142 2862997 2936564 3107076
15595 3107076 2963521 2806365 2953137 3034849 2895772 2921901 2848049 2605920 2778039 2884525
15585 2884525 2772539 2877986 2971574 2670241 2504029 2930853 2994704 2722018 2786709 2853287
15575 2853287 2660779 2795494 3265809 3173832 2762728 2610376 2663231 2656116 2862643 3119795
15565 3119795 3087985 2887146 2426059 2526978 3032172 3265677 2831334 2670728 2783788 2629048
15555 2629048 2466165 3096028 3311901 2978801 2596782 2668016 2787091 2830338 3159536 3112555
15545 3112555 2738914 2664780 2600544 2655051 2886399 2938564 2891437 3006751 2903724 2864019
15535 2864019 2914518 3067740 2976044 2736704 2864175 3021453 2778264 2698344 2743091 2701868
15525 2701868 2859197 3065996 3106241 2784783 2661136 2881161 2989819 2948216 3032510 3019589
15515 3019589 2707742 2575635 2693945 2991293 3141487 3029646 2843790 2826287 2999007 2964756
15505 2964756 2948006 3099698 2852344 2743253 3001946 3050424 2829053 2839780 2855389 2840625
15495 2840625 2919935 3112153 3032170 2732839 2681621 2849484 2866717 3062355 3088767 2747377
15485 2747377 2752568 2722306 2799853 3016545 2982679 2660362 2554506 2843578 3044765 2775930
15475 2775930 2853043 2814284 2477189 2602524 3142061 3364061 2859252 2610281 2615467 2558473
15465 2558473 2655420 2973455 3199093 2856478 2534545 2507405 2818462 3171704 2983598 2728515
15455 2728515 2835621 2862944 2698604 2777585 3274783 2833939 2642330 2832499 3121062 3033964
15445 3033964 3012173 3001013 2855371 2541586 2786056 3162047 3360640 3167874 2680671 2579347
15435 2579347 2938046 2842333 2835279 3017119 2903882 2726154 2595658 2772393 3141250 2954158
15425 2954158 2762016 2869103 2751762 2588926 2778063 3093682 3146259 2886694 2801109 2738151
15415 2738151 2581692 2738822 2700023 2917420 3110621 2839656 2406378 2669385 2800238 2786747
15405 2786747 2986549 3244356 2879479 2537033 2686885 2875277 2834450 3195221 3116043 2767542
15395 2767542 2558353 2715202 2764736 3123884 3198088 2976104 2795091 2855004 2772353 2707375
15385 2707375 3128970 3227837 2886193 2993500 2895683 2596795 2699426 3067508 3131125 3088427
15375 3088427 3052424 2878951 2555165 2553216 2846276 3125054 3261240 3282592 3048171 2850778
15365 2850778 2582304 2525940 2970664 3082662 2860236 2931435 2939926 2588470 2694767 2979601
15355 2979601 3257594 3014929 2779418 2681585 2896395 3040071 2991678 2920897 3111402 2765184
15345 2765184 2509930 2799299 3161229 2890820 2777867 2823230 2619488 2497351 2956390 3213668
15335 3213668 3068759 2930648 2684780 2329832 2588994 2857826 2889356 2970694 2961624 2491036
15325 2491036 2479391 3133191 3066123 2791714 3101570 3002520 2574560 2834188 3374646 3291201
15315 3291201 2920552 2920752 2763574 2749721 3232988 3140163 2915976 2954885 2806833 2587034
15305 2587034 2725204 2899836 2834609 3011529 3268134 3213391 2847057 2866414 2716756 2566625
15295 2566625 2765216 2938285 2931493 3135912 2973215 2603082 2414488 2771326 3027246 3165597
15285 3165597 3082050 2978276 2545995 2615297 2756176 2885268 2939746 2971595 2815729 2848300
15275 2848300 2969247 2906470 2973446 3046889 2927917 2744824 2782416 2865726 2766541 2955246
15265 2955246 2929440 2707320 2807836 2846839 3082975 3147430 2978888 2735444 2522127 2590367
15255 2590367 3000618 3111630 3363407 3203166 2787439 2765293 3025100 3038580 3158585 3176974
15245 3176974 2849464 2611241 2892435 3034697 2910312 2888073 2870421 2491803 2607885 2862365
15235 2862365 3111150 3121589 2784687 2533738 2727603 2908082 3195327 3122996 2864607 2610874
15225 2610874 2378535 2661813 3139489 3145364 2821756 2632759 2592327 2817079 2961903 3121142
15215 3121142 3229241 2690908 2399907 2577710 2802536 3014200 2983462 2670654 2600964 2697325
15205 2697325 2723045 3014021 3132163 3148922 2608087 2454524 2903747 2938631 2751512 2920501
15195 2920501 2986385 2859101 2817310 2875378 2763050 2794512 2867972 2941487 2890011 3209065 2756586
15184 2756586 2372110 2831635 3010011 2851553 3068426 3197870 2834640 2528191 2727540
15175 2727540 2776379 2847910 3004683 3119253 2833319 2617644 2505949 2584602 2780503 3062712
15165 3062712 3020037 2845173 2856820 2604923 2531610 2664582 2941157 2992424 2947956 2833615
15155 2833615 2552290 2386667 2620830 2857706 2850336 2791382 2758015 2581793 2435596 2700065
15145 2700065 3082081 2848902 2726667 2880757 2876536 2662773 2946441 3027148 3003871 2898093
15135 2898093 2778503 2671137 2823486 2953987 2966209 2856142 2800590 2519487 2459218 2989884
15125 2989884 3085501 2786450 2910114 2859819 2720009 2838730 2926236 2939019 2850513 2831323
15115 2831323 2732289 2734696 3080363 3028876 2710629 2816562 2876093 2652649 2718773 2984114
15105 2984114 2960360 2828584 2763621 2663287 2694084 3058717 3090362 2947527 3123580 2860544
15095 2860544 2430039 2823137 3156199 2755230 2682950 2841973 2689343 2464568 2818702 3140214
15085 3140214 3075111 2813479 2546295 2480972 2785937 2839708 2617254 3009583 3142019 2621600
15075 2621600 2485501 2898644 2961581 2892614 3196073 3340046 2874386 2588866 2595123 2587801
15065 2587801 2774181 2926125 2860986 2775710 2658671 2604980 2742137 3123858 3224684 2758379
15055 2758379 2595930 2737178 2644585 2678959 3057950 3104481 2854003 2622593 2498944 2539590
15045 2539590 2925259 3309408 3019649 2761850 2718688 2522494 2343266 3022780 3414290 3129439
15035 3129439 2804399 2949232 2825726 2843857 2927601 3104018 2938242 2698582 2487811 2642815
15025 2642815 3070520 3067327 2896282 2934764 2869645 2553690 2571987 2981800 3223456 2936711
15015 2936711 2857288 2889499 2588368 2778366 3184718 3392788 3166900 2911026 2661448 2682600
15005 2682600 2917081 3153905 3046522 2946773 3121730 2779442 2711718 2957067 3169317 2969586
14995 2969586 2817855 2820959 2712045 2732861 2898946 2906685 2837975 2930913 2855498 2879026 3213714
14984 3213714 3146825 3045623 3011407 3169291 2898204 2908699 3206687 3270107 2976976 2973520
14974 2973520 3039606 3168835 2940065 2831120 2820312 2853892 3137596 3080837 3086285 3283091
14964 3283091 2959795 2803716 3262502 3335238 3073205 3087948 3065695 2818873 2840438 3132254
14954 3132254 3121050 3111365 3100899 2943404 2900379 3242365 3190960 2887532 3097430 2999011 2691129
14943 2691129 2896853 3284506 3266003 3008555 2911052 2876139 2707448 3029499 3186714 3006838
14933 3006838 3116470 2948964 2636249 2858025 3174332 3263009 3095647 3044428 3023133 3020833
14923 3020833 2943006 3120822 3135724 3163676 3019927 2926603 3029970 3060258 3079960 3201149
14913 3201149 3268001 3269764 3087650 2996328 3039851 3139261 3092314 3004589 3249271 3115751 2951456
14902 2951456 3083568 3216319 3014542 3091358 3044425 2956108 3015522 3159488 3065857 3021407
14892 3021407 3081109 2873908 2731685 3132399 3408365 3074035 2981757 3128242 2944712 2965109
14882 2965109 3125273 3076587 2848165 2801608 3066966 3291756 3290896 3153076 2759758 2839185
14872 2839185 3145490 3078928 3036596 3333918 3151795 2728722 2893917 3450302 3249463 3057029
14862 3057029 3200449 2999199 2843370 3027544 3269414 3386255 3230886 2880847 2976765 3263862
14852 3263862 3298070 3133129 3031635 2896762 3018339 2992740 3458202 3658090 3274128 2979323
14842 2979323 3096899 2902442 3005198 3206438 3421824 3178304 3090582 3050674 3027904 2918126
14832 2918126 2976285 3124721 3218983 3216081 3087450 2991915 2803168 2842788 3186087 3270318 3304755
14821 3304755 3195371 2911673 2844913 2765162 2869183 3171554 3260125 3067440 2831554 2884085
14811 2884085 3208667 3157806 3065372 3357028 3076571 2866902 3234636 3445730 3019214 3015543
14801 3015543 3216464 3227361 3127251 3153942 3142618 2825731 2889693 3134353 3344520 3316854
14791 3316854 2974687 2575204 2833264 3051921 3137268 3299785 3418300 2861733 2535912 2842060
14781 2842060 3360337 3249666 3233966 3276864 3035426 2928683 3236908 3091553 3172246 3121502
14771 3121502 2992730 2848848 3226430 3214869 3036875 2928135 2954724 2874686 2921351 3167364
14761 3167364 3047644 2857681 2937270 2907694 2773630 3105250 3177536 2801317 2526752 2806482
14751 2806482 2997124 3043875 3128864 3171273 2878838 2749223 2867012 3064505 3114139 2986924
14741 2986924 2920759 3049540 3051099 2971094 3050298 3319676 3171401 2725728 2712758 3014320
14731 3014320 3027205 2840861 3013318 3179592 3034763 2900200 2925251 3114127 3073960 2963465
14721 2963465 2621544 2626676 3084031 3136168 3203323 3418169 3014923 2560724 2650171 3134764
14711 3134764 3273246 3308752 3301754 2878035 2369935 2608470 3157785 3326392 3374048 3011317
14701 3011317 2789055 2835833 2884490 2944503 3036205 3201274 3070486 2824258 3036712 3425558
14691 3425558 3215728 2984173 2972688 2945046 3091831 3271421 3530534 3200437 2878578 2719570
$$ [...]
##END NTUPLES=NMR SPECTRUM
##END=
