##TITLE=1H_DE-80H_X3
 200.13MHz, d2o
 8 sc
 
 19ns.26.2.2025
##JCAMPDX= 6.0         $$ Bruker NMR JCAMP-DX V2.0
##DATA TYPE= NMR SPECTRUM
##DATA CLASS= NTUPLES
##ORIGIN= UXNMR, Bruker Analytische Messtechnik GmbH
##OWNER= pz
$$ XWIN-NMR		Version 3.5
$$ Thu Dec 11 12:17:58 2025 Russian Standard Time (UT+4h)  Yarkov@DPX200
##.OBSERVE FREQUENCY= 200.1313
##.OBSERVE NUCLEUS= ^1H
##.ACQUISITION MODE= SIMULTANEOUS
##.ACQUISITION SCHEME= undefined
##.AVERAGES= 8
##.DIGITISER RES= 18
##SPECTROMETER/DATA SYSTEM= spect
##.PULSE SEQUENCE= zg30
##.SOLVENT NAME= CDCl3
##.SHIFT REFERENCE= (INTERNAL, CDCl3, 0, 15.4494)
##AUDIT TRAIL= $$ (NUMBER, WHEN, WHO, WHERE, WHAT)
$$ ##TITLE= Audit trail, XWIN-NMR		Version 3.5
$$ ##JCAMPDX= 5.01
$$ ##ORIGIN= Bruker BioSpin GmbH
$$ ##OWNER= Yarkov
$$ C:/Bruker/XWIN-NMR/data/yarkov2/nmr/H-C/1/pdata/1/auditp.txt
$$ ##AUDIT TRAIL=  $$ (NUMBER, WHEN, WHO, WHERE, WHAT)
(   1,<2025-12-11 12:17:08.06 +0400>,<Yarkov>,<DPX200>,
      <created by zg, POWCHK disabled, PULCHK disabled
       configuration hash MD5:
       00 E9 B6 7A A2 85 ED C7 34 08 36 98 17 FE 4E 26
       data hash MD5: 16K
       E6 3F AE 07 93 D6 45 1B 68 F0 78 CB F1 05 C0 86>)
(   2,<2025-12-11 12:17:12.29 +0400>,<Yarkov>,<DPX200>,
      <Start of raw data processing
       efp BC_mod = 2 LB = 0.25 FT_mod = 6 PKNL = 1 PHC0 = -5310.083 PHC1 = 17.82193 SI = 16K 
       data hash MD5: 16K
       FD 31 CD DB 9A 8F 05 29 B2 01 7A A1 78 56 A9 50>)
$$ ##END=
$$ 
$$ hash MD5
$$ 67 B1 35 92 19 14 89 29 7F 8F CC 55 20 E8 53 B3
##$RELAX= 
##$RELAX= 
##$RELAX= 
##$RELAX= 
##$RELAX= 
##$RELAX= 
$$ Bruker specific parameters
$$ --------------------------
##$DU= <C:/Bruker/XWIN-NMR>
##$EXPNO= 1
##$NAME= <H-C>
##$PROCNO= 1
##$TYPE= <nmr>
##$USER= <yarkov2>
##$AMP= (0..31)
100 100 100 100 100 100 100 100 100 100 100 100 100 100 100 100 100 100 
100 100 100 100 100 100 100 100 100 100 100 100 100 100 
##$AQSEQ= 0
##$AQ_mod= 1
##$AUNM= <au_zg>
##$AUTOPOS= <>
##$BF1= 200.13
##$BF2= 200.13
##$BF3= 200.13
##$BF4= 200.13
##$BF5= 200.13
##$BF6= 200.13
##$BF7= 200.13
##$BF8= 200.13
##$BYTORDA= 1
##$CFDGTYP= 0
##$CFRGTYP= 5
##$CHEMSTR= <none>
##$CNST= (0..31)
1 1 145 1 1 1 1 1 1 1 1 1 1 1 1 1 1 1 1 1 1 1 1 1 1 1 1 1 1 1 1 1 
##$CPDPRG= <>
##$CPDPRG1= <>
##$CPDPRG2= <>
##$CPDPRG3= <>
##$CPDPRG4= <mlev>
##$CPDPRG5= <mlev>
##$CPDPRG6= <mlev>
##$CPDPRG7= <mlev>
##$CPDPRG8= <mlev>
##$CPDPRGB= <>
##$CPDPRGT= <>
##$D= (0..31)
0 0.7 0 0 0 0 0 0 0 0 0 0.03 0 0 0 0 0 0 0 0 0 0 0 0 0 0 0 0 0 0 0 0 
##$DATE= 1765441027
##$DBL= (0..7)
120 120 120 120 120 120 120 120 
##$DBP= (0..7)
150 150 150 150 150 150 150 150 
##$DBP07= 0
##$DBPNAM0= <>
##$DBPNAM1= <>
##$DBPNAM2= <>
##$DBPNAM3= <>
##$DBPNAM4= <>
##$DBPNAM5= <>
##$DBPNAM6= <>
##$DBPNAM7= <>
##$DBPOAL= (0..7)
0.5 0.5 0.5 0.5 0.5 0.5 0.5 0.5 
##$DBPOFFS= (0..7)
0 0 0 0 0 0 0 0 
##$DE= 6
##$DECBNUC= <off>
##$DECIM= 32
##$DECNUC= <off>
##$DECSTAT= 4
##$DIGMOD= 1
##$DIGTYP= 9
##$DL= (0..7)
0 120 120 120 120 120 120 120 
##$DP= (0..7)
$$ [...]
##$SUBNAM2= <"">
##$SUBNAM3= <"">
##$SUBNAM4= <"">
##$SUBNAM5= <"">
##$SUBNAM6= <"">
##$SUBNAM7= <"">
##$SUBNAM8= <"">
##$SUBNAM9= <"">
##$SW= 18.0517328524113
##$SWIBOX= (0..15)
0 0 2 0 0 0 0 0 0 0 0 0 0 0 0 0 
##$SW_h= 3612.71676300578
##$TD= 16384
##$TD0= 1
##$TE= 0
##$TE2= 300
##$TE3= 300
##$TEG= 300
##$TL= (0..7)
0 120 120 120 120 120 120 120 
##$TP= (0..7)
150 150 150 150 150 150 150 150 
##$TP07= 0
##$TPNAME0= <>
##$TPNAME1= <>
##$TPNAME2= <>
##$TPNAME3= <>
##$TPNAME4= <>
##$TPNAME5= <>
##$TPNAME6= <>
##$TPNAME7= <>
##$TPOAL= (0..7)
0.5 0.5 0.5 0.5 0.5 0.5 0.5 0.5 
##$TPOFFS= (0..7)
0 0 0 0 0 0 0 0 
##$TUNHIN= 0
##$TUNHOUT= 0
##$TUNXOUT= 0
##$USERA1= <user>
##$USERA2= <user>
##$USERA3= <user>
##$USERA4= <user>
##$USERA5= <user>
##$V9= 5
##$VALIST= <valist>
##$VCLIST= <CCCCCCCCCCCCCCC>
##$VD= 0
##$VDLIST= <DDDDDDDDDDDDDDD>
##$VPLIST= <PPPPPPPPPPPPPPP>
##$VTLIST= <TTTTTTTTTTTTTTT>
##$WBST= 1024
##$WBSW= 4
##$XGAIN= (0..3)
0 0 0 0 
##$XL= 0
##$YL= 0
##$YMAX_a= 1054910
##$YMIN_a= -1002270
##$ZGOPTNS= <>
##$ZL1= 120
##$ZL2= 120
##$ZL3= 120
##$ZL4= 120
##$ABSF1= 0
##$ABSF2= 0
##$ABSG= 0
##$ABSL= 0
##$ALPHA= 0
##$AQORDER= 0
##$ASSFAC= 0
##$ASSFACI= 0
##$ASSFACX= 0
##$ASSWID= 0
##$AUNMP= <proc_1d>
##$AZFE= 0.1
##$AZFW= 0.1
##$BCFW= 0
##$BC_mod= 2
##$BYTORDP= 0
##$COROFFS= 0
##$CY= -3
##$DATMOD= 1
##$DC= 0
##$DFILT= <>
##$DTYPP= 0
##$F1P= 0
##$F2P= 0
##$FCOR= 1
##$FTSIZE= 16384
##$FT_mod= 6
##$GAMMA= 0
##$GB= 0
##$INTBC= 1
##$INTSCL= 3.241238e-09
##$ISEN= 128
##$LB= 0.25
##$LEV0= 0
##$LPBIN= 0
##$MAXI= 10000
##$MC2= 0
##$MEAN= 0
##$ME_mod= 0
##$MI= 1.114404
##$NCOEF= 0
##$NC_proc= -5
##$NLEV= 6
##$NOISF1= 3.799351
##$NOISF2= 2.8
##$NSP= 0
##$NTH_PI= 0
##$NZP= 0
##$OFFSET= 15.4494
##$PC= 1
##$PHC0= -5310.083
##$PHC1= 17.82193
##$PH_mod= 1
##$PKNL= yes
##$PPARMOD= 0
##$PSCAL= 0
##$PSIGN= 0
##$REVERSE= no
##$SF= 200.130014470054
##$SI= 16384
##$SIGF1= 3
##$SIGF2= 2
##$SINO= 0.751879
##$SIOLD= 32768
##$SREGLST= <19F.Aceton>
##$SSB= 0
##$STSI= 16384
##$STSR= 0
##$SW_p= 3612.71676300578
##$SYMM= 0
##$S_DEV= 0
##$TDeff= 16384
##$TDoff= 0
##$TI= <>
##$TILT= no
##$TM1= 0
##$TM2= 0
##$TOPLEV= 0
##$USERP1= <user>
##$USERP2= <user>
##$USERP3= <user>
##$USERP4= <user>
##$USERP5= <user>
##$WDW= 1
##$XDIM= 16384
##$YMAX_p= 442284834
##$YMIN_p= -2803724
$$ End of Bruker specific parameters
$$ ---------------------------------
##NTUPLES= NMR SPECTRUM
##VAR_NAME=  FREQUENCY,     SPECTRUM/REAL,   SPECTRUM/IMAG
##SYMBOL=    X,             R,               I
##VAR_TYPE=  INDEPENDENT,   DEPENDENT,       DEPENDENT
##VAR_FORM=  AFFN,          ASDF,            ASDF
##VAR_DIM=   16384,         16384,           16384
##UNITS=     HZ,            ARBITRARY UNITS, ARBITRARY UNITS
##FACTOR=    0.220516191357247, 1,           1
##FIRST=     3091.88863517093, 0,            0
##LAST=      -520.82812783485, 0,            0
##MIN=       -520.82812783485, -2803724,     0
##MAX=       3091.88863517093, 442284834,    0
$$ Real data points
##PAGE= N=1
##DATA TABLE= (X++(R..R)), XYDATA
$$ [...]
5670D596657P7719K17545J00595J04511J43100J46372J87112K71328J80511K81700
5660F307150L06554L49662M17123M19728L10129N83595O18441N43402O93794Q19692
5650A1369270Q02052R24325R59547R34296J034031J076436J097323P89860P70581
5641A9757721P09720M26048L49679L625l27338l43426n06071p49696p01551p69094
5631A7849617p48914o54888o65462p00525o84079n56743o02239n14668l63575
5622A2358524m28419n68130k24629k70054n5673J4517n052J02471L57294J73261
5612A1454110K98255M98532M14897N81923O94510P01619Q32375R02798J011404
5603A7390423J088886J421048J505718J864431K107833K446226K481737K620619
$$ y = [4596657, 4674376, 4891921, 4992516, 5097027, 5240127, 5386499, 5573611, 5844939, 6025450, 6307150, 6613704, 6963366, 7380489, 7800217, 8110346, 8693941, 9312382, 9855784, 10549578, 11369270, 12171322, 13095647, 14055194, 14989490, 16023521, 17099957, 18197280, 18987140, 19757721, 20467441, 20893489, 21243168, 21246793, 20919455, 20576029, 20069958, 19320262, 18618711, 17849617, 17100703, 16445815, 15780353, 15079828, 14395749, 13839006, 13236767, 12722099, 12358524, 11930105, 11361975, 11137346, 10867292, 10811619, 10826136, 10821084, 10923555, 11280849, 11454110, 11752365, 12250897, 12665794, 13247717, 13942227, 14643846, 15476221, 16379019, 17390423, 18479309, 19900357, 21406075, 23270506, 25378339, 27824565, 30306302, 32926921]
5595C2926921K817875K742215K865752K955855K950216K998917K937692K771710
5587E5967153K695233K620908K305272J982593J473560R53306K40290l86479r26702
5578F6925134j532878k057215k560076k813687l009815l395022l359066l301956
5570D4895419l242068l018990k686303k502780k101286j893091j827312j603965
5562B6019624j746215j619203j494399j421271j450153j445594j351820j089111
5554A4401858q38520q53511o51883n02859n28429l18598k84858j68019k75811
5545I979370N8239p3798n2873K9091J14660J88380K58514K94864K48147M01679
5535A1446273N97328O60575O27727O33245P16922O70930Q47676Q15235Q84716
$$ y = [32926921, 35744796, 38487011, 41352763, 44308618, 47258834, 50257751, 53195443, 55967153, 58662386, 61283294, 63588566, 65571159, 67044719, 67998025, 68238315, 67851836, 66925134, 65392256, 63335041, 60774965, 57961278, 54951463, 51556441, 48197375, 44895419, 41653351, 38634361, 35948058, 33445278, 31343992, 29450901, 27623589, 26019624, 24273409, 22654206, 21159807, 19738536, 18288383, 16842789, 15490969, 14401858, 13563338, 12709827, 12057944, 11555085, 11026656, 10708058, 10423200, 10255181, 9979370, 10037609, 9963811, 9910938, 9940029, 10054689, 10243069, 10501583, 10796447, 11044594, 11446273, 12043601, 12704176, 13331903, 13965148, 14682070, 15353000, 16200676, 17015911, 17900627]
5526A7900627R26985J094470J092615J443127J457888J420260J786689J690907
5518B8813568J650419J635125J570619J452989J147163P77799O24666K73645j25828
5509C7820165n14239p82848j187121j344976j543647j838774j800407j887502
5501B6920651j919214j815146j817323j731044j671982j469324j325474j234103
5493A3937041j086156j026793q70439p53519p35804n42547n53433n46766k99301
5484G522283m20211k88533k27651l74441j53685P42j86814r3736j75962j07579
5474E494413l7214Q8340L5556J86644R1161K02477J95588J72967L05683M16310
5464G151925M37423M30233N27460N08910P18856P00860P48145Q47524P80014P80032
$$ y = [17900627, 18827612, 19922082, 21014697, 22457824, 23915712, 25335972, 27122661, 28813568, 30463987, 32099112, 33669731, 35122720, 36269883, 37047682, 37672348, 37945993, 37820165, 37305926, 36523078, 35335957, 33990981, 32447334, 30608560, 28808153, 26920651, 25001437, 23186291, 21368968, 19637924, 17965942, 16496618, 15171144, 13937041, 12850885, 11824092, 10953653, 10200134, 9464330, 8921783, 8368350, 7821584, 7522283, 7102072, 6813539, 6585888, 6211447, 6057762, 6058504, 5871690, 5777954, 5601992, 5494413, 5457199, 5545539, 5581095, 5767739, 5858900, 6061377, 6256965, 6429932, 6735615, 7151925, 7589348, 8019581, 8547041, 9055951, 9774807, 10475667, 11223812, 12071336, 12851350, 13631382]
5454A3631382O00843N28932L06635L25303J68416j14831k53973n38897n95875
5445A4057935p45093p66512q85649q70417q68558q46126q00321p24304p44720
5436F806235o38331o46156m94566n26038m94481m05389l21749l85462j14299k96151
5426B483613l25094r6763k28467k25018j49777j13751p4979j78947o6568k08683
5416H15566k3377l3529p8237q6765q6725o6719p7929m9920o6550K234l8613l374
5404B06062r2853R509J751j04916L1579o2483j40836J5798n0661m8976J37377
5393i8649j22841j37550Q211l0736p9519J16467J1422j04577j4780J00516p4623
5382d26659n1467R6191m2169J5230l1142j02519j8337O1611k8897p0989J13889
$$ y = [13631382, 14232225, 14761157, 15067792, 15393095, 15561511, 15446680, 15192707, 14653810, 14057935, 13312842, 12546330, 11660681, 10790264, 9921706, 9075580, 8275259, 7550955, 6806235, 6167904, 5521748, 5027182, 4501144, 4006663, 3601274, 3279525, 2894063, 2779764, 2483613, 2158519, 2061756, 1833289, 1608271, 1458494, 1344743, 1269764, 1090817, 1024249, 815566, 792189, 758660, 680423, 593658, 506933, 440214, 362285, 312365, 245815, 248049, 209436, 206062, 113209, 122718, 124469, 19553, 51132, -11351, -152187, -136389, -187050, -236026, -98649, -221490, -359040, -350829, -381565, -461084, -344617, -333195, -437772, -452552, -352036, -426659, -478126, -381935, -424104, -408874, -440016, -542535, -560872, -499261, -528158, -599147, -485258]
5371d85258o0184l4417m3393J477o104L3793J16829k919Q1486k6996R8615j7387
5359c44458J31567K0657R1712Q0619l6099Q8417J43951M4367J92585J17657m228
5348E26747J22868J41058Q5172K62380L05225L86790L05523M95142O98647J061565
5338D391117J641676K307934K266515J818719J115228L16618j01796k87693n52467
5329A2915851j243928j967386k322869j926047j440007r40762q16894o28527m08721
5320A220710m10811l18408k20721k79523j81766q8028j51111j07725k0344p2576
5310f30303L4781m0698J1416p5335M369j9999q738J2286p3607q4242j8401J909
5298h86562r7370O0656j2877j22986J0337Q531p8860J23321m4896L9626Q2078
$$ y = [-485258, -545442, -579859, -623252, -621775, -627879, -594086, -477257, -480176, -398690, -425686, -327071, -344458, -212891, -192234, -100522, -19903, -56002, 32415, 176366, 220733, 413318, 530975, 526747, 649615, 790673, 875845, 1138225, 1443450, 1830240, 2135763, 2630905, 3329552, 4391117, 6032793, 8340727, 10607242, 12425961, 13541189, 13857807, 13756011, 13468318, 12915851, 11671923, 9704537, 7381668, 5455621, 4015614, 3074852, 2257958, 1629431, 1220710, 809899, 491491, 270770, -8753, -190519, -278547, -429658, -537383, -557727, -630303, -595522, -636220, -624804, -700139, -695770, -715769, -724507, -712221, -785828, -870070, -888471, -886562, -983932, -923276, -936153, -1059139, -1048802, -1040271, -1119131, -995810, -1040706, -1001080, -919002]
5287i19002J5102p9673K6148n588N4956n2604R0268L2033q0312L8068l2280n1175
5275i64059Q0782m8177m7357k8764o5142n5830K6806j0771M6488j8881q5657J0818
5263a159744p8598p2244J844J09207J3699j4322n3036J7469l7318J53568N8864
5252a060611o5024M752L7809p3197J52667R0353j28663M7421M9092q0223o4183
5241a089807L1454J4591q12k960j06692n7572q1960R9449q8803k3551O6081k0185
5229a260767l1719Q301P8575l2329Q3118k5152K2115M591M4548M5859m1517J04303
5217a000074o0469M695M2555k7754q5010N9205n4057l0250j7297o8087M9667p7919
5205a264795p3774R9107q656L2305n9763m5545K3986K1415k8938j9624M1054l2404
$$ y = [-919002, -903900, -983573, -957425, -963013, -908057, -960661, -870393, -838360, -918672, -880604, -912884, -964059, -883277, -931454, -978811, -1007575, -1072717, -1128547, -1101741, -1112512, -1066024, -1084905, -1170562, -1159744, -1238342, -1310586, -1308742, -1199535, -1185836, -1200158, -1253194, -1235725, -1273043, -1119475, -1060611, -1125635, -1120883, -1083074, -1156271, -1003604, -913251, -1041914, -994493, -945401, -1025624, -1089807, -1058353, -1043762, -1044574, -1047534, -1154226, -1211798, -1293758, -1194309, -1283112, -1306663, -1240582, -1260767, -1292486, -1284185, -1205610, -1237939, -1154821, -1179973, -1157858, -1153267, -1108719, -1062860, -1104377, -1000074, -1060543, -1055848, -1013293, -1041047, -1126057, -1066852, -1120909, -1151159, -1168456, -1236543, -1186876, -1264795, -1338569, -1239462, -1248118, -1215813, -1275576, -1321121, -1297135, -1275720, -1304658, -1324282, -1283228, -1315632]
5193a315632L2746Q102K4428L1350l7169L7425o0267k6114P7939J2813l1362Q258
5181a237483n4140j13265Q8244k6561N9193K5696N0587o2548j494n2681J6847
5170a307605O7738K9816k0967J8600J246q596L0029P4073j5623O5103m1093j5350
5158a122629K146m5600K8380J24126J0292J1807m0935n2077K173l4066L8138M980
5146a073265L520K6121L855k2762O6368j8145J1378l3952J4854O1775K6090j21908
5134a056071Q6323N1211k4156J9638M3974j50469R4581L5153n3373J044N2402
5123h99743o0198q8283P3782n6206q611N0721l6066j3784J7379N5424k3724K6593
5111i62716n8783P2752K6468o438O6555n5857P3063M678L206p8190J23149j09533
$$ y = [-1315632, -1282886, -1274784, -1250356, -1219006, -1256175, -1218750, -1279017, -1305131, -1227192, -1214379, -1245741, -1237483, -1291623, -1404888, -1316644, -1343205, -1284012, -1258316, -1207729, -1270277, -1271771, -1324452, -1307605, -1239867, -1210051, -1231018, -1212418, -1211172, -1219768, -1189739, -1115666, -1131289, -1066186, -1107279, -1122629, -1120483, -1166083, -1137703, -1013577, -1003285, -991478, -1032413, -1084490, -1082317, -1116383, -1078245, -1073265, -1069745, -1043624, -1039769, -1062531, -996163, -1014308, -1002930, -1036882, -1022028, -960253, -934163, -1056071, -969748, -918537, -942693, -923055, -879081, -1029550, -934969, -899816, -953189, -952145, -899743, -959941, -1048224, -974442, -1030648, -1039259, -988538, -1024604, -1038388, -1021009, -965585, -989309, -962716, -1021499, -948747, -922279, -928717, -862162, -918019, -844956, -840278, -837072, -915262, -792113, -901646]
5099i01646p377M2746m6255l2878k3523Q2966o985l0868N3765m4653m623k3146
5087i42477M7285L0689L6469p1161P3664N6968m2065j7998P8398O3451J3309J9642
5075f53826j077J6179K059j457p6842L7797J2680J854m2437n408q222J37500L2010
5062e49190k7355L4667n0188P3202J30749l4205k7074N3447K3289M6850M1797
5051b84011p8144Q4316J06154M819p7105j0358J5443p2558J15875P5331n0935
5040a71173P2150O9827n9736K3016j3561j0582R9906R305J8569j3781N9504K5157
5028A08601J4242J3837L4718M3746M6182q7408m321J7783J53487l9925K7925R9807
5016D28674k2334R4256K6364L5101K6267R8472l4309N1131L2359J0934j3846k4537
$$ y = [-901646, -909023, -866277, -912532, -945410, -968933, -885967, -892952, -923820, -870055, -914708, -919331, -942477, -895192, -864503, -828034, -899195, -825531, -768563, -810628, -828626, -750228, -686777, -673468, -653826, -654903, -638724, -636665, -638122, -714964, -677167, -664487, -662633, -705070, -710478, -718700, -581200, -549190, -576545, -541878, -592066, -518864, -388115, -422320, -449394, -395947, -372658, -325808, -284011, -362155, -277839, -171685, -166866, -243971, -254329, -238886, -311444, -195569, -120238, -171173, -99023, -29196, -88932, -65916, -79477, -90059, 9847, 19152, 37721, 23940, 83444, 108601, 122843, 136680, 171398, 215144, 261326, 173918, 169597, 187380, 340867, 300942, 328867, 428674, 406340, 500596, 526960, 562061, 588328, 686800, 652491, 703622, 735981, 746915, 733069, 708532]
5004G08532J51700k441M4654N7719k3434O0644K2147P0155L6195J31833k4812
4993A232892M3579J9462J24921r3208L6746J89045R497L1553O1147J07998J7580
4982A781212K0522P1715J59267Q1010l9599J64019P6517R3076J48261O6059J8819
4971B640878J61578Q9277N5850J70735R3395J78837J17966K76343K13240J80547
4961D178646J86523L23973L15519L45793M02515K93425M31234L52468L32304M13783
4951G576183M83597L46809M79750O63507N94444Q50673Q65057J207831J498561
4942A4566412J860060K568683L761383N170290N666609N787020N096912L303630
4934D7780999J600551O85205j98748j374811k644807m087702n065132n207033
$$ y = [708532, 860232, 857791, 902445, 960164, 936730, 997374, 1019521, 1089676, 1125871, 1257704, 1232892, 1276471, 1295933, 1420854, 1327646, 1364392, 1553437, 1562934, 1594487, 1655634, 1763632, 1781212, 1801734, 1873449, 2032716, 2113726, 2074127, 2238146, 2314663, 2407739, 2556000, 2622059, 2640878, 2802456, 2891733, 2947583, 3118318, 3211713, 3390550, 3508516, 3784859, 3998099, 4178646, 4365169, 4689142, 5004661, 5350454, 5752969, 6046394, 6477628, 6830096, 7162400, 7576183, 8059780, 8406589, 8886339, 9549846, 10144290, 10994963, 11860020, 13067851, 14566412, 16426472, 18995155, 22756538, 27926828, 33593437, 39380457, 44477369, 47780999, 49381550, 50066755, 49868007, 48493196, 45848389, 41760687, 36695555, 31488522]
4926C1488522m375174l159349k192771j500328r65369o55361k48515j14374J10035
4917A8387316M83076Q29216J215975K106259K885237M326848N262034N218756
4909D0714717N193179M438025K727043J343558L08072j596827l015719l923396
4901D6188652m690461n064367n119964m247087l145332k399311j780701j437684
4893A8303745j172409q76717o50157p15969m14440m32091k02966j55123M0315
4884A3724188l8074M9925J22610K12266J67762J12303Q5883J76842K05924j5125
4874A4804504J25147M4251N0962Q3370J12622J5813J81375N5971p5232J63607
4864A5562390Q0685R7010Q7295J08466J04572L5170Q1288J16550P2566p7223J55163
$$ y = [31488522, 27113348, 23953999, 21761228, 20260900, 19295531, 18640170, 18391655, 18277281, 18387316, 18870392, 19699608, 20915583, 23021842, 25907079, 30233927, 35495961, 40714717, 45907896, 50345921, 53072964, 54416522, 54724594, 53127767, 50112048, 46188652, 41498191, 36433824, 31313860, 27066773, 23921441, 21522130, 19741429, 18303745, 17131336, 16254619, 15604462, 14888493, 14474053, 14041962, 13838996, 13683873, 13724188, 13686114, 13736039, 13858649, 14070915, 14238677, 14350980, 14436863, 14613705, 14819629, 14804504, 14929651, 14973902, 15024864, 15108234, 15220856, 15236669, 15418044, 15474015, 15398783, 15562390, 15643075, 15740085, 15827380, 15935846, 16040418, 16075588, 16156876, 16273426, 16345992, 16268769, 16423932]
4853A6423932K8806K24032P3040J36654J47795K63140K07473L02792N83537K66906
4843A8658107M26300M91943N49422O17166N32718O56910O39777N16431L81196
4834B3469970M03922J95468J63461Q6519R5971o1283k87738k72257l13670k95909
4824B3184454m66461m30519m46473m35930m66596l70545n41898l65939l95635
4815A9264458m69034m33891k65296l26864l28100j47168j07213j7421o1056m4044
4805A7064371K4181n6634L915Q2194N8324j04431q5112q2769L7606j08851k06869
4794A6625925j62424j58140j70220k16728j07135r9486m9586l5827J73744J30066
4784A5930189r3168J13664K90463J97637K17835J74476K06166K81222J67285J43242
$$ y = [16423932, 16452738, 16676770, 16749810, 16886464, 17034259, 17297399, 17504872, 17807664, 18391201, 18658107, 19084407, 19576350, 20125772, 20742938, 21275656, 21932566, 22572343, 23088774, 23469970, 23873892, 24069360, 24232821, 24319340, 24415311, 24354028, 24066290, 23794033, 23480363, 23184454, 22717993, 22287474, 21841001, 21405071, 20938475, 20567930, 20026032, 19660093, 19264458, 18795424, 18361533, 18096237, 17769373, 17441273, 17294105, 17186892, 17169471, 17108415, 17064371, 17088552, 17031918, 17035833, 17118027, 17176351, 17071920, 16986808, 16904039, 16941645, 16832794, 16625925, 16463501, 16305361, 16135141, 15918413, 15811278, 15711792, 15662206, 15626379, 15800123, 15930189, 15837021, 15950685, 16241148, 16438785, 16656620, 16831096, 17037262, 17318484, 17485769, 17629011]
4774A7629011K22942K92228J74432J50424L24683L43616L75495M24953N14124
4765B0451908N11828O56443N81477Q17525P93525P49799P99000R72945J087313
4756B7421763R38920J109810J075243J152781J032806R26941Q57357O87413N11423
4747C5714457K94718K62637J6845j52756j09997k9789J588m5617K14644K18466
4737C6385196N00153N95017O07480Q44034Q48085P69314P69589P17134M66233
4728D2502235N02971J34789j4235j44988l88555n66808p50939q50517r10436r56007
4718C8557510p94147q06700p11985o64855n05644m01984l72160k86588k07924
4709C3805523j94471l04780j26467j19131j45328j28797j19828r0020k06841j94216
$$ y = [17629011, 17851953, 18144181, 18318613, 18469037, 18793720, 19137336, 19512831, 19937784, 20451908, 20963736, 21620179, 22201656, 23019181, 23812706, 24562505, 25361505, 26334450, 27421763, 28360683, 29470493, 30545736, 31698517, 32731323, 33658264, 34515621, 35203034, 35714457, 36009175, 36271812, 36288657, 36135901, 36025904, 35996115, 35997703, 35952086, 36166730, 36385196, 36885349, 37480366, 38087846, 38931880, 39779965, 40549279, 41318868, 42036002, 42502235, 43005206, 43139995, 43125760, 42980772, 42592217, 42025409, 41274470, 40423953, 39513517, 38557510, 37763363, 36956663, 36244678, 35579823, 35074179, 34672195, 34300035, 34013447, 33805523, 33611052, 33306272, 33179805, 33060674, 32915346, 32786549, 32666721, 32576701, 32369860, 32175644]
4699C2175644j26109p5764j18949J11845J51125J4023K59715K64565M65984M48220
4689C3570299L53454L76182N98546N70412N42921O53886P80212Q25367Q18258
4680C9089537R33765J028260J037297J063464J180144J147341J144168J239183
4672D7863159J208376J352658J301457J402224J557552J696790J830057J981876
4664F0194149K144815K458589K644118K755970L007686L157501L370901L255322
4656H2989051L220163L216018L018692K738740K601491K108433J648887J205477
4648A02746952O72035L42201j34349p43549j017995j337363j599622j881294k036930
4639I5010086k042434k134436k232930k155672k109187k072013j946713j836051
$$ y = [32175644, 32049535, 31973771, 31854822, 31966667, 32117792, 32131815, 32391530, 32656095, 33122079, 33570299, 33923753, 34299935, 34898481, 35468893, 36011814, 36665700, 37445912, 38271279, 39089537, 40023302, 41051562, 42088859, 43152323, 44332467, 45479808, 46623976, 47863159, 49071535, 50424193, 51725650, 53127874, 54685426, 56382216, 58212273, 60194149, 62338964, 64797553, 67441671, 70197641, 73205327, 76362828, 79733729, 82989051, 86209214, 89425232, 92443924, 95182664, 97784155, 99892588, 101541475, 102746952, 103418987, 103761188, 103626839, 102883290, 101865295, 100527932, 98928310, 97047016, 95010086, 92967652, 90833216, 88600286, 86444614, 84335427, 82263414, 80316701, 78480650]
4631G8480650j506685j407370j248183r74756p59518n50360m10291j82156n6920
4622G1384411Q1309N0656M2651J19524j77085k44206m89175n25469p16487r01158
4612F8624971j107476j045973j304331j377305j051312j110668j029742q93545
4604E9704619p37274n59299l31311j10589J31491L23782M52918O52469R49845
4595F0476651J165154J144143J381946J701901J720308J932692K109187K350470
4587G3982452K688043L039951L417099M106341M722411N451995N881523O031573
4579A09321388N468091M454111L085463J751300N29456o69755j779153k669161
4571A19491740k891537k774146k126231r62336J05583J070494K201540L441992
$$ y = [78480650, 76973965, 75566595, 74318412, 73343656, 72584138, 72033778, 71623487, 71441331, 71384411, 71465720, 71516376, 71559027, 71678551, 71501466, 71257260, 70768085, 70242616, 69526129, 68624971, 67517495, 66471522, 65167191, 63789886, 62738574, 61627906, 60598164, 59704619, 58967345, 58408046, 58076735, 57966146, 58097637, 58421419, 58874337, 59526806, 60476651, 61641805, 62785948, 64167894, 65869795, 67590103, 69522795, 71631982, 73982452, 76670495, 79710446, 83127545, 87233886, 91956297, 97408292, 103289815, 109321388, 114789479, 119243590, 122329053, 124080353, 124609809, 123940054, 122160901, 119491740, 116600203, 113826057, 111699826, 110737490, 110843073, 111913567, 114115107, 117557099]
4563A17557099M680163O280268P697186R700400J2179417J4475731J6825141J8479720
4555B07875125J8738438J7361130J4802261J1039712O319842Q07250m598068r331856
4547B63013834j2836539j4995605j5635135j4724019j2783075j0488399p884646
4540A73666416n867149m800485m227149m605643n456273o561517p637789q436275
4532A26074136q749318q684891q350826p573778o685272n670080m749691l958442
4524G1651838l395453k938837k722839k737017k549627k352943k174968k142109
4516E0638045j913419j789954j652204j479961j357283j116106j066758r23851
4508C9338509q42473o81123o73585n47786m39372l95690k93270l34283l54638
$$ y = [117557099, 122237262, 128517530, 136214716, 145915116, 158094533, 172570264, 189395405, 207875125, 226613563, 243974693, 258776954, 269816666, 276136508, 276943758, 272345690, 263013834, 250177295, 235181690, 219546555, 204822536, 192039461, 181551062, 173666416, 167799267, 162998782, 158771633, 154165990, 148709717, 142148200, 134510411, 126074136, 117324818, 108639927, 100289101, 92715323, 86030051, 80359971, 75610280, 71651838, 68256385, 65317548, 62594709, 59857692, 57308065, 54955122, 52780154, 50638045, 48724626, 46934672, 45282468, 43802507, 42445224, 41329118, 40262360, 39338509, 38496036, 37814913, 37141328, 36593542, 36154170, 35758480, 35465210, 35130927, 34776289]
4499C4776289l78870m28058m92592n23091o19494o33102p15212p45871n95009
4490B9644990p30588o66532o40312o34804n48663m70803m15614m36132k98836
4481B4802706k55585k06420l7328n1679q7625j2095l6942m0957K9279P8737k1499
4470B4160592j68082j06954j37351k02177k65418j81301k06418k08512j79571
4461B2504808j21557p3285m4626Q023J20926K34229J28281K06932L63563M67805
4451B3795099M48942N51654O00703O40429Q06660P47448P83917R23642J012648
4442C0311142J060591J320617J378048J583876J716504J799952K026668K289752
4434D3487150K431640K713701L134267L319007L797674M296491M872497N621584
$$ y = [34776289, 34397419, 33969361, 33476769, 32953678, 32334184, 31701082, 30985870, 30239999, 29644990, 28914402, 28247870, 27607558, 26972754, 26424091, 25953288, 25537674, 25101542, 24802706, 24547121, 24340701, 24303373, 24251694, 24164069, 24151974, 24115032, 24074075, 24103354, 24182091, 24160592, 23992510, 23885556, 23748205, 23546028, 23280610, 23099309, 22892891, 22684379, 22504808, 22383251, 22309966, 22265340, 22273363, 22394289, 22628518, 22756799, 22963731, 23327294, 23795099, 24244041, 24795695, 25396398, 26036827, 26843487, 27590935, 28374852, 29298494, 30311142, 31371733, 32692350, 34070398, 35654274, 37370778, 39170730, 41197398, 43487150, 45918790, 48632491, 51766758, 55085765, 58883439, 63179930, 68052427, 73674011]
4426G3674011O340436P230143Q297302R400030J0384098J1431263J2381408J2509735
4418A51648426J1921325J0640174Q455410N564067K340454r22581l983979o952458
4410A78710838r498883j1347174j2338809j2716723j2276517j1530046j0566187
4403I8436499r525540q547414p613154o596236o058854n279896m489138l984409
4395D6341858l432888l110547k731799k416355k122711j912613j658788j519725
4387B7436432j462589j358667j275632j043264j142171r16637r48997q51006q86611
4378A7550858p52914o70329o31173n40929n98985m32955n12934m65247m66273
4369A2479119m64039k91473l45482l39838m04144k66641l49971l16700l09902
$$ y = [73674011, 80014447, 87244590, 95541892, 104941922, 115326020, 126757283, 139138691, 151648426, 163569751, 174209925, 182665335, 188229402, 190569856, 189647275, 185663296, 178710838, 169211955, 157864781, 145525972, 132809249, 120532732, 109002686, 98436499, 88910959, 80363545, 72750391, 66154155, 60095301, 54815405, 50326267, 46341858, 42908970, 39798423, 37066624, 34650269, 32527558, 30614945, 28956157, 27436432, 25973843, 24615176, 23339544, 22296280, 21154109, 20237472, 19288475, 18437469, 17550858, 16797944, 16127615, 15496442, 14955513, 14356528, 13923573, 13410639, 12945392, 12479119, 12015080, 11723607, 11378125, 11038287, 10634143, 10367502, 10017531, 9700831, 9390929]
4360I390929k12913l12197l85601j36203j38885q8311j47416o3180j29089n9774
4350G717360k33768j26542j96234k74729k64187k15133j77888k24581k72968k16629
4340E514701j77437j72977k11584q4660o7149q2925k26961p0208o2927j66131
4330D191742k18399o8324j73754j27591j36066j88700q4475q3633j22260j4200
4320B974340N343j80430j3266J9895l7291q6259k9415k2951J01038L3885n3061
4309B711828O7977k7339M47O4904M5399M0191N7525J9422k6991M2884L0522k5438
4297C001331K8211J9877p4827r548p0634J1702J23690q5341N9045M5656k5795
4286C023367L4566N7906J24364J06566O9161M3351J85001J11051P3928K27287
$$ y = [9390929, 9178016, 8865819, 8480218, 8344015, 8205130, 8116819, 7969403, 7906223, 7777134, 7717360, 7483592, 7357050, 7160816, 6886087, 6621900, 6406767, 6228879, 6004298, 5731330, 5514701, 5337264, 5164287, 4952703, 4868043, 4800894, 4717969, 4491008, 4420800, 4357873, 4191742, 3973343, 3905019, 3731265, 3603674, 3467608, 3278908, 3194433, 3110800, 2988540, 2974340, 2979683, 2799253, 2785987, 2805882, 2768591, 2682332, 2652917, 2629966, 2731004, 2764889, 2711828, 2779805, 2752466, 2752913, 2817817, 2863216, 2903407, 2960932, 2980354, 2953363, 2996247, 3026769, 3001331, 3029542, 3049419, 2974592, 2965044, 2894410, 2906112, 3029802, 2944461, 3003506, 3049162, 3023367, 3057933, 3115839, 3240203, 3346769, 3415930, 3459281, 3644282, 3755333, 3829261, 4056548]
4276D056548J32346O5488O8253J16494J53699J53848j0222J46724J36156J08963
4266E128297J32397L7931N5942R905J62689N9589N9041R2741R2479J77163J12404
4255F120578J33270J50816J67492J91593K79421J96676K30409K29927L04481K60227
4245H264890K38267L36416L66136M42018L98992L91961O15745O50653O04251O66774
4235A2976103O81376P16912O91073P46836P12304P46364P69801Q70590Q47874
4226A9759233Q53249R93434Q75599J019291J059231R60431R20558Q61517Q30406
4217B8132949P02828P25199N60780O35764M71111O42793M33169N83206N31753
4208C3419552M85986N50713L86777K58882k7258j5759j92967l13831l73601n17189
$$ y = [4056548, 4188894, 4254382, 4322635, 4439129, 4592828, 4746676, 4736454, 4883178, 5019334, 5128297, 5260694, 5298625, 5354567, 5364472, 5527161, 5586750, 5645791, 5738532, 5831011, 6008174, 6120578, 6253848, 6404664, 6572156, 6763749, 7043170, 7239846, 7470255, 7700182, 8004663, 8264890, 8503157, 8839573, 9205709, 9647727, 10046719, 10438680, 11054425, 11705078, 12309329, 12976103, 13657479, 14374391, 15065464, 15812300, 16524604, 17270968, 18040769, 18911359, 19759233, 20612482, 21605916, 22481515, 23500806, 24560037, 25520468, 26441026, 27302543, 28132949, 28835777, 29560976, 30121756, 30757520, 31228631, 31871424, 32304593, 32887799, 33419552, 33905538, 34456251, 34843028, 35101910, 35074652, 35058893, 34865926, 34552095, 34178494, 33661305]
4198C3661305m59003n99474o05234o04834n31659o04195o35078q48356p81145
4189B7992327r81573j046900r79549j077199j017802j101287r90116r44879r91596
4180A8861426j007416r00115q62428p20874q18380r27007p29958p15019q16973
4171A1363256p57663o34416p32214n88552o20492n13188m79429n31257k88597
4162F217448l83837l84256l54055l74892l87064k89177l03831k00792l08545j56969
4152C074030j94843k22339j95830j59205j23942j02709j18095j55410m5975o1455
4142A694227q6923p8562j06851k1620m3570p6454r8895j01093j49500J59252n9634
4131A030377j8597K1192o1200L9797j01224q0143n178j0474m9483Q5670j20313
$$ y = [33661305, 33202302, 32602828, 31997594, 31392760, 30861101, 30256906, 29621828, 28773472, 27992327, 27010754, 25963854, 24984305, 23907106, 22889304, 21788017, 20797901, 19853022, 18861426, 17854010, 16953895, 16091467, 15370593, 14552213, 13625206, 12895248, 12180229, 11363256, 10605593, 9971177, 9238963, 8650411, 8029919, 7516731, 7037302, 6506045, 6217448, 5833611, 5449355, 5095300, 4720408, 4333344, 4044167, 3740336, 3539544, 3230999, 3074030, 2879187, 2656848, 2461018, 2301813, 2177871, 2075162, 1957067, 1801657, 1755682, 1694227, 1607304, 1528742, 1421891, 1400271, 1356701, 1280247, 1181352, 1080259, 930759, 1090011, 1030377, 1011780, 1032972, 971772, 1011569, 910345, 830202, 825024, 814550, 765067, 850737, 730424]
4120G30424q5085O1450o6462J1309q04J7677j5956q7573p0167n5629o3824K0806
4108C96166k0338j13292n1279j53596r0193l6355j14193M929l7117j30130j5922
4097c61320j34129q4035O320l8402N277J3420r9030m7833P8563p8930O3784r4651
4085g70966o9158j7086o0118m1230j5255K7360M735K4239L1523L8248j42651j226
4073i91585M5450m6184q49j1708q227j5145O9659o8004j730K3476j614o7909n0484
4060a124854N5246k528j9864M3255n3918n1768j6172p3591L0634l1549q7589P9086
4048a253612K9696J7692k8922L31m1315L6719l073j8002r112j3011N1697n1986
4036a282898Q427r7710o7388J7832P9827j28968j8156o660l6442Q1955k7006j0032
$$ y = [730424, 645339, 706789, 640327, 651636, 650832, 668509, 652553, 564980, 494813, 439184, 375360, 396166, 375828, 262536, 211257, 57661, -32532, -68887, -183080, -178151, -215268, -345398, -361320, -495449, -579484, -573164, -611566, -606289, -592869, -691899, -739732, -661169, -740099, -676315, -770966, -840124, -857210, -917328, -958558, -973813, -946453, -941718, -917479, -885956, -847708, -990359, -991585, -946135, -992319, -993168, -1004876, -1013103, -1028248, -958589, -1026593, -1028323, -1004847, -1006461, -1074370, -1124854, -1069608, -1072136, -1092000, -1048745, -1102663, -1154431, -1170603, -1244194, -1213560, -1245109, -1332698, -1253612, -1223916, -1206224, -1235146, -1234815, -1276130, -1239411, -1242484, -1260486, -1269598, -1282609, -1230912, -1282898, -1274471, -1372181, -1439569, -1421737, -1341910, -1470878, -1489034, -1495694, -1532136, -1450181, -1477187, -1487219]
4024a487219O9850l577r1563j20682P7852M596l6740P970K0872j12298p107L5300
4012a642746j8564K907j6656l8725M6178r0675k0283n447R6147K2865L091j40296
4000a802204k5886l0290k1454L2983L4969L5920n6396L3822L762m2168O6738N5564
3988a714640L30m2845J02683q6637j1870J28967n1779l0614j9687P117o2471j9215
3976a800661M5315j7356M6362J27541r6860N9483n756j08174O0623J2699M4421
3965a632363N3379J0997K5936q7429J9867K1823m5838M1324L7336m4222k8395
3954a627585k675O2654M910M0066r0900J5705N0671p4107L977O822l1509k5078
3942a667049P9105K3728j40921K6241R0700o503k0544M0767k094N4234n2425j521
$$ y = [-1487219, -1417369, -1420946, -1512509, -1633191, -1555339, -1550743, -1587483, -1579513, -1558641, -1670939, -1678046, -1642746, -1661310, -1658403, -1675059, -1713784, -1667606, -1758281, -1778564, -1784011, -1687864, -1664999, -1661908, -1802204, -1828090, -1858380, -1879834, -1846851, -1811882, -1775962, -1832358, -1798536, -1794774, -1836942, -1770204, -1714640, -1714310, -1757155, -1654472, -1741109, -1752979, -1624012, -1675791, -1706405, -1726092, -1718975, -1781446, -1800661, -1755346, -1772702, -1726340, -1598799, -1695659, -1636176, -1641932, -1750106, -1689483, -1676784, -1632363, -1578984, -1567987, -1542051, -1629480, -1609613, -1587790, -1633628, -1592304, -1554968, -1599190, -1627585, -1630260, -1567606, -1562696, -1522630, -1613530, -1597825, -1547154, -1621261, -1617284, -1610462, -1641971, -1667049, -1587944, -1564216, -1705137, -1678896, -1588196, -1594699, -1615243, -1574476, -1576570, -1522336, -1574761, -1576282]
3930a576282p1677J8658Q8491r3187l3490M6526j6647r6768J02722m874q79Q9073
3918a548334p0478o0897J1353m2800R8405Q3702j6816M1229j12213O6634J036
3907a549179p5901M5691M2813R569j569J512K37J4466j3988Q0288l2331n4342
3895a532734n2493l4091J32502j2512L1578p3172Q2933m3800k3190m1620O7172
3884a499427R9813j6448L3624m5109K1347Q838j5763R425Q5349M9811o3620O0912
3872a271248k9226K3576K1116Q4389j7979m9977O5186L036q7122J7210J47935
3861a093104o5367M2519Q649q2061K8472J1757j19853M6662Q2836l4418r3214
3850a267122L0271j984j3851L2362L4709j39485J8883p0245k3611k6679N9754
$$ y = [-1576282, -1647959, -1629301, -1540810, -1633997, -1667487, -1620961, -1637608, -1734376, -1631654, -1636528, -1637407, -1548334, -1618812, -1679709, -1668356, -1711156, -1612751, -1529049, -1545865, -1504636, -1616849, -1550215, -1549179, -1625080, -1579389, -1536576, -1527007, -1528576, -1527064, -1526827, -1512361, -1526349, -1446061, -1478392, -1532734, -1585227, -1619318, -1486816, -1499328, -1467750, -1540922, -1457989, -1501789, -1524979, -1566599, -1499427, -1399614, -1416062, -1382438, -1427547, -1406200, -1397362, -1413125, -1403700, -1318351, -1268540, -1332160, -1271248, -1300474, -1276898, -1255782, -1171393, -1189372, -1239349, -1174163, -1171127, -1258249, -1241039, -1093104, -1158471, -1115952, -1107303, -1189364, -1160892, -1149135, -1268988, -1222326, -1139490, -1173908, -1267122, -1236851, -1238835, -1252686, -1220324, -1185615, -1325100, -1306217, -1376462, -1400073, -1426752, -1366998]
3839a366998m3657Q7993J45262j16113j6209O7147p095O9987Q5939m3246P7038
3828a059952Q2358j05361q8087Q1802m3775j03490O6319l1221m0155N2948j4147
3817a202761N008M624P5924j03834P7892K1949r1703P0049J05380L6117n6949
3806a058304L2465k5641k8687j0773M0262J5952R9137J0760j109L2060K1203o2660
3794i35335P6708L7602L5147n4883l8759n3907J02773j5987k3914J32811k4879
3783g62623q629o673N8811M0979K1197P2192L2988N5783L5102O0668n4406J14253
3771c40358L9673j27975J37081L2795L198l8718J50925J039P1257O9205P1187
3760F9309m6773J18095R4463K9004J52330J24236o4967R4099M9107n2258K9371
$$ y = [-1366998, -1410655, -1322662, -1177400, -1293513, -1309722, -1242575, -1249670, -1179683, -1093744, -1136990, -1059952, -977594, -1082955, -1171042, -1089240, -1133015, -1236505, -1170186, -1201407, -1241562, -1188614, -1202761, -1197753, -1193129, -1117205, -1221039, -1143147, -1121198, -1212901, -1142852, -1037472, -1001355, -1058304, -1025839, -1051480, -1080167, -1090940, -1050678, -1034726, -935589, -924829, -925938, -893878, -872675, -935335, -858627, -821025, -785878, -840761, -879520, -933427, -830654, -846641, -870555, -737744, -762623, -771252, -777925, -719114, -678135, -656938, -584746, -551758, -495975, -460873, -400205, -454611, -340358, -300685, -428660, -291579, -258784, -255586, -294304, -143379, -142340, -71083, -1878, 69309, 22536, 140631, 235094, 264098, 416428, 540664, 475697, 569796, 618903, 566645, 596016]
3749E96016L6889Q8922Q1671M7581q5545J55376j7237j976N6991J7746l7210q1286
3737H57938P8657m9060n607M8707n31k8933Q694r2251j00389J28425j23494L890
3725G26046p0918L9006j10466k3981k8136j04577P2640M439Q9822q0078K6456
3714E40253m3275k74M2266R820p6639J07662P753n4127M3676p8757J01912J50745
3702G51015J8223o2527K7936O0201j04424R8916J00630N223J2305J77585n5399
3691A029684l1454J50113J39596j01257R6644J9924o1488J27508l7926p079J56537
3680A480802J40423k9870N4134m764J6575l9548O1601K732P2623J13146L6762
3669A904616k1051K1382M0619o5497J06894k481R477J23356m516J7734J37167
$$ y = [596016, 632905, 721827, 803498, 851079, 765534, 920910, 903673, 901697, 958688, 976434, 939224, 857938, 936595, 887535, 881928, 930635, 930104, 901171, 909865, 817614, 717225, 845650, 722156, 726046, 655128, 694134, 583668, 559687, 531551, 426974, 499614, 504053, 593875, 513797, 540253, 496978, 496704, 538970, 548790, 472151, 579813, 587566, 533439, 577115, 498358, 600270, 751015, 769238, 706711, 734647, 794848, 690424, 789340, 889970, 895193, 907498, 1085083, 1029684, 998230, 1148343, 1287939, 1186682, 1283326, 1303250, 1241762, 1369270, 1331344, 1324265, 1480802, 1621225, 1591355, 1645489, 1640725, 1657300, 1617752, 1679353, 1682085, 1754708, 1867854, 1904616, 1883565, 1904947, 1945566, 1880069, 1986963, 1984482, 1993959, 2117315, 2112799, 2130533, 2267700]
3658B267700J19209k1947J23917j2330k9169R8235J56402N9416L6490J09088l5578
3647B871433Q3830J8180J0360Q3808J49188M8296J33630J38241O4893J69280J13856
3636C884995J4053N8863O4013P2620P6755L6880J08355J2R9191J03766K6215m2843
3624D502875J68597q1325N4118J91693p8573O9558R4622l0423j03479J01862J1094
3613D900619K75o590q3848j7901q7580J13479j21875l9859O2312m7394K0508K4543
3601D716689q406j8744J45325l6855J11393O8139P465K3354J28192M3994J2074
3590E192620K12595J1391Q6743J49478J42153R2504J38157K24597N6188K46488
3580F552914J48560J57090J90668J70830K17485K38806K66382K00518J64138J06735
$$ y = [2267700, 2386909, 2364962, 2488879, 2476549, 2447380, 2545615, 2702017, 2761433, 2797923, 2907011, 2871433, 2955263, 2973443, 2983803, 3067611, 3216799, 3265095, 3398725, 3536966, 3601859, 3771139, 3884995, 3899048, 3957911, 4021924, 4094544, 4171299, 4208179, 4316534, 4316546, 4415737, 4519503, 4545718, 4502875, 4671472, 4590147, 4644265, 4835958, 4757385, 4826943, 4921565, 4891142, 4787663, 4889525, 4900619, 4900894, 4894304, 4810456, 4792555, 4704975, 4818454, 4696579, 4656720, 4719032, 4671638, 4692146, 4716689, 4708283, 4689539, 4834864, 4798009, 4909402, 4977541, 4985006, 5008360, 5136552, 5180546, 5192620, 5405215, 5416606, 5503349, 5652827, 5794980, 5887484, 6025641, 6250238, 6306426, 6552914, 6701474, 6858564, 7049232, 7220062, 7437547, 7676353, 7942735, 8143253, 8307391, 8414126]
3570H414126K75810J64000L01013K79689J46166K97993K23599J30956L03311J91712
3560A0728375J34412K73187J90382m6455K96388J54884J00194J29472J21849L1403
3550A2114091J19246J02890M1011K83937J03754J92530K08825J67186J93041K00112
3540A3726623K07002K53841K16200J81130L57314K13321K63748L40240K56993
3531A6016412M02871L11149M38575L94242M60126L44771N55954O45712N56294
3522B0126106N76622N92294O34415O05171P34820P47022Q06708P87894P92544
3513B6403596R37912Q50384R43500R18188R40995R47886J024591R44057J042105
3504C4953214J120521J096784J246406J158525J267481J352064J388305J502110
$$ y = [8414126, 8689936, 8853936, 9154949, 9434638, 9580804, 9878797, 10102396, 10233352, 10536663, 10728375, 10862787, 11135974, 11326356, 11279901, 11576289, 11731173, 11831367, 11960839, 12082688, 12114091, 12233337, 12336227, 12377238, 12661175, 12764929, 12957459, 13166284, 13333470, 13526511, 13726623, 13933625, 14187466, 14403666, 14584796, 14942110, 15155431, 15419179, 15759419, 16016412, 16419283, 16730432, 17169007, 17563249, 18023375, 18368146, 18924100, 19569812, 20126106, 20702728, 21295022, 21929437, 22534608, 23269428, 24016450, 24823158, 25611052, 26403596, 27341508, 28191892, 29135392, 30053580, 30994575, 31942461, 32967052, 33911109, 34953214, 36073735, 37170519, 38416925, 39575450, 40842931, 42194995, 43583300, 45085410]
3496D5085410J547857J590123J710331J899916J984069K103345K340703K508589
3488F0770343K717499K951718L132979L522751L856064M100941M566313M919357
3480I0537965N480022O025311O486807P127171P721688Q344492R068388R525285
3472A50317129J0101241J0514979J0769250J0667054J0543073J0073321R271136
3465B22257183Q539372P435247O082730M954323L797595K542417J771658R79518
3457B58360043K27639l25132q87679j376222k074087k800556l643397m813756
3449B42666853n986463p081002q217727r293411j0043231j0820429j1092424j1181426
3441A68950740j1017696j0739214j0263250r640094r151516q419362p732893p108739
$$ y = [45085410, 46633267, 48223390, 49933721, 51833637, 53817706, 55921051, 58261754, 60770343, 63487842, 66439560, 69572539, 73095290, 76951354, 81052295, 85618608, 90537965, 96017987, 102043298, 108530105, 115657276, 123378964, 131723456, 140791844, 150317129, 160418370, 170933349, 181702599, 192369653, 202912726, 212986047, 222257183, 230796555, 238231802, 244314532, 249268855, 253066450, 255608867, 257380525, 258360043, 258587682, 258262550, 257374871, 255998649, 253924562, 251124006, 247480609, 242666853, 236680390, 229599388, 221381661, 212088250, 202045019, 191224590, 180132166, 168950740, 157933044, 147193830, 136930580, 127290486, 118138970, 109719608, 101986715, 94877976]
3433I4877976o421929n844084n258071m726510m285255l786488l269816k922955
3425E8362868k610076k291821k011605j661975j379720j011288q20677o42684
3417D5933022p63662q60043q85845q55135q72022j066830j128435j232297j195824
3408C7072929r75792q58097p80597o73301p07338n76082m85156n91618m57783
3399C0967165l26570n01074k79890k42095j66864j46839N914l6455J57072L29912
3389B9760276O35628R03466J069683J132534O59149J96517J3567j13124l45028
3380C3912668m73891r96285j178661q94901p01548m72216k24844j60525p1693
3371B8738104J07719K05042K23019L88163M00123O29705O46191P62901Q36244
$$ y = [94877976, 88456047, 82611963, 77353892, 72627382, 68342127, 64555639, 61285823, 58362868, 55752792, 53460971, 51449366, 49787391, 48407671, 47396383, 46575706, 45933022, 45169360, 44309317, 43423472, 42568337, 41696315, 40629485, 39501050, 38268753, 37072929, 36097137, 35239040, 34458443, 33785142, 33077804, 32501722, 32016566, 31424948, 30967165, 30640595, 30139521, 29859631, 29617536, 29450672, 29303833, 29309747, 29273292, 29430364, 29760276, 30395904, 31299370, 32369053, 33501587, 34160736, 34357253, 34370820, 34257696, 33912668, 33438777, 32442492, 31263831, 30368930, 29667382, 29195166, 28970322, 28809797, 28738104, 28845823, 29050865, 29273884, 29662047, 30062170, 30691875, 31338066, 32100967, 32937211]
3362C2937211J013633R73638J071105J210304J308785J333821J436764J368081
3354D2653342J182686Q86371N20137L28682J08606j13282l77076o24952p88487
3345D3776027o22832p36651o63432m65029o02301n46414m55875m80358l33092
3336C8870043k13588k29919k8397K5158Q0626L87915M15004N24881O91245P89255
3326D1312223Q10395Q94321J098528J278578J247527J379821J587627J627022
3318E1236042J810784K046658K033538K271943K693574K610006L069818L303562
3310G1075925L437432L734932M016664M167935M351150M463786M473227M472824
3302A04193875M302255M170727L779980L599823L195519K676796K265784J857947
$$ y = [32937211, 33950844, 34924482, 35995587, 37205891, 38514676, 39848497, 41285261, 42653342, 43836028, 44722399, 45242536, 45571218, 45679824, 45566542, 45189466, 44564514, 43776027, 43153195, 42416544, 41753112, 41288083, 40685782, 40139368, 39683493, 39203135, 38870043, 38656455, 38426536, 38398139, 38423297, 38503923, 38891838, 39306842, 39831723, 40522968, 41312223, 42122618, 43016939, 44115467, 45394045, 46641572, 48021393, 49609020, 51236042, 53046826, 55093484, 57127022, 59398965, 62092539, 64702545, 67772363, 71075925, 74513357, 78248289, 82264953, 86432888, 90784038, 95247824, 99721051, 104193875, 108496130, 112666857, 116446837, 120046660, 123242179, 125918975, 128184759, 130042706]
3294A30042706J397760R84686O78807M42216L40010N9632n9097o3481j40655j95280
3284A33487304k57552q4408k08342k58586j51390j08378j79631m9495m1399m8037
3274A32100086K91681J56962J80777L87191J84038J30256K27299j46554k29709
3265A33282027n96287r18051j220173j628919j987009k220081k521978k841698
3257A19347831k855112l192113l143666l043003l066382k983184k806158k846848
3249I5411365k762296k815998k806545k701019k822585k884636k865722l026339
3241G2726225l005724l006298k898234k827835k802521k603686k402279k283574
3233E0896074j931365j892212j686673j474524j412978j270435j128490j150714
$$ y = [130042706, 131440466, 132425152, 133103959, 133546175, 133886185, 133945817, 133886720, 133823239, 133682584, 133487304, 133229752, 133145344, 132937002, 132678416, 132527026, 132418648, 132239017, 132189522, 132148123, 132100086, 132391767, 132548729, 132729506, 133116697, 133300735, 133430991, 133658290, 133511736, 133282027, 132685740, 131767689, 130547516, 128918597, 126931588, 124711507, 122189529, 119347831, 116492719, 113300606, 110156940, 107113937, 104047555, 101064371, 98258213, 95411365, 92649069, 89833071, 87026526, 84325507, 81502922, 78618286, 75752564, 72726225, 69720501, 66714203, 63815969, 60988134, 58185613, 55581927, 53179648, 50896074, 48964709, 47072497, 45385824, 43911300, 42498322, 41227887, 40099397, 38948683]
3225C8948683j026254r74218j043420j008525j010604j020602j013589r14790
3217C0936681q66820q26768p12808n96283n60578m65379k71980l49099k35680
3208B6051286j14161k28007k4568j0351j9181J35545O5625M7897J73846J76596
3198B6254527R7709J14674P7268M2411l9419k05450j36760k67951l79524n17159
3188B5040326n80095o49271p10745p19163o35504o65703q22421n11172o36108
3179A9110144o04324m54557m66943l64748l02617j77356l68798j00034j30232
3170A6140535r9478r4341k4896q8404j10128p7602j07407O343n2711o0542J0925
3159A5442294p5814n2908j2228k6456K8948R6037m4396l225J04571Q8186J13631
$$ y = [38948683, 37922429, 36948211, 35904791, 34896266, 33885662, 32865060, 31851471, 30936681, 30069861, 29243093, 28530285, 27934002, 27373424, 26908045, 26636065, 26286966, 26051286, 25937125, 25709118, 25684550, 25674199, 25655018, 25790563, 25856188, 25904085, 26077931, 26254527, 26352236, 26466910, 26544178, 26586589, 26547170, 26341720, 26204960, 25937009, 25557485, 25040326, 24460231, 23810960, 23100215, 22381052, 21745548, 21079845, 20257424, 19746252, 19110144, 18505820, 18051263, 17584320, 17219572, 16916955, 16739599, 16370801, 16270767, 16140535, 16041057, 15946716, 15921820, 15833416, 15723288, 15645686, 15538279, 15544622, 15491911, 15431369, 15442294, 15366480, 15313572, 15301344, 15274888, 15303836, 15399873, 15355477, 15352252, 15456823, 15545009, 15658640]
3148A5658640J77160K20918J07558J35610K64821J27524J34177K79844K85528
3139A7391780K48463L49379M24745K75683L78602L78150L73526L66893M29848
3130B0617069N13352M62221O13019N98411P00750O70963P77738P53597Q81922
3121B6589042Q62347R30325J042997J170564J196620J243306J412799J451280
3113C5899280J453445J767813J636328J812175K137200K131505K286781K553633
3105E1678160K565070K676666K920085K846459L136277L328716L487644L644511
3097G6283588M202724M562195N114468N701909O474695P169681Q106764R104574
3089A26720598J0149316J1302255J2846810J4459865J6723832J9375808K2278613
$$ y = [15658640, 15835800, 16056718, 16164276, 16299886, 16564707, 16692231, 16826408, 17106252, 17391780, 17640243, 17989622, 18414367, 18690050, 19068652, 19446802, 19820328, 20187221, 20617069, 21130421, 21592642, 22205661, 22804072, 23504822, 24175785, 24953523, 25707120, 26589042, 27451389, 28381714, 29424711, 30595275, 31791895, 33035201, 34448000, 35899280, 37352725, 39120538, 40756866, 42569041, 44706241, 46837746, 49124527, 51678160, 54243230, 56919896, 59839981, 62686440, 65822717, 69151433, 72639077, 76283588, 80486312, 85048507, 90162975, 95864884, 102339579, 109509260, 117616024, 126720598, 136869914, 148172169, 161018979, 175478844, 192202676, 211578484, 233857097]
3082B33857097K5747934K9083919L1503259L2414896L0631320K6139197J9323524
3075D28701146J1107134K476554o051853j3986613k1387807k7232184l0801473
3068C42824904l1883962l1098235k8849634k6440866k3988211k1391309j9013260
3061A60159427j6601821j4396757j2588178j0892428r443733q084326o967893
3054H1184291o119485n253240m426682l883101l281752k752139k586308k097750
3046E0783834j879946j778336j598022j508685j552177j469572j475834j537370
3038C7983892j467833j451838j396862j421939j361914j143357j344970j079852
3030B7315327j146384j086042r92715q52118r65204q50233p61349q00227o22260
$$ y = [233857097, 259605031, 288688950, 320192209, 352607105, 383238425, 409377622, 428701146, 439808280, 442284834, 436232981, 422246368, 400858561, 373626377, 342824904, 310940942, 279842707, 250993073, 224552207, 200563996, 179172687, 160159427, 143557606, 129160849, 116572671, 105680243, 96236510, 88152184, 81184291, 75064806, 69811566, 65384884, 61501783, 58220031, 55467892, 52881584, 50783834, 48903888, 47125552, 45527530, 44018845, 42466668, 40997096, 39521262, 37983892, 36516059, 35064221, 33667359, 32245420, 30883506, 29740149, 28395179, 27315327, 26168943, 25082901, 24090186, 23238068, 22272864, 21422631, 20661282, 19861055, 19238795]
3021A9238795q16363o59606o84756o05656n68888n45442m54066n33505l03248
3012A4067265l46437l25030l79598l41730l92219n27955l13891m04766k60539
3003A0775100l69532k89689k96780k60886l10905k31638k23295l43326j93466
2994H255583k58237k20734k48443j73353j30458j72556k26113j67930r0127j63277
2984F404355j67988j46151r8060o9359j34841p5882p7968j27377p4461j81113
2974E251155p5512j0756q4916j28779L1046j93931r8395L2912j23193m4729q296
2963D546606k17944p2429l2223p2171j69924n3680j03270j25865q2604j64867
2953C451629j90562j34992j38867l8389o4854r5853l3319p9894m7636j30409l7850
$$ y = [19238795, 18422432, 17762826, 17078070, 16472414, 15903526, 15358084, 14904018, 14370513, 14067265, 13720828, 13395798, 13016200, 12674470, 12282251, 11754296, 11440405, 11035639, 10775100, 10405568, 10115879, 9819099, 9558213, 9247308, 9015670, 8792375, 8449049, 8255583, 7997346, 7776612, 7528169, 7354816, 7224358, 7051802, 6825689, 6657759, 6567632, 6404355, 6236367, 6090216, 5992156, 5922797, 5787956, 5712074, 5634106, 5506729, 5432268, 5251155, 5175643, 5164887, 5079971, 4951192, 4982238, 4788307, 4689912, 4722824, 4599631, 4554902, 4546606, 4328662, 4256233, 4224010, 4151839, 3981915, 3928235, 3824965, 3699100, 3616496, 3451629, 3261067, 3126075, 2987208, 2948819, 2883965, 2788112, 2754793, 2674899, 2627263, 2496854, 2459004]
2942B459004n2915j07787o6050n4597j10103q6515m2526j05434j13650r3901p0099
2931A555427k59141n1002r0091j76454J2780o0078j59890j14768k8346j03940
2921E24497p7519O514p8079m3936o3364Q0394j13225m5042P91q5645o9734n5159
2909a9507m7690q7114K7548o6273n1357n5485n0900k6249n3605o2850k6351M0364
2897d79469q1167K1810N3674j15620P3537l3827J2790o812J11321n924r964l2802
2885d92453q8831k7560N9158K301j05754l1117m9393j24775j8376p6970n9868
2874a013638n4376L4458j88028l8991J2513n3114j3869J8005K6895k907J5925
2863a257127J7673o4194Q3615P5115r1186N7775R834q3467K0608L6372p9019o85
$$ y = [2459004, 2406089, 2298302, 2232252, 2177655, 2067552, 1981037, 1938511, 1833077, 1719427, 1625526, 1555427, 1296286, 1245284, 1155193, 978739, 991519, 931441, 771551, 656783, 628437, 524497, 446978, 453492, 375413, 331477, 268113, 348507, 235282, 190240, 191031, 105386, 35652, -19507, -67197, -154311, -126763, -193036, -244393, -299878, -350778, -377027, -430632, -493482, -519833, -479469, -560636, -538826, -485152, -600772, -527235, -561062, -548272, -555084, -443763, -449687, -459651, -492453, -581284, -608844, -549686, -547385, -653139, -684256, -733649, -858424, -876800, -953770, -1013638, -1068014, -1033556, -1221584, -1260575, -1248062, -1301176, -1315045, -1297040, -1270145, -1273052, -1257127, -1239454, -1303648, -1220033, -1144918, -1236104, -1178329, -1168495, -1251962, -1231354, -1194982, -1274001, -1274686]
2851a274686J0546j1428n1180j09569k7911j5013J255k4380q5899k8927J50569
2840a466623j53137O182J59042Q445N6114L9024j0883O086O6599k1782J9111j748
2828a293570K2786n2130J9948J3904m4858Q573K7431M6673q7364J105m3316P8830
2816a301988l1900n9360J48990m5868K3467K5950K7286j5524J48455m7766O6348
2805a061910J39847l371Q1048L2932J59235O0261J88572J06324J43607J12873
2795d0582O6842J11963L9240J14095k7558p265o1475n1274j15350j42346j17531
2784b31241j21951j73720j05947q3917j39919j45854j33868l9531k5222j15948
2774a317118j5897q9608o3537o0876N592l1758l777k9330K8264l0442n5478p0332
$$ y = [-1274686, -1264140, -1275568, -1326748, -1436317, -1464228, -1479241, -1477986, -1502366, -1588265, -1617192, -1466623, -1619760, -1613578, -1454536, -1446091, -1389977, -1350953, -1361836, -1355750, -1289151, -1310933, -1291822, -1293570, -1270784, -1322914, -1302966, -1289062, -1333920, -1325347, -1297916, -1251243, -1338607, -1337502, -1380818, -1301988, -1333888, -1393248, -1244258, -1290126, -1266659, -1240709, -1213423, -1228947, -1080492, -1128258, -1061910, -922063, -925434, -844386, -811454, -652219, -591958, -403386, -297062, -153455, -40582, 26260, 138223, 177463, 291558, 264000, 256735, 195260, 143986, 28636, -113710, -231241, -353192, -526912, -632859, -716776, -856695, -1002549, -1136417, -1175948, -1201170, -1317118, -1333015, -1422623, -1486160, -1547036, -1541444, -1573202, -1576979, -1606309, -1578045, -1608487, -1663965, -1734297]
2762a734297k545p8887L786N5892j41430l8664N3767l9581J0381N241j12243l0220
2750b048800Q5986o5649j1821K3683p589N630j7973O919p315m0868J08336K946
2738a966515q0338N5673j6258n4814J15386l7251O3017K7392p4760J4488p9822
2727b033802k1875J5332M8966j35921P9361J8749k5041r724m6403J6444P852O0541
2715b025521O0906j715m2813O2955L36K0029M5989n9207R7179p0895k7325j3541
2703a953623l9846N9900L2228k4965L0799p6954K4014K9349j82865R3704L4944
2692a973315m0350O2311n8626l7019R5616k7328n1120J30150j06570k3722K3027
2681b006946N1846J6092k0139P0093o087m0868J486l702j16275Q738J12975o0249
$$ y = [-1734297, -1736842, -1815729, -1811943, -1756051, -1897481, -1936145, -1882378, -1921959, -1911578, -1906337, -2018580, -2048800, -1962814, -2028463, -2040284, -2016601, -2024190, -2018560, -2036533, -2029614, -2036929, -2077797, -1969461, -1966515, -2046853, -1991180, -2007438, -2062252, -1946866, -1984117, -1921100, -1893708, -1968468, -1953980, -2033802, -2055677, -2040345, -1991379, -2127300, -2047939, -2029190, -2054231, -2063955, -2110358, -2093914, -2086062, -2025521, -1964615, -1966330, -2009143, -1946188, -1945852, -1925823, -1879834, -1939041, -1841862, -1912757, -1940082, -1953623, -1993469, -1933569, -1901341, -1926306, -1895507, -1972461, -1948447, -1919098, -2101963, -2008259, -1973315, -2013665, -1951354, -2009980, -2046999, -1951383, -1978711, -2029831, -1899681, -2006251, -2029973, -2006946, -1955100, -1939008, -1959147, -1889054, -1895141, -1936009, -1934523, -1938225, -2054500, -2045762, -1932787, -1993036]
2669a993036M07o0443l8429q0456M7398l7671J6874l9146m6010O5561m7985j1103
2657b224039n5099O3496M875q2922M3767j1074L8335K6578k22k8343J09024p3893
2645b189517k9126Q7552p8116N9783k1790L5887r509k8605k538J4652Q453l3612
2633b186486l7683J1040J08298r7554m9018j7308K7964K0306p5388K7533N767
2622b262529L324k0424O7266P6634p4444j4157M4845M8862m2804o4006P706J07632
2610b122095J6561k736k5493n0898R5872j10548K440Q0212j4418o3120N1689p9297
2598b221831M8483N7604l8673L8083Q4184p8380n5373L0200J0935o1462M6203
2587b140027O2179q194m8282o3m407n003l3963K3295k1749m5599m8985k2733O6342
$$ y = [-1993036, -1992629, -2053072, -2091501, -2171957, -2124559, -2162230, -2145356, -2184502, -2230512, -2164951, -2212936, -2224039, -2279138, -2215642, -2210767, -2293689, -2249922, -2260996, -2222661, -2196083, -2196305, -2224648, -2115624, -2189517, -2218643, -2131091, -2209207, -2149424, -2171214, -2135327, -2144836, -2173441, -2175979, -2161327, -2152874, -2186486, -2224169, -2213129, -2104831, -2202385, -2251403, -2268711, -2240747, -2220441, -2295829, -2268296, -2262529, -2259205, -2279629, -2212363, -2135729, -2210173, -2224330, -2179485, -2130623, -2173427, -2237433, -2229727, -2122095, -2105534, -2108270, -2133763, -2184661, -2088789, -2199337, -2196897, -2116685, -2131103, -2194223, -2142534, -2221831, -2173348, -2115744, -2154417, -2116334, -2032150, -2110530, -2165903, -2135703, -2124768, -2186230, -2140027, -2077848, -2086042, -2134324, -2134387, -2138794, -2143797, -2177760, -2154465, -2176214, -2221813, -2270798, -2293531, -2227189]
2574b227189J7946N4808k1993n7417K7703J4356p5150M3874J8384N9494n0224
2563b195408j0977m2454n4378P9175m2467k6382L810m638j34900R7109j24568
2552b456078l2090N5894K0757L916p1555J8681M5825L183J3041k9697L8568J3954
2540b375601L5946j29716J03787q1611O4802R2417j04716L793L9941L4733j18557
2529b434782N8168o0495M8190P0249k4483o7450N3946j40769J3431J24928m4987
2518b404054n0319J10285n535J11721j06713K7853r6028J42676l0168k6153j8718
2507b345153J0957J3808O943L2074L7736K3936n4030L8908p7865l7140Q907O0242
2495b280677J848Q562n0364j3020P3239L6312r8382O1861l0074P6078j45050j661
$$ y = [-2227189, -2209243, -2154435, -2176428, -2233845, -2206142, -2191786, -2266936, -2223062, -2204678, -2145184, -2195408, -2206385, -2248839, -2303217, -2224042, -2266509, -2292891, -2289081, -2293719, -2428619, -2331510, -2456078, -2488168, -2432274, -2411517, -2407601, -2479156, -2460475, -2414650, -2411467, -2398426, -2428123, -2389555, -2375601, -2339655, -2469371, -2365584, -2447195, -2382393, -2289976, -2394692, -2390899, -2350958, -2316225, -2434782, -2376614, -2437109, -2388919, -2318670, -2343153, -2410603, -2356657, -2497426, -2483995, -2359067, -2404054, -2454373, -2344088, -2349623, -2237902, -2344615, -2316762, -2412790, -2270114, -2300282, -2326435, -2345153, -2334196, -2320388, -2313445, -2281371, -2243635, -2219699, -2273729, -2234821, -2312686, -2349826, -2340919, -2280677, -2278829, -2270267, -2320631, -2333651, -2260412, -2224100, -2322482, -2260621, -2290695, -2214617, -2359667, -2361328]
2483b361328O5416K7338l429L6407p3194o2509R1033l0151M9668P9237m7886p2635
2471b302033R7701o5140r759L0079l8736K9565k9707j15071P4004k6012M6837
2460b308272l7392J7657n0691m2933p893P2240m057Q467l469k3777Q5844r1567
2448b385843o1947N0054K1800J8060j2493K77L2466N8392J4724l4980k7023L4552
2436b291961N4045q8973N7777p8886K5811k4115k900n522J0787m8289N4237K879
2424b335110L7049j2306O1295N8333K4356o2436K623J3380N8716j4020o5320K8030
2412b205410P5687N0080o3977N0437j08661P2824R1051p2119k7578N8670l0220
2401b109216K0182k8914M6204r688O8093l0478j11515j155J15376r673K9647P6156
$$ y = [-2361328, -2295912, -2268574, -2272003, -2235596, -2308790, -2371299, -2280266, -2310417, -2260749, -2181512, -2229398, -2302033, -2204332, -2269472, -2279231, -2249152, -2287888, -2258323, -2288030, -2403101, -2329097, -2355109, -2308272, -2345664, -2328007, -2378698, -2421631, -2429524, -2357284, -2361341, -2352874, -2356343, -2380120, -2294276, -2385843, -2447790, -2397736, -2375936, -2357876, -2370369, -2370092, -2337626, -2279234, -2264510, -2299490, -2326513, -2291961, -2237916, -2326889, -2269112, -2347998, -2322187, -2346302, -2349202, -2354724, -2343937, -2392226, -2337989, -2335110, -2298061, -2310367, -2249072, -2190739, -2166383, -2228819, -2226196, -2212816, -2154100, -2168120, -2233440, -2205410, -2129723, -2079643, -2143620, -2093183, -2201844, -2129020, -2037969, -2110088, -2137666, -2078996, -2109216, -2089034, -2117948, -2071744, -2081432, -2013339, -2043817, -2155332, -2156487, -2041111, -2050784, -2021137, -1944981]
2389a944981O0176J25916M2971R7270N5809J02265J53788J01417L0366J28754
2379a046249J37750M6437Q3917J68762P4792J49734J02597L03029L67390O74086
2369A062245R29739J340633K341040K560305J784638R61699J22473k97951k72110
2360A0532711q09142j580978k240984j969077j392779j026778o07181m89644l48497
2351F7651l00720j72674k37851k11389j63696j22863j74283k00924l5234r8182
2341a650165j28272j48753N4093q9339q325p4063J7720N1587j8681m044m8228
2330b046470J6945n3399l8377J5020J22044j03145j2832O6645o9563l724j3037
2319b119893k3358q084m3039k8310P5693m0368l0015M145n1202k8518l1206K5880
$$ y = [-1944981, -1884805, -1758889, -1715918, -1618648, -1562839, -1460574, -1306786, -1205369, -1175003, -1046249, -908499, -862062, -778145, -609383, -534591, -384857, -282260, 20769, 388159, 1062245, 1991984, 3332617, 5673657, 8233962, 10018600, 10980299, 11102772, 10804821, 10532711, 9723569, 8142591, 5901607, 3932530, 2539751, 1512973, 905792, 416148, 67651, -233069, -405743, -643594, -854983, -1018679, -1141542, -1315825, -1516749, -1551983, -1650165, -1778437, -1927190, -1873097, -1962436, -1970761, -2044824, -2027104, -1975517, -1994198, -1998242, -2046470, -2029525, -2082924, -2121301, -2106281, -1984237, -2087382, -2100214, -2033569, -2103132, -2106856, -2119893, -2143251, -2151335, -2194374, -2222684, -2146991, -2187359, -2217374, -2213229, -2264431, -2292949, -2324155, -2298275]
2307b298275k5307j0232n6217L7189K4077M6347N440L5243j7533n4887K6934k5079
2295b312300P172k9733O2369q4392L6345o6000J4697J900j8604K5460J2979l4659
2283b384766J6183J6131R826J03844q9054L6426L441o0154M828j5927k9352M0881
2271b347693J5584k2421j9019j4927k8314m1902L491j2917R2763n1807j3746L8813
2259b402095q577K2229k8738L3985j1728L431n4596N2058M1491L6200k6815o444
2247b349599L2502p3325K7128k9616K8115k1441J5903K6619j06p0487m7276M9231
2235b412352n4493M7267q0137L5298P5382j8497o572K8200J322N6983j6582n3785
2223b397966N9492l7375p2783K6026L4136l8815M1477j10915J7230j5734m5405
$$ y = [-2298275, -2323582, -2333814, -2390031, -2352842, -2328765, -2282418, -2276978, -2241735, -2259268, -2314155, -2287221, -2312300, -2305128, -2334861, -2272492, -2356884, -2320539, -2386539, -2371842, -2369942, -2388546, -2363086, -2350107, -2384766, -2368583, -2352452, -2342626, -2238782, -2327836, -2291410, -2287969, -2348123, -2343295, -2359222, -2388574, -2347693, -2332109, -2354530, -2373549, -2388476, -2416790, -2458692, -2455201, -2468118, -2375355, -2427162, -2440908, -2402095, -2410672, -2388443, -2417181, -2383196, -2394924, -2391493, -2446089, -2394031, -2352540, -2316340, -2343155, -2349599, -2317097, -2390422, -2363294, -2392910, -2364795, -2386236, -2370333, -2343714, -2343820, -2414307, -2461583, -2412352, -2466845, -2419578, -2499715, -2464417, -2389035, -2407532, -2414104, -2385904, -2384582, -2327599, -2344181, -2397966, -2338474, -2375849, -2448632, -2422606, -2388470, -2427285, -2385808, -2496723, -2479493, -2495227, -2540632]
2212b540632M4753N5263n8973N7775n521J0721J04624o2894l6140l5237M2503
2201b423758p6643q190j5790R852K9307j0810m9263n6079N719M011L7186n3692
2189b608150O6823J8267q3946O7109L2887m3891n0126J33920j44060R5232L9172
2178b476763l9589O8810N1014O247j6074O718l2444r242o9237Q0303o4863l8064
2166b533184Q981K5131j7007r5268P0182k5366N5828l4839o896J11026N34k770
2154b443648K7664N3528J5154J7276p6353J3729J2181L3263k2299J00228j4540
2143b283817r7320K8527l3842l2853m0867k8063M5676P045q504J9810m9903J8717
2131b455394j4561o5484Q551N1018j4750J3528N8458j3443J9622j4580K7165M1161
$$ y = [-2540632, -2495879, -2440616, -2499589, -2441814, -2447335, -2436614, -2331990, -2394884, -2431024, -2466261, -2423758, -2500401, -2508591, -2524381, -2514529, -2485222, -2496032, -2545295, -2601374, -2595655, -2591644, -2554458, -2608150, -2541327, -2523060, -2607006, -2539897, -2507010, -2550901, -2601027, -2467107, -2611167, -2515935, -2476763, -2516352, -2447542, -2396528, -2390281, -2406355, -2399637, -2432081, -2441323, -2510560, -2430257, -2495120, -2533184, -2524203, -2499072, -2516079, -2611347, -2541165, -2566531, -2510703, -2545542, -2552438, -2441412, -2440878, -2443648, -2415984, -2362456, -2347302, -2330026, -2406379, -2392650, -2380469, -2347206, -2369505, -2269277, -2283817, -2381137, -2352610, -2386452, -2419305, -2460172, -2488235, -2442559, -2435514, -2444018, -2424208, -2474111, -2455394, -2469955, -2535439, -2526888, -2475870, -2490620, -2477092, -2418634, -2432077, -2412455, -2427035, -2399870, -2358709]
2119b358709j02135j7683n664j205K7793p988J302l7576M1162r7757k8818M9311
2107b537967K2791q3758P4333l1802J8134N0815K5027r6133j1683O8993N317o5019
2095b560952K0102M9950L2248L8105R412p1474k260P0531j50673K3469N5742j07594
2083b593394J19732N0955p5028M3495Q561j4953n859J5070p4979P4872l4933M2357
2071b444104j3914P9040o2662J0545o2304K1534K4745o789K2743L9053K0271j18584
2059b490426L1762M6930q4781M4129n2146J2706N7256J7678m6697M0667O6868
2048b356054l295j07366K6640P4964j35696P1473L7812o1930j4715P4507m0680
2037b434340O5139n0946m9448J3434M9886l2225j1118J0495N9668n6397p9561
$$ y = [-2358709, -2460844, -2478527, -2484191, -2485396, -2457603, -2465591, -2464289, -2501865, -2460703, -2558460, -2587278, -2537967, -2515176, -2598934, -2524601, -2556403, -2538269, -2487454, -2462427, -2558560, -2570243, -2501250, -2495933, -2560952, -2540850, -2490900, -2458652, -2420547, -2411135, -2482609, -2484869, -2414338, -2565011, -2541542, -2485800, -2593394, -2473662, -2422707, -2497735, -2454240, -2445679, -2460632, -2466491, -2451421, -2526400, -2451528, -2486461, -2444104, -2458018, -2378978, -2441640, -2431095, -2493399, -2471865, -2447120, -2453909, -2431166, -2392113, -2371842, -2490426, -2458664, -2411734, -2496515, -2452386, -2504532, -2491826, -2434570, -2416892, -2463589, -2422922, -2356054, -2359349, -2466715, -2440075, -2365111, -2500807, -2429334, -2391522, -2453452, -2468167, -2393660, -2434340, -2369201, -2420147, -2469595, -2456161, -2406275, -2438500, -2449618, -2439123, -2379455, -2435852, -2515413]
2026b515413O7207L9753p1921M7K423j2893L8482o8093N3042L9814l3678j0408
2014b471638m2582k5010K9105k8560N1397N340m5707N4382o2448j7556L2686o1943
2002b582534R8297l1079K3815k4170J1685P145M7822l5286n8659M8365m9326R11
1990b543014q0633P6887R825J7793p4837M7248k1370P0681N323j21473J51363
1979b462207l5125m3315Q4730m2983l1169Q8266M6339J415q318o9055Q974J3367
1967b449081K9307m5159r532r588j5746M4839n5676N1766j9711P17j2926j1852
1955b502642P728P5300j6549k4308L6297O2155o8510J8200M7505o0496O3246n536
1943b367610l9963L5106k443m1143P020M0510j3820o1810P2731k2039n5880k8774
$$ y = [-2515413, -2448206, -2408453, -2480374, -2480327, -2477904, -2490797, -2452315, -2520408, -2467366, -2427552, -2461230, -2471638, -2514220, -2539230, -2510125, -2538685, -2487288, -2481948, -2527655, -2473273, -2535721, -2553277, -2520591, -2582534, -2484237, -2515316, -2491501, -2515671, -2503986, -2496841, -2449019, -2484305, -2542964, -2494599, -2543925, -2543014, -2623647, -2546760, -2536935, -2519142, -2593979, -2546731, -2568101, -2497420, -2492097, -2613570, -2462207, -2497332, -2540647, -2455917, -2498900, -2530069, -2441803, -2395464, -2394049, -2402367, -2471422, -2462448, -2449081, -2419774, -2464933, -2474465, -2484053, -2499799, -2454960, -2510636, -2458870, -2478581, -2477864, -2490790, -2502642, -2494914, -2419614, -2436163, -2460471, -2424174, -2362019, -2430529, -2412329, -2364824, -2425320, -2362074, -2367610, -2407573, -2372467, -2374910, -2416053, -2409033, -2368523, -2382343, -2444153, -2371422, -2393461, -2449341, -2478115]
1931b478115P5276q2716N7249j0012o4050J26108R747j10110O075P5076P034P3515
1919b314923p8406m6902Q5758K5228p4158o3688Q4765o9968N5338o1866n3398
1908b512220J4752K3583j269l3527L5964q0300M8978K8213o4867l511K0641M8682
1896b474881J0227L6819n2890L9901k4550M6091p8219J8287P7381j50452P7309
1885b474977l7669j8764N3537O4455j09634R7392J5608o8326M7921P4343p9159
1874b435273p295K2519j7831K493L3768m0157r631j051O7636r4965K0985O9589
1862b389213m88j3922p501N837l0633P4810O5190j45109K3339R3069j23546Q0560
1850b367607Q184j20937P7220l9257o1846L7937j3015O0613k3946K1562k2701
$$ y = [-2478115, -2402839, -2485555, -2428306, -2438318, -2502368, -2376260, -2366513, -2476623, -2470548, -2395472, -2388438, -2314923, -2393329, -2440231, -2354473, -2329245, -2403403, -2467091, -2382326, -2452294, -2396956, -2458822, -2512220, -2497468, -2473885, -2475154, -2508681, -2472717, -2553017, -2504039, -2475826, -2540693, -2544204, -2523563, -2474881, -2464654, -2427835, -2480725, -2440824, -2465374, -2419283, -2497502, -2479215, -2401834, -2552286, -2474977, -2512646, -2531410, -2477873, -2413418, -2523052, -2425660, -2410052, -2478378, -2430457, -2356114, -2435273, -2442568, -2420049, -2437880, -2435387, -2401619, -2441776, -2451407, -2452458, -2384822, -2479787, -2458802, -2389213, -2389701, -2403623, -2411124, -2405287, -2435920, -2361110, -2295920, -2441029, -2417690, -2324621, -2448167, -2367607, -2359423, -2480360, -2403140, -2442397, -2504243, -2466306, -2479321, -2418708, -2442654, -2421092, -2443793]
1839b443793K0262q15j6934L9362m9168P020k4229l7288L2557M3386j7887L3500
1827b414027j3615L7430j5972l2465J29237n9169p671N5941j21040l584N0735
1816b394200j16651p1854Q9232L358J7100K9418J097o2914K9545K6181q1576R6733
1804b434531K1366K3938K7812J25904r2884L3858l5203m6874j8470m0394r945
1793b445423O3969L3946j9504o9566J6910R844m1880m030O4082o0566j9732L3161
1781b438789m3502L4225M2000j9838P058j0924q5665J07136L835O4795J1838k1338
1769b349169l0783J04295j15081O570l7650l134Q358L2986o8132n82M9844j1949
1757b414427m3525l2068M1569k8840K9197L6866r6973j7605J69042p2425O0584
$$ y = [-2443793, -2423531, -2424346, -2441280, -2401918, -2451086, -2444066, -2468295, -2505583, -2473026, -2429640, -2447527, -2414027, -2427642, -2390212, -2406184, -2438649, -2309412, -2368581, -2376252, -2320311, -2441351, -2444935, -2394200, -2510851, -2582705, -2493473, -2490115, -2473015, -2443597, -2442500, -2505414, -2475869, -2449688, -2531264, -2434531, -2413165, -2389227, -2361415, -2235511, -2328395, -2294537, -2329740, -2376614, -2395084, -2435478, -2445423, -2381454, -2347508, -2367012, -2436578, -2419668, -2409824, -2451704, -2455734, -2391652, -2452218, -2471950, -2438789, -2482291, -2448066, -2406066, -2425904, -2418846, -2429770, -2515435, -2408299, -2404464, -2339669, -2327831, -2349169, -2379952, -2275657, -2390738, -2384168, -2421818, -2424952, -2416594, -2383608, -2451740, -2452322, -2402478, -2414427, -2457952, -2490020, -2448451, -2477291, -2448094, -2411228, -2508201, -2525806, -2356764, -2429189, -2368605]
1746b368605n3015M2759j6963L6713p9845l5411Q7652J43093j26111L329O5569
1735b300835n0821l1317M7590p0148K5728k3177k2202k8091P9102o5904k0284
1724b460359O9505l1262m3542q6608J15552r6072Q1653O2328P153j8507R7768
1713b302391j16394K2579L7429n3667N9123o0010J4366P4120j2975J6132N5628
1702b266060k6847o3772K7685k2941Q880j7894J5213K3384n3025m0317m7259j2852
1690b475805n2801L2491j0897L4939N8387n8562Q7699N5065j2453J3185N8452
1679b270300n0989J065K9641m2385M0450R2p6494K4711J1706j18850K020J05622
1667b343711j11525n067J8170N2567n1043N0890j8357p8519K6869L7623q2985
$$ y = [-2368605, -2421620, -2378861, -2395824, -2359111, -2438956, -2474367, -2386715, -2243622, -2369733, -2366404, -2300835, -2351656, -2382973, -2335383, -2405531, -2379803, -2402980, -2425182, -2453273, -2374171, -2440075, -2460359, -2390854, -2422116, -2465658, -2552266, -2436714, -2532786, -2451133, -2388805, -2381652, -2400159, -2302391, -2418785, -2396206, -2358777, -2412444, -2353321, -2413331, -2398965, -2324845, -2337820, -2321688, -2266060, -2292907, -2356679, -2328994, -2351935, -2343055, -2360949, -2345736, -2322352, -2375377, -2415694, -2462953, -2475805, -2528606, -2496115, -2507012, -2472073, -2413686, -2472248, -2384549, -2329484, -2341937, -2328752, -2270300, -2321289, -2320224, -2290583, -2332968, -2292518, -2292426, -2368920, -2344209, -2332503, -2451353, -2449333, -2343711, -2455236, -2460303, -2442133, -2389566, -2440609, -2389719, -2408076, -2486595, -2459726, -2422103, -2505088]
1656b505088L4574Q2397K86L005Q0757j5031q8456J37827M8123j64218O2367k9669
1644b353126k2088P6467L0110p6340k6556L1280r9718r6426j249Q5837l8575N0037
1632b440347j1763r73m2852Q5813n962l8491J17225o9174j2053J08408p7086j5885
1620b403140O2895J4071o3215k597p9840N6148o4680L5033J25786j0385k7041
1609b356965k708q012K0296J8472m9083K865J1351K4041J5833M075N2450k4425
1597b291810M8904p3388k3620l052M2071M61k5464K6910j7446l351j6401O0729
1585b275457n2199k0484l1926L9196l854L1336k2287o053J41398n6333m1943M0619
1573b257987o3023J0549L0502o9039j4300L5454k3649M3169l4699p652j0902l0863
$$ y = [-2505088, -2470514, -2388117, -2387831, -2384826, -2304069, -2319100, -2407556, -2269729, -2221606, -2385824, -2323457, -2353126, -2375214, -2298747, -2268637, -2344977, -2371533, -2340253, -2439971, -2536397, -2537646, -2451809, -2490384, -2440347, -2452110, -2453083, -2495935, -2410122, -2416084, -2454575, -2337350, -2406524, -2418577, -2310169, -2387255, -2403140, -2340245, -2326174, -2389389, -2391986, -2471826, -2415678, -2480358, -2445325, -2319539, -2329924, -2356965, -2359673, -2367685, -2347389, -2328917, -2378000, -2375135, -2363784, -2339743, -2323910, -2319835, -2267385, -2291810, -2242906, -2316294, -2339914, -2342966, -2300895, -2300434, -2325898, -2298988, -2316434, -2319785, -2336186, -2275457, -2327656, -2348140, -2380066, -2340870, -2344724, -2313388, -2335675, -2341728, -2200330, -2256663, -2298606, -2257987, -2321010, -2310461, -2279959, -2348998, -2363298, -2327844, -2351493, -2308324, -2343023, -2350675, -2361577, -2392440]
1561b392440j8448l3366L5463R8697P0359j49663J9587L4917m7339k157j0749
1550b395139o3987K9489R7117j0228j15853R7849O2028l7584l1562K8509j34702
1539b474063M5690L6415m05J1563J6889Q957m7590R1245r9378L2545P9970J1002
1527b287160m4010m574P5745q1048L1320M8701n9034m2345j4505j6104K7747N2308
1515b312959j04988R2555k1615K7521p1448m5969J49342n014K6867K3291K4131
1504b218286k2651M9147l4125k3626J8137m4029K043o4446R956J6459p996k1785
1492b341202N9220k8495p6204L0516j9248J7985q281J0731K9578n1213Q4303k0420
1480b312730k8630K122O0299r0456R8969l2286L099O8717P632r0819j4722K9681
$$ y = [-2392440, -2410888, -2444254, -2408791, -2310094, -2239735, -2389398, -2369811, -2334894, -2382233, -2384390, -2395139, -2459126, -2429637, -2332520, -2342748, -2458601, -2360752, -2298724, -2336308, -2367870, -2339361, -2474063, -2428373, -2391958, -2392363, -2380800, -2363911, -2354954, -2402544, -2311299, -2410677, -2378132, -2298162, -2287160, -2331170, -2335744, -2259999, -2341047, -2309727, -2261026, -2320060, -2362405, -2376910, -2393014, -2365267, -2312959, -2417947, -2325392, -2347007, -2319486, -2390934, -2436903, -2287561, -2292575, -2265708, -2242417, -2218286, -2240937, -2191790, -2225915, -2249541, -2231404, -2275433, -2273390, -2337836, -2327880, -2311421, -2319417, -2341202, -2281982, -2310477, -2386681, -2356165, -2375413, -2357428, -2365709, -2354978, -2325400, -2376613, -2292310, -2312730, -2341360, -2339238, -2278939, -2369395, -2270426, -2302712, -2299613, -2230896, -2223264, -2314083, -2328805, -2299124]
1468b299124O395l2967l487m6561N426Q1039j0469r5316K3874l3373L9314Q947
1456b356302p4761k628J40650j0500m5813R7780m6463K9780K2167l0983o4319
1445b341392N6517K7623p5345L366O6140m4159J12094k9128k0338q0277Q204k3161
1433b339856j3171j6503P3400J2261n3822K6040l5033O149m8711P1868L0190r3639
1421b380827M1433J3078O4128m7207R537L070j8975L6308j1347L8729n477O3965
1409b193585o8303M7299j9568q5257L3182M1268j7255n9591O6802p0559M7362
1398b278205p749K7724j1132k5666n4867K9958m9928N037R5829Q189n8774R1902
1386b227682p3954K9159J1119P6365o4597o3497P1973o3861k2421R818o313L3884
$$ y = [-2299124, -2292729, -2325696, -2329183, -2375744, -2370318, -2289279, -2299748, -2395064, -2371190, -2404563, -2365249, -2356302, -2431063, -2433691, -2293041, -2303541, -2349354, -2251574, -2298037, -2268257, -2246090, -2277073, -2341392, -2284875, -2257252, -2332597, -2329231, -2263091, -2307250, -2195156, -2224284, -2244622, -2324899, -2316695, -2339856, -2353027, -2369530, -2296130, -2283869, -2337691, -2311651, -2346684, -2340535, -2389246, -2317378, -2287188, -2380827, -2339394, -2326316, -2262188, -2309395, -2299858, -2296788, -2315763, -2279455, -2290802, -2252073, -2257550, -2193585, -2261888, -2214589, -2234157, -2319414, -2286232, -2244964, -2262219, -2321810, -2255008, -2325567, -2278205, -2285954, -2258230, -2269362, -2295028, -2349895, -2319937, -2369865, -2364828, -2268999, -2260810, -2319584, -2227682, -2301636, -2272477, -2261358, -2184993, -2249590, -2313087, -2241114, -2304975, -2327396, -2317578, -2323891, -2290007]
1374b290007L0605m0744r219L9291q4779l4187O0882N7556n4979r657P9246r2275
1362b348267J7931J4644M0630p6550M3211j369m8054J31706k7138l9876N3531
1351b239601m6724l6488J1021N3906J6413o5304j2613L3148j3434M410p6842Q3835
1339b288273n1530k0328l5561M8148P3933M5407J6598l8193k3172k4181k6560
1328b323712P9546O2975j03719N9218J4234j00722M3629l083M6669r622M663m755
1316b234679m0514L4912P442j570L7796m2371o8044P448K731o0723M9317R851
1304b298404n7020m653Q0118p1700Q6121N0417j4660K1597N1152j3121n98j1282
1292b182033J5013p8184L4585m2520k2304L6565r0294K0889N3561k6770n8234
$$ y = [-2290007, -2259402, -2300146, -2309365, -2270074, -2354853, -2389040, -2328158, -2270602, -2325581, -2335238, -2255992, -2348267, -2330336, -2315692, -2275062, -2351612, -2308401, -2309770, -2357824, -2226118, -2253256, -2293132, -2239601, -2286325, -2322813, -2311792, -2257886, -2241473, -2306777, -2319390, -2286242, -2299676, -2295266, -2372108, -2288273, -2339803, -2360131, -2395692, -2347544, -2273611, -2228204, -2211606, -2249799, -2272971, -2297152, -2323712, -2244166, -2181191, -2284910, -2225692, -2211458, -2312180, -2268551, -2271634, -2224965, -2234587, -2229924, -2234679, -2275193, -2240281, -2232839, -2234409, -2196613, -2238984, -2307028, -2299580, -2296849, -2357572, -2308255, -2298404, -2355424, -2360077, -2279959, -2351659, -2265538, -2215121, -2229781, -2208184, -2157032, -2170153, -2170751, -2182033, -2167020, -2245204, -2210619, -2253139, -2275443, -2238878, -2329172, -2308283, -2254722, -2281492, -2339726]
1281b339726R9026m2383j8693K0616k6683Q1910p5504k9006J6551L5179m297j1090
1269b294100J488P4573l071j01343J11573k5700M0875l4468j175j9516k6586O9790
1257b207660K2927m6109o9720O6014k8258r7474Q8566N33M3400O8350j4844r5962
1245b270237K4507M0492P8570j35500N3058M4954l2931K8645O1454j8449Q66m4765
1233b169336r2212J1538P3069m3200k9096P4120k6341m9746M3002L1693Q948n1316
1221b218877M0909q6026J8704K9475l7212N2280J5653K6870M053n6458L886k3231
1209b229974J5927P7954p7219k9381L8774K5815k0030n5527J6696L1453j8753
1198b224265p1880j8800L0860L3404l3318r167L6627M5852p0295k1357P0897r6251
$$ y = [-2339726, -2240700, -2283083, -2301776, -2281160, -2307843, -2225933, -2301437, -2330443, -2313892, -2278713, -2283010, -2294100, -2292612, -2218039, -2221110, -2322453, -2210880, -2236580, -2195705, -2230173, -2231348, -2250864, -2277450, -2207660, -2184733, -2230842, -2300562, -2234548, -2262806, -2360280, -2271714, -2271181, -2227781, -2159431, -2174275, -2270237, -2245730, -2205238, -2126668, -2262168, -2209110, -2164156, -2197087, -2168442, -2106988, -2125437, -2124571, -2169336, -2261548, -2250010, -2176941, -2220141, -2249237, -2175117, -2201458, -2251204, -2208202, -2176509, -2167561, -2218877, -2177968, -2263994, -2245290, -2215815, -2253027, -2200747, -2185094, -2158224, -2154171, -2210629, -2206743, -2229974, -2214047, -2136093, -2213312, -2242693, -2203919, -2178104, -2198134, -2253661, -2236965, -2205512, -2224265, -2296145, -2314945, -2284085, -2250681, -2283999, -2293166, -2256539, -2210687, -2280982, -2302339, -2231442, -2327693]
1186b327693P5958L8875l9970K74M2299l7489p541Q0443n688k6679P015J6439
1174b183757m3006P6982R952l4376n2647j019k6063K0451j9295j19014R8740L1795
1162b241257q4471N5767M8573L5954R212n9710Q90P0565M1120l1230L4131k0180
1150b140636k7254o858L5670m1633m0397M9649R112l4713j3448R949P1552l6222
1138b165229l5874m9508J46265r5726O0187k1890P088l1455p392n2203l0303N9563
1126b216477Q837m4608N7165N7581k8170n5786J29440j668n4032l5948N1938L874
1114b127854N796r1061j6306O2080j6123l5694L1154N5448j45168K0989J20954
1103b135785p4254k0710O3624J7646K4554n8584j4080J524P6403j24228p5819
$$ y = [-2327693, -2251735, -2212860, -2252830, -2252556, -2210257, -2247746, -2255287, -2174844, -2180532, -2207211, -2200196, -2183757, -2226763, -2149781, -2139829, -2174205, -2226852, -2227871, -2253934, -2233483, -2252778, -2371792, -2273052, -2241257, -2325728, -2269961, -2221388, -2185434, -2176222, -2235932, -2235042, -2164477, -2123357, -2154587, -2120456, -2140636, -2167890, -2174748, -2139078, -2180711, -2221108, -2171459, -2162347, -2197060, -2210508, -2200559, -2129007, -2165229, -2201103, -2250611, -2104346, -2200072, -2139885, -2161775, -2154687, -2186142, -2193534, -2245737, -2276040, -2216477, -2207640, -2252248, -2195083, -2137502, -2165672, -2221458, -2092018, -2093686, -2147718, -2183666, -2131728, -2127854, -2122058, -2213119, -2229425, -2167345, -2183468, -2219162, -2188008, -2132560, -2277728, -2256739, -2135785, -2210039, -2230749, -2167125, -2149479, -2124925, -2183509, -2197589, -2196065, -2119662, -2243890, -2319709]
1092b319709L8663J01420r0893L8767N4956L0743n858j6352K531M4446j2259n7245
1080b190790L8975M1045k6637j8753N5662m9997p9341Q549n2543M9581M9004j6741
1068b191986K7956K4554q8215N374J04793l8383n1738M460O886M7605K4424o3472
1056b187742L1846L1699l1658J1857l6926J11572l6810j6473k222K5745n9203
1045b158315O9646k9597j7657N611j5354k6201N3912q88k8074N3597K7872n1952
1033b117400N2392K9454j5186m7135L3162m2036J0703L7704l0296O558o519p8048
1021b166647l3741N9997k8777m2008l6362O4122l2883M8322P8430p8026K6565
1010b141008Q1202m5912o4395L8735m1911O2240M8538j48029N5205O0907M59q9843
$$ y = [-2319709, -2281046, -2179626, -2270519, -2231752, -2176796, -2146053, -2151911, -2168263, -2165732, -2121286, -2133545, -2190790, -2151815, -2110770, -2137407, -2156160, -2100498, -2150495, -2229836, -2221287, -2273830, -2224249, -2175245, -2191986, -2164030, -2139476, -2227691, -2222317, -2117524, -2155907, -2207645, -2203185, -2196299, -2148694, -2124270, -2187742, -2155896, -2124197, -2155855, -2143998, -2180924, -2069352, -2106162, -2122635, -2124857, -2099112, -2158315, -2088669, -2118266, -2135923, -2130312, -2145666, -2171867, -2117955, -2118843, -2146917, -2093320, -2065448, -2117400, -2065008, -2035554, -2050740, -2097875, -2064713, -2106749, -2096046, -2058342, -2088638, -2082080, -2088599, -2166647, -2200388, -2140391, -2169168, -2211176, -2247538, -2183416, -2216299, -2167977, -2089547, -2167573, -2141008, -2059806, -2105718, -2170113, -2131378, -2173289, -2111049, -2062511, -2210540, -2155335, -2094428, -2093969, -2183812]
998b183812O5461k4797J0815J5151l4796j020J5622N2532r0584k1293j3859L4116
986b176464r479J2703J167p5132O4655j7877J04057m0725n0782L0616L0454j5650
974b142457N8140N2940l6189N550o3087n7583k858N3748j5460L7695J02289j03960
962b111232l4869M7292L1049j2687J9764J2801k8167j5499L4132R890m0650k1764
950b109940P9935p3491L9862K4756k9028O3287P5081j09360K901R5354j05367
939b046010M237n6582j3107L6434o2341K762o608M8261j20695J43177m3169N0939
927b062702o8922O2617L5284l3819j7424O7246J4627n5878Q1485r6479N9871O097
915b007997o3732n2510N0432M917j18800J14413R949k9872k7460M6652L8477j2725
$$ y = [-2183812, -2118351, -2143148, -2132333, -2117182, -2151978, -2152998, -2137376, -2084844, -2175428, -2196721, -2210580, -2176464, -2185943, -2173240, -2172073, -2247205, -2182550, -2200427, -2096370, -2137095, -2187877, -2157261, -2126807, -2142457, -2084317, -2031377, -2067566, -2062016, -2125103, -2182686, -2185544, -2131796, -2147256, -2109561, -2007272, -2111232, -2146101, -2098809, -2067760, -2080447, -2060683, -2047882, -2076049, -2091548, -2057416, -2047526, -2088176, -2109940, -2030005, -2103496, -2063634, -2038878, -2067906, -2004619, -1929538, -2038898, -2035997, -1940643, -2046010, -2041773, -2098355, -2111462, -2075028, -2137369, -2134607, -2141215, -2092954, -2213649, -2070472, -2113641, -2062702, -2131624, -2069007, -2033723, -2067542, -2084966, -2017720, -2003093, -2058971, -1977486, -2073965, -2014094, -2007997, -2071729, -2124239, -2073807, -2068890, -2187690, -2073277, -2063328, -2093200, -2120660, -2074008, -2035531, -2048256]
903b048256l5367r2620O2752o0668L6287n0554J59537l7176Q2757q7793l9486
892b110587L4081K0190j301K3845r614l8296J637J2744m8089n6695M6777J02913
880b022395j58615L0323K704l9505R4922L2917j05801N6766Q27l0061J7379O3746
868b056793L3828n7438L0439J7513k8964m1150R944P190N3269n9266Q922K495
856b080011N2178q3842J9007P8452m8060P7554l1519l6334J7793K0290n2391O6714
844b000169K3207o9381o166K9555k0272J4155P579r040j9748L7172m3777j1043
832b067928K5234j8781l2973O1364K3085j19113R2691M1259o9702K4309k8626
821b069181K5851L7675N5624r2462p82J0602K2769J4629M1552k7843q1581O2966
$$ y = [-2048256, -2083623, -2176243, -2113491, -2174159, -2137872, -2188426, -2028889, -2066065, -1983308, -2071101, -2110587, -2076506, -2056316, -2057617, -2033772, -2043386, -2081682, -2080045, -2067301, -2115390, -2172085, -2125308, -2022395, -2181010, -2150687, -2147983, -2187488, -2092566, -2059649, -2165450, -2108684, -2107857, -2137918, -2120539, -2056793, -2022965, -2080403, -2049964, -2032451, -2061415, -2102565, -2092621, -2085431, -2032162, -2091428, -2082506, -2080011, -2027833, -2111675, -2092668, -2014216, -2062276, -1984722, -2016241, -2052575, -2034782, -2014492, -2066883, -2000169, -1976962, -2046343, -2052509, -2022954, -2043226, -2029071, -2021492, -2030532, -2050280, -2013108, -2056885, -2067928, -2042694, -2061475, -2094448, -2033084, -2009999, -2129112, -2036421, -1995162, -2064864, -2040555, -2069181, -2043330, -2005655, -1950031, -2042493, -2043275, -2032673, -2009904, -1995275, -1953723, -1981566, -2063147, -2000181]
809b000181r9001n7211L490J29517k7633L0334r1535K3149P0719m482K0632r590
797b011792k9324M6812l6663J4450k4140L4459K0731m110j16706K6932j2413M8498
785b043266L2099k7571k3904L129l5380j2215p0266j8600J42641L851J6255M5836
773a987391M555K08Q30K0665O8062j14887n3427K6773L2002P520K1006o4029K1648
760b016465K110o9934j9779O1308j4710l4093R2684j8632m919m9006Q0947j7234
748b007723n1975M3546M3216K0208L3695p0906N2899j5520L4571n3688q718j972
736a982367O5518n8338m0996n401N617L7126k7258M2902m7654n6737L4653J2773
724b020162l6977N0075J10010p5533J8676N466n2854P7623k8235L3676J6946l6031
$$ y = [-2000181, -2099182, -2156393, -2152903, -2023386, -2051019, -2020685, -2112220, -2089071, -2018352, -2022834, -2002202, -2011792, -2041116, -1994304, -2030967, -2016517, -2040657, -2006198, -1985467, -1989577, -2106283, -2079351, -2091764, -2043266, -2011167, -2038738, -2062642, -2059513, -2094893, -2107108, -2177374, -2195974, -2053333, -2049482, -2033227, -1987391, -1982836, -1982628, -1981798, -1961133, -1893071, -2007958, -2061385, -2034612, -2002610, -1995090, -1974084, -2038113, -2016465, -2014355, -2084289, -2104068, -2042760, -2057470, -2091563, -1998879, -2017511, -2022430, -2071436, -1990489, -2007723, -2059698, -2016152, -1972936, -1952728, -1919033, -1989939, -1937040, -1952560, -1917989, -1971677, -1980395, -1982367, -1916849, -1975187, -2016183, -2021584, -2015967, -1978841, -2006099, -1963197, -2010851, -2067588, -2032935, -2020162, -2057139, -2007064, -1897054, -1972587, -1953911, -1948445, -2001299, -1923676, -1951911, -1918235, -1901289, -1937320]
712a937320j29878R4294p585K2702J4863m9312q93J259o7496p167L725Q0699j3523
699a995632L1759o6720R9787j07699J30934o8840Q034N8625k1860l1944M2928
688a920628q8717l0792J03546l7273l8189k1992M3277P9090q3575k3081P9625
677a938709l8296k8879K1075K5215p9831J8412O3144N7119m0142L7482n3217L5061
665a921566P3273p9745m7800J4182o3850M1590J4746k6812k1367L4597q516Q061
653a983207l6710M4351J1049K347L7288R72l7677O2310k9058j29995J28178Q62
641a929290J275J2520q3195Q1003M7079j02699J3260P0161q1161K8314n1848p620
629b002201J849k6855O7077r244K2981l9792L5887r1892O3075L1223L4954L942
$$ y = [-1937320, -2067198, -1972904, -1980489, -1957787, -1942924, -1992236, -1993129, -1991870, -2059366, -2066533, -2062808, -1982109, -1995632, -1963873, -2030593, -1930806, -2038505, -1907571, -1976411, -1968377, -1909752, -1931612, -1963556, -1920628, -2009345, -2040137, -1936591, -1973864, -2012053, -2034045, -1990768, -1911678, -1995253, -2018334, -1938709, -1977005, -2005884, -1984809, -1959594, -2039425, -2021013, -1957869, -1900750, -1940892, -1903410, -1956627, -1921566, -1848293, -1928038, -1975838, -1961656, -2025506, -1983916, -1969170, -1995982, -2017349, -1982752, -1991268, -1983207, -2019917, -1975566, -1964517, -1962170, -1924882, -1923910, -1961587, -1899277, -1928335, -2058330, -1930152, -1929290, -1928015, -1915495, -1998690, -1917687, -1870608, -1973307, -1960047, -1889886, -1971047, -1942733, -1994581, -2002201, -2000352, -2027207, -1960130, -1969374, -1946393, -1986185, -1950298, -2042190, -1979115, -1947892, -1912938, -1908996]
617a908996n5764L7788K4845K2015m0547l8163J4447P8176n8308k205q0758j8422
605b025892P1807O5910l2773N752j4073N2166j03006j2903Q1344R2927m7980M7356
593a819365j09980J7738P9075m6693q5153J02828L1303k9495j3368N499k0873
582a888484o7039J31333o7027o6279j8895K1028m7163J18486o8208l0330Q1704
571a900874J4725j4076k7031M3724m8396k5161P2023l3188O6894r6727J1524M793
559a931770K9159J5322j6690M3771k7669l5050r5898J29072n2256N0820r9511
548a990700k0504P4216q787o326m5080R0547n980p2542M7211L0256m6885O422
536a948152J24253k1252K9928p8980J45k1009k8902P6621k5685j605n1312L1666
$$ y = [-1908996, -1964760, -1926972, -1902127, -1880112, -1920659, -1958822, -1944375, -1866199, -1924507, -1926712, -2007470, -2025892, -1954085, -1888175, -1920948, -1915196, -1929269, -1877103, -1980109, -1993012, -1911668, -1818741, -1866721, -1819365, -1929345, -1911607, -1832532, -1879225, -1964378, -1861550, -1830247, -1859742, -1873110, -1867611, -1888484, -1955523, -1824190, -1891217, -1957496, -1976391, -1955363, -2002526, -1884040, -1952248, -1982578, -1900874, -1886149, -1900225, -1927256, -1883532, -1931928, -1957089, -1885066, -1918254, -1851360, -1948087, -1936563, -1931770, -1902611, -1887289, -1903979, -1860208, -1887877, -1922927, -2018825, -1889753, -1942009, -1891189, -1990700, -2011204, -1936988, -1945775, -1952101, -1997181, -1906634, -1912614, -1985156, -1937945, -1907689, -1954574, -1948152, -1823899, -1845151, -1815223, -1894203, -1894058, -1915067, -1943969, -1867348, -1893033, -1894638, -1945950, -1914284]
524a914284N1396l4921p2230M3423M9659L2537j00162j692L5996L7763n7383L1718
512a898180j9246P1489j10435O7052q3374O3466J43504J4464j01430M6365Q829
501a797496m4543O5084N096l9564n1856L2396k8072j01372M0693K9405M8401M3733
489a798095j11119m181N2310N6506q8565J15601o1949j8777K5431M5889o4683
478a851632N4806n0385J3930Q2490p7168q5441l5224R7034N236m263J2931l454
466a841140k8913L4766l9052q1915O5381M9417j7584K7476o0029l9952M3917P9941
454a807687j23194M0952Q1189l286n1272p4967p532J5319O8908q4093j8746M7459
442a916950l4009P9991J83m1974L0753J7384M586N5145j5551j17181J19292L2072
$$ y = [-1914284, -1862888, -1897809, -1970039, -1926616, -1876957, -1844420, -1944582, -1946274, -1910278, -1872515, -1929898, -1898180, -1917426, -1845937, -1956372, -1889320, -1972694, -1909228, -1765724, -1751260, -1852690, -1806325, -1797496, -1842039, -1776955, -1771859, -1811423, -1863279, -1830883, -1858955, -1960327, -1919634, -1890229, -1841828, -1798095, -1909214, -1913395, -1861085, -1804579, -1893144, -1777543, -1839492, -1858269, -1832838, -1786949, -1851632, -1796826, -1847211, -1833281, -1750791, -1827959, -1913400, -1948624, -1851590, -1846354, -1850617, -1837686, -1841140, -1870053, -1835287, -1874339, -1956254, -1890873, -1841456, -1859040, -1831564, -1891593, -1931545, -1887628, -1807687, -1930881, -1889929, -1808740, -1812026, -1863298, -1938265, -1945797, -1930478, -1861570, -1945663, -1964409, -1916950, -1950959, -1870968, -1870785, -1912759, -1882006, -1864622, -1860036, -1804891, -1820442, -1937623, -1818331, -1786259]
430a786259N376l7740O6297l6921L382n406J006J0033q1642L7977r7844q922P0903
417a859760p7982O9087M3371j201r71M6209K8798j5184l1801J8383L8603k7108
405a769556m4427K5001M7034K0729l0627M3359m1067p2662L3493K2642o628m5444
393a818153K4413p4716M8337l3524q054n7184N0915N6153o4983P3889J9884n2767
381a835790K2857M5352m6114k8397Q6532j2455M8658j9830m9581J0949K752j6843
369a791910p2289l8859l3913J13560p0619P0353M843p761J859j9973l3580J50
357a878139N4981M2705q189p9730L8068P96J4780M61m3726j139K4120P3134n0846
344a812724Q056j9420N7834n378l8690K1246l1931o72j4561Q2236q5760M6377
$$ y = [-1786259, -1780883, -1818623, -1752326, -1789247, -1785865, -1791271, -1790265, -1780232, -1861874, -1823897, -1921741, -1930663, -1859760, -1937742, -1868655, -1825284, -1826485, -1827456, -1781247, -1752449, -1767633, -1799434, -1781051, -1742448, -1769556, -1813983, -1788982, -1741948, -1721219, -1751846, -1708487, -1749554, -1822216, -1788723, -1766081, -1772709, -1818153, -1793740, -1868456, -1820119, -1853643, -1861697, -1918881, -1867966, -1811813, -1876796, -1802907, -1783023, -1835790, -1812933, -1767581, -1813695, -1842092, -1755560, -1768015, -1719357, -1739187, -1788768, -1777819, -1775067, -1791910, -1864199, -1903058, -1936971, -1823411, -1894030, -1823677, -1818834, -1826595, -1824736, -1844709, -1878289, -1878139, -1823158, -1780453, -1788642, -1868372, -1830304, -1829508, -1814728, -1814267, -1857993, -1859132, -1835012, -1761878, -1812724, -1804668, -1824088, -1766254, -1771632, -1810322, -1789076, -1821007, -1821679, -1836240, -1754004, -1839764, -1793387]
332a793387J11708m137j19041O9566l3950p3071K7392K7445L5579j747r993l8062
320a801698K8510L2944m6300N2932m4148R509k6916n3196N1382Q1536l1886O9343
308a677988k2020n1015M4925M3646m3992l1767K3275l3757L1990n3572l3045J0538
296a792782Q3902J7K884q9082O7990J2367o2949L3436J6750N002M56J6626q410
283a713793j6396l5223N433P8091j8220j1507l3664M8449l7949l6790O218n038
271a770389m1811J6514P4301k6990K3572j3245j0818n7376K2248m8963N6026Q1151
259a695780k1129j31653R0942L1132o3096M2437K813k4986M5903l8437n0606R4296
247a718164n9343l2947J1219m7683L0384J675L1336K8703M7860j10332k5560Q0552
$$ y = [-1793387, -1681679, -1685816, -1804857, -1735291, -1769241, -1842312, -1814920, -1787475, -1751896, -1753643, -1763636, -1801698, -1773188, -1740244, -1786544, -1733612, -1777760, -1768251, -1795167, -1848363, -1796981, -1715445, -1747331, -1677988, -1700008, -1751023, -1706098, -1662452, -1706444, -1738211, -1714936, -1748693, -1716703, -1770275, -1803320, -1792782, -1708880, -1708863, -1705979, -1795061, -1727071, -1714704, -1777653, -1744217, -1727467, -1722465, -1722009, -1705383, -1713793, -1730189, -1765412, -1759979, -1681888, -1700108, -1711615, -1745279, -1696830, -1734779, -1771569, -1765351, -1770389, -1812200, -1795686, -1721385, -1748375, -1724803, -1738048, -1748866, -1806242, -1783994, -1832957, -1776931, -1695780, -1716909, -1848562, -1757620, -1726488, -1789584, -1747147, -1744334, -1769320, -1723417, -1761854, -1812460, -1718164, -1777507, -1810454, -1799235, -1846918, -1816534, -1814859, -1783523, -1754820, -1706960, -1817292, -1842852, -1762300]
235a762300k9061O7262o7130L2389o8040J10441J3643n077j2307O5884p5526k3142
223a752964L0918p9788J21336j3643l1890J2086j3284J7264L2271l5901j8577
212a732172O9995R791n5771q8211l579P2899N7369p86k6568K5286j2030J0228
200a673549K5807j9270o1137P7710K5738n3227n0346N6076o7098N0410m2376l726
188a734988N1969j14725J2399J54743q4638J2112O2807n4928m737l9245m7531
177a786762M9253K2218n372k5831q6620P8508j9366M3240j4181r9423L7836J06692
165a699808p0084M7604M7050P003j9179m317k2297K9199l3383M7047m9475q2354
153a802994K2899O0684K8776J0239O562j16792M5751k2282Q317j180k5057P5981
$$ y = [-1762300, -1791361, -1724099, -1791229, -1758840, -1826880, -1716439, -1702796, -1707873, -1720180, -1654296, -1729822, -1752964, -1722046, -1801834, -1680498, -1694141, -1726031, -1713945, -1727229, -1709965, -1677694, -1713595, -1732172, -1662177, -1652386, -1708157, -1796368, -1799947, -1727048, -1669679, -1670465, -1697033, -1671747, -1683777, -1673549, -1647742, -1667012, -1728149, -1650439, -1624701, -1677928, -1728274, -1672198, -1739296, -1688886, -1731262, -1734988, -1683019, -1797744, -1785345, -1630602, -1715240, -1703128, -1640321, -1695249, -1699986, -1739231, -1786762, -1737509, -1715291, -1720663, -1746494, -1833114, -1754606, -1773972, -1730732, -1744913, -1844336, -1806500, -1699808, -1769892, -1722288, -1675238, -1668235, -1687414, -1691731, -1714028, -1684829, -1718212, -1671165, -1720640, -1802994, -1780095, -1719411, -1690635, -1680396, -1673834, -1790626, -1744875, -1767157, -1758840, -1760020, -1785077, -1709096]
141a709096j4564k399K2687p1057K9832Q0264l5615m8700k89m9947J35457J9813
129a643614k5531L854M0L3756l1930k8459o091L7929k4904J1704m6187J7143J4571
116a687719l5899J1957j5006k0742N5506q8082J0250N0372l1199N1646M5602n2723
104a706037m7113m602j9432P5570M0752p5819K4736J0180n7938J0353Q960p0426
92a810816L0605K4138O5290l7334p1325O7855K9136O1613j08218m3747K9752P56
80a762295j3541L2061n7353P6523K3111k6657o7923j4893P0609K045k2984q243
68a769540q694J6331N3364K163o4652p314k5900Q7535k5268j9994k1368Q2966
56a700371J3366o4110j4979l149J06553j14803m878O106K6177o266M9606l6749
$$ y = [-1709096, -1723660, -1726059, -1703372, -1774429, -1744597, -1664333, -1699948, -1748648, -1748937, -1798884, -1663427, -1643614, -1669145, -1665291, -1665251, -1631495, -1663425, -1691884, -1697975, -1660046, -1684950, -1673246, -1719433, -1702290, -1687719, -1723618, -1711661, -1726667, -1747409, -1691903, -1779985, -1769735, -1719363, -1750562, -1698916, -1653314, -1706037, -1753150, -1757752, -1777184, -1701614, -1660862, -1736681, -1711945, -1701765, -1759703, -1749350, -1740390, -1810816, -1780211, -1756073, -1690783, -1728117, -1799442, -1731587, -1702451, -1640838, -1749056, -1792803, -1763051, -1762295, -1775836, -1743775, -1801128, -1724605, -1701494, -1728151, -1796074, -1810967, -1740358, -1738313, -1761297, -1769540, -1778234, -1761903, -1708539, -1706376, -1771028, -1778342, -1804242, -1716707, -1741975, -1761969, -1783337, -1700371, -1687005, -1751115, -1766094, -1769243, -1662690, -1777493, -1782371, -1776265, -1750088, -1756354, -1706748, -1743497]
44a743497m2640L3036o9215J2769j9497L4833R701m1981J3173L6649l665J9094
32a761240N4575p4210M2360j1173J801l1243j7592M1998j1454L1772n1331J8777
20a766960j705l7850n5205r304L7441K3095N84j1613N211J4368O457n4706j6538
7a866725l439N9289l2437j0740M1090J1379M1770
$$ y = [-1743497, -1786137, -1753101, -1822316, -1809547, -1829044, -1794211, -1784510, -1826491, -1813318, -1776669, -1780334, -1761240, -1706665, -1780875, -1738515, -1749688, -1747887, -1779130, -1796722, -1754724, -1766178, -1734406, -1785737, -1766960, -1768665, -1806515, -1861720, -1871024, -1833583, -1810488, -1809904, -1821517, -1816306, -1801938, -1795481, -1850187, -1866725, -1870164, -1810875, -1843312, -1854052, -1812962, -1801583, -1759813]
$$ [...]
##END NTUPLES=NMR SPECTRUM
##END=
