##TITLE=1H_DE-80H_X3
 200.13MHz, d2o
 8 sc
 
 19ns.26.2.2025
##JCAMPDX= 6.0         $$ Bruker NMR JCAMP-DX V2.0
##DATA TYPE= NMR SPECTRUM
##DATA CLASS= NTUPLES
##ORIGIN= UXNMR, Bruker Analytische Messtechnik GmbH
##OWNER= pz
$$ XWIN-NMR		Version 3.5
$$ Thu Dec 11 10:56:44 2025 Russian Standard Time (UT+4h)  Yarkov@DPX200
##.OBSERVE FREQUENCY= 200.1313
##.OBSERVE NUCLEUS= ^1H
##.ACQUISITION MODE= SIMULTANEOUS
##.ACQUISITION SCHEME= undefined
##.AVERAGES= 8
##.DIGITISER RES= 18
##SPECTROMETER/DATA SYSTEM= spect
##.PULSE SEQUENCE= zg30
##.SOLVENT NAME= CDCl3
##.SHIFT REFERENCE= (INTERNAL, CDCl3, 0, 15.4781)
##AUDIT TRAIL= $$ (NUMBER, WHEN, WHO, WHERE, WHAT)
$$ ##TITLE= Audit trail, XWIN-NMR		Version 3.5
$$ ##JCAMPDX= 5.01
$$ ##ORIGIN= Bruker BioSpin GmbH
$$ ##OWNER= Yarkov
$$ C:/Bruker/XWIN-NMR/data/yarkov2/nmr/H-C/1/pdata/1/auditp.txt
$$ ##AUDIT TRAIL=  $$ (NUMBER, WHEN, WHO, WHERE, WHAT)
(   1,<2025-12-11 10:55:38.39 +0400>,<Yarkov>,<DPX200>,
      <created by zg, POWCHK disabled, PULCHK disabled
       configuration hash MD5:
       00 E9 B6 7A A2 85 ED C7 34 08 36 98 17 FE 4E 26
       data hash MD5: 16K
       95 37 FF 3E A3 A0 1F C6 82 00 F0 69 93 6C 3E B5>)
(   2,<2025-12-11 10:56:03.82 +0400>,<Yarkov>,<DPX200>,
      <Start of raw data processing
       efp BC_mod = 2 LB = 0.25 FT_mod = 6 PKNL = 1 PHC0 = -5306.083 PHC1 = 17.82193 SI = 16K 
       data hash MD5: 16K
       E8 66 F5 44 BA 3A 3A 2B D6 C8 AA EF 29 62 67 39>)
$$ ##END=
$$ 
$$ hash MD5
$$ 86 82 6D C0 36 FF 35 9A 22 59 6E 25 2E C7 A1 6C
##$RELAX= 
##$RELAX= 
##$RELAX= 
##$RELAX= 
##$RELAX= 
##$RELAX= 
$$ Bruker specific parameters
$$ --------------------------
##$DU= <C:/Bruker/XWIN-NMR>
##$EXPNO= 1
##$NAME= <H-C>
##$PROCNO= 1
##$TYPE= <nmr>
##$USER= <yarkov2>
##$AMP= (0..31)
100 100 100 100 100 100 100 100 100 100 100 100 100 100 100 100 100 100 
100 100 100 100 100 100 100 100 100 100 100 100 100 100 
##$AQSEQ= 0
##$AQ_mod= 1
##$AUNM= <au_zg>
##$AUTOPOS= <>
##$BF1= 200.13
##$BF2= 200.13
##$BF3= 200.13
##$BF4= 200.13
##$BF5= 200.13
##$BF6= 200.13
##$BF7= 200.13
##$BF8= 200.13
##$BYTORDA= 1
##$CFDGTYP= 0
##$CFRGTYP= 5
##$CHEMSTR= <none>
##$CNST= (0..31)
1 1 145 1 1 1 1 1 1 1 1 1 1 1 1 1 1 1 1 1 1 1 1 1 1 1 1 1 1 1 1 1 
##$CPDPRG= <>
##$CPDPRG1= <>
##$CPDPRG2= <>
##$CPDPRG3= <>
##$CPDPRG4= <mlev>
##$CPDPRG5= <mlev>
##$CPDPRG6= <mlev>
##$CPDPRG7= <mlev>
##$CPDPRG8= <mlev>
##$CPDPRGB= <>
##$CPDPRGT= <>
##$D= (0..31)
0 0.7 0 0 0 0 0 0 0 0 0 0.03 0 0 0 0 0 0 0 0 0 0 0 0 0 0 0 0 0 0 0 0 
##$DATE= 1765436137
##$DBL= (0..7)
120 120 120 120 120 120 120 120 
##$DBP= (0..7)
150 150 150 150 150 150 150 150 
##$DBP07= 0
##$DBPNAM0= <>
##$DBPNAM1= <>
##$DBPNAM2= <>
##$DBPNAM3= <>
##$DBPNAM4= <>
##$DBPNAM5= <>
##$DBPNAM6= <>
##$DBPNAM7= <>
##$DBPOAL= (0..7)
0.5 0.5 0.5 0.5 0.5 0.5 0.5 0.5 
##$DBPOFFS= (0..7)
0 0 0 0 0 0 0 0 
##$DE= 6
##$DECBNUC= <off>
##$DECIM= 32
##$DECNUC= <off>
##$DECSTAT= 4
##$DIGMOD= 1
##$DIGTYP= 9
##$DL= (0..7)
0 120 120 120 120 120 120 120 
##$DP= (0..7)
$$ [...]
##$SUBNAM2= <"">
##$SUBNAM3= <"">
##$SUBNAM4= <"">
##$SUBNAM5= <"">
##$SUBNAM6= <"">
##$SUBNAM7= <"">
##$SUBNAM8= <"">
##$SUBNAM9= <"">
##$SW= 18.0517328524113
##$SWIBOX= (0..15)
0 0 2 0 0 0 0 0 0 0 0 0 0 0 0 0 
##$SW_h= 3612.71676300578
##$TD= 16384
##$TD0= 1
##$TE= 0
##$TE2= 300
##$TE3= 300
##$TEG= 300
##$TL= (0..7)
0 120 120 120 120 120 120 120 
##$TP= (0..7)
150 150 150 150 150 150 150 150 
##$TP07= 0
##$TPNAME0= <>
##$TPNAME1= <>
##$TPNAME2= <>
##$TPNAME3= <>
##$TPNAME4= <>
##$TPNAME5= <>
##$TPNAME6= <>
##$TPNAME7= <>
##$TPOAL= (0..7)
0.5 0.5 0.5 0.5 0.5 0.5 0.5 0.5 
##$TPOFFS= (0..7)
0 0 0 0 0 0 0 0 
##$TUNHIN= 0
##$TUNHOUT= 0
##$TUNXOUT= 0
##$USERA1= <user>
##$USERA2= <user>
##$USERA3= <user>
##$USERA4= <user>
##$USERA5= <user>
##$V9= 5
##$VALIST= <valist>
##$VCLIST= <CCCCCCCCCCCCCCC>
##$VD= 0
##$VDLIST= <DDDDDDDDDDDDDDD>
##$VPLIST= <PPPPPPPPPPPPPPP>
##$VTLIST= <TTTTTTTTTTTTTTT>
##$WBST= 1024
##$WBSW= 4
##$XGAIN= (0..3)
0 0 0 0 
##$XL= 0
##$YL= 0
##$YMAX_a= 354381
##$YMIN_a= -324634
##$ZGOPTNS= <>
##$ZL1= 120
##$ZL2= 120
##$ZL3= 120
##$ZL4= 120
##$ABSF1= 0
##$ABSF2= 0
##$ABSG= 0
##$ABSL= 0
##$ALPHA= 0
##$AQORDER= 0
##$ASSFAC= 0
##$ASSFACI= 0
##$ASSFACX= 0
##$ASSWID= 0
##$AUNMP= <proc_1d>
##$AZFE= 0.1
##$AZFW= 0.1
##$BCFW= 0
##$BC_mod= 2
##$BYTORDP= 0
##$COROFFS= 0
##$CY= -3
##$DATMOD= 1
##$DC= 0
##$DFILT= <>
##$DTYPP= 0
##$F1P= 0
##$F2P= 0
##$FCOR= 1
##$FTSIZE= 16384
##$FT_mod= 6
##$GAMMA= 0
##$GB= 0
##$INTBC= 1
##$INTSCL= 3.241238e-09
##$ISEN= 128
##$LB= 0.25
##$LEV0= 0
##$LPBIN= 0
##$MAXI= 10000
##$MC2= 0
##$MEAN= 0
##$ME_mod= 0
##$MI= 1.114404
##$NCOEF= 0
##$NC_proc= -8
##$NLEV= 6
##$NOISF1= 3.799351
##$NOISF2= 2.8
##$NSP= 0
##$NTH_PI= 0
##$NZP= 0
##$OFFSET= 15.47805
##$PC= 1
##$PHC0= -5306.083
##$PHC1= 17.82193
##$PH_mod= 1
##$PKNL= yes
##$PPARMOD= 0
##$PSCAL= 0
##$PSIGN= 0
##$REVERSE= no
##$SF= 200.130008735495
##$SI= 16384
##$SIGF1= 3
##$SIGF2= 2
##$SINO= 0.751879
##$SIOLD= 32768
##$SREGLST= <19F.Aceton>
##$SSB= 0
##$STSI= 16384
##$STSR= 0
##$SW_p= 3612.71676300578
##$SYMM= 0
##$S_DEV= 0
##$TDeff= 16384
##$TDoff= 0
##$TI= <>
##$TILT= no
##$TM1= 0
##$TM2= 0
##$TOPLEV= 0
##$USERP1= <user>
##$USERP2= <user>
##$USERP3= <user>
##$USERP4= <user>
##$USERP5= <user>
##$WDW= 1
##$XDIM= 16384
##$YMAX_p= 459570579
##$YMIN_p= -3472873
$$ End of Bruker specific parameters
$$ ---------------------------------
##NTUPLES= NMR SPECTRUM
##VAR_NAME=  FREQUENCY,     SPECTRUM/REAL,   SPECTRUM/IMAG
##SYMBOL=    X,             R,               I
##VAR_TYPE=  INDEPENDENT,   DEPENDENT,       DEPENDENT
##VAR_FORM=  AFFN,          ASDF,            ASDF
##VAR_DIM=   16384,         16384,           16384
##UNITS=     HZ,            ARBITRARY UNITS, ARBITRARY UNITS
##FACTOR=    0.220516191357247, 1,           1
##FIRST=     3097.6223281253, 0,             0
##LAST=      -515.09443488048, 0,            0
##MIN=       -515.09443488048, -3472873,     0
##MAX=       3097.6223281253, 459570579,     0
$$ Real data points
##PAGE= N=1
##DATA TABLE= (X++(R..R)), XYDATA
$$ [...]
5641C7649233M56150N63432L0585L27522P28158O06015L86077M8964L19985J29475
5631D1245596J51578L24922L83748M47377M10178L42666K09497K21028N91350
5622D4327940O66811M94493O96239N92524O03146M48899O48649J237437J351487
5613E1067625J286499R16065J429435J802242J693206J871637J626809J816165
5605F3509683J922547J851377K009193K156175K324017J786515J405487J509092
5597G8474086J563543J295703J018705J242370J069688P48179Q77318O69948N89496
5588H7549036M82110M90362J49698R2261K32642K31119N01J23010m80900m36625
5578H8433214k95006q37535q12190r07353j076478o22366r00072j129860q42698
$$ y = [37649233, 38105383, 38668815, 38699400, 39026922, 39755080, 40361095, 40747172, 40796136, 41116121, 41245596, 41397174, 41722096, 42105844, 42553221, 42963399, 43306065, 43515562, 43736590, 44327940, 44994751, 45489244, 46185483, 46778007, 47381153, 47830052, 48478701, 49716138, 51067625, 52354124, 53270189, 54699624, 56501866, 58195072, 60066709, 61693518, 63509683, 65432230, 67283607, 69292800, 71448975, 73772992, 75559507, 76964994, 78474086, 80037629, 81333332, 82352037, 83594407, 84664095, 85412274, 86289592, 86959540, 87549036, 88031146, 88521508, 88671206, 88763467, 88996109, 89227228, 89227729, 89350739, 88869839, 88433214, 88138208, 87300673, 86488483, 85581130, 84504652, 83882286, 82982214, 81852354, 81009656]
5569H1009656q19343q43312r05696q64380o14391m86071l40955m83108l69878
5560G5282522N2196R9035K57626L08322j52945L086K81873M3462j11022j27532
5550G5936623j51047r6929m23495m18424n43078r86110j065055j049021j280555
5541F9922909j362510j434877j435804j563538j758840j292039j299782j509172
5533E8266347j779287j482817j631853j449186j362507j212892j563128j068938
5525D6715739j028026j148268p87389j126957j089845o89687p77734o31871o86494
5516C8749468o12117m12093o50908o75399k71869m02998l27061o72827j87125
5507C4537071j83973l60424k38782l12720k5923j55546m59877k68439j22947j97201
$$ y = [81009656, 80190313, 79347001, 78441305, 77576925, 76962534, 76476463, 76135508, 75652400, 75282522, 75334718, 75433753, 75691379, 75999701, 75846756, 75849842, 76131715, 76175177, 76064155, 75936623, 75785576, 75688647, 75265152, 74846728, 74303650, 73317540, 72252485, 71203464, 69922909, 68560399, 67125522, 65689718, 64126180, 62367340, 61075301, 59775519, 58266347, 56487060, 55004243, 53372390, 51923204, 50560697, 49347805, 47784677, 46715739, 45687713, 44539445, 43752056, 42625099, 41535254, 40845567, 40067833, 39435962, 38749468, 38137351, 37725258, 37074350, 36398951, 36127082, 35724084, 35397023, 34724196, 34537071, 34353098, 33992674, 33753892, 33441172, 33415249, 33259703, 32799826, 32531387, 32408440, 32211239]
5497C2211239L8173j71560j5658K398k15753k32444n6667k3599m2644j92854p4703
5486C1225928l64336m74177m08819l57198n97155m88741l37060j84197j39512
5477B7874733m23662p92997o57778l10364j16939m89020m08167n32964m47654
5468B3695188n89357l70881l19611m01128n44535n45551l41009j36117k43657
5459B0203342m41702n25552m02615k26415r137l51775m13090k99196k51015j04827
5449A7178018l04632m03571J55448l01287k02197K24079l75141l51884m5568q0542
5439A5492723k65286m40292l49348J24043k92014n7445P2578l13257k97739m29464
5429A3244499L9067J98821m14605r7515n0896J51213j09002J04636j66543p4173
$$ y = [32211239, 32249412, 32077852, 32062194, 32064592, 31848839, 31616395, 31559728, 31536129, 31493485, 31300631, 31225928, 30861592, 30387415, 29978596, 29621398, 29024243, 28535502, 28198442, 28014245, 27874733, 27451071, 26658074, 26000296, 25689932, 25572993, 25083973, 24675806, 24142842, 23695188, 23105831, 22734950, 22415339, 22014211, 21469676, 20924125, 20583116, 20446999, 20203342, 19761640, 19236088, 18833473, 18607058, 18597921, 18246146, 17833056, 17533860, 17282845, 17178018, 16873386, 16469815, 16625263, 16323976, 16121779, 16345858, 15970717, 15618833, 15573265, 15492723, 15227437, 14787145, 14437797, 14561840, 14269826, 14212381, 14284959, 13971702, 13673963, 13244499, 13283566, 13482387, 13067782, 12970267, 12919371, 13070584, 12961582, 13066218, 12899675, 12825502]
5419A2825502j02057k05351k67019l78585j0778l9955r048L03532j57692k25273
5409A1733276k00313k807J99050K0825k94362j55284m0482R9397L6117j65319
5399A1230098j16764P9367J88239j52959k61450l2855k448J45006r6342j75488
5389A0804404J52103R4132l02120r5047Q6549K03071j45646j40287r3578k02253
5379A0361328l0243k66201K58726N4848J90705l490m27301Q0627J60365o9764
5369A0309600M2275J00094j69212j04820j06354J25285J76148J8748k1389o2546
5359A0307829L48334j27130l7790j18642p8289R5656P1231j7869J90664j65712
5349A0468282K13207j50944j09994M11553o135L7317L06413o0672j35881J70200
$$ y = [12825502, 12723445, 12518094, 12251075, 11872490, 11861712, 11821757, 11812709, 12116241, 11958549, 11733276, 11532963, 11530156, 11729206, 11750031, 11455669, 11300385, 11259903, 11359300, 11395417, 11230098, 11113334, 11192701, 11380940, 11227981, 10966531, 10933676, 10931228, 11076234, 10979892, 10804404, 10956507, 11050639, 10748519, 10653472, 10740021, 10943092, 10797446, 10657159, 10563581, 10361328, 10331085, 10064884, 10323610, 10378458, 10569163, 10565673, 10138372, 10218999, 10379364, 10309600, 10351875, 10451969, 10282757, 10177937, 10071583, 10196868, 10373016, 10391764, 10370375, 10307829, 10656163, 10529033, 10491243, 10372601, 10294312, 10389968, 10461199, 10443330, 10633994, 10468282, 10681489, 10530545, 10420551, 10832104, 10825969, 10863286, 11169699, 11109027, 10973146, 11143346]
5339A1143346J46317J32306K296M63654J0169P0059k62470J43904L41251L2649
5329A2223481P9640j8396m3915K19142J91583j19516j66363l753J1450K2043J82198
5318A2577594K7444K74283J76877Mk20192O2334K28514j4664m2987L12589L20178
5307A3701974J87020J52612N9348l6648J27802K86662J20366j47178J32128L0416
5297A4614502J00074J20872r4474m3289p3148n33334R5258k6319j40478k07521
5287A3812143k62263J94681l2705o9011m76564J23510J14985Q874j9722J13512
5277A3507440m1291o6341k14894R4410p3147N8788l63199j64095l5826j20055
5267A2581790o8731k76603M27754N2021l34629k4521K89131k79251j12808j73258
$$ y = [11143346, 11289663, 11421969, 11424265, 11887919, 11898088, 11968147, 11705677, 11849581, 12190832, 12223481, 12303121, 12284725, 12240810, 12459952, 12651535, 12532019, 12365656, 12361903, 12373353, 12395396, 12577594, 12605038, 12879321, 13056198, 13056202, 12836010, 12898344, 13126858, 13112194, 13069207, 13381796, 13701974, 13888994, 14041606, 14100954, 14064306, 14192108, 14478770, 14599136, 14451958, 14584086, 14614502, 14714576, 14835448, 14740974, 14697685, 14624537, 14091203, 14186461, 14160142, 14019664, 13812143, 13549880, 13744561, 13711856, 13642845, 13166281, 13289791, 13404776, 13413650, 13393928, 13507440, 13466149, 13399808, 13184914, 13279324, 13206177, 13264965, 12901766, 12737671, 12701845, 12581790, 12513059, 12236456, 12664210, 12716231, 12381602, 12357081, 12646212, 12366961, 12254153, 12080895]
5257A2080895k19088P3769l8419j79693K25691J16321P6777j76171j11954r5981
5247A1752147j50521r3958J80041L7865j58072p6175j21731j56891m3678O231
5237A1175258r4026j52057o9943m7985O768K40195K2822m95098R3072l11582k12239
5226A0155185P8176j08661J20242J29280J4709j17755j62045k41153j2713N5202
5216I910467K54733j2775q0841k57876J09205L21148j25146K30551o8001o3466
5206A0217999J67854k11300q9393p3239Q8308p6893K60600K7469J564l3645L477
5195A0282801j25617J88779p6304J01230J57972K20733j00475k17103J68365N6974
5185A0657355K22935J20206j52669P4425J56142k51936k2761j55862l2324K83927
$$ y = [12080895, 11861807, 11935576, 11897157, 11717464, 11943155, 12059476, 12136253, 11960082, 11848128, 11752147, 11601626, 11507668, 11687709, 11725574, 11567502, 11491327, 11369596, 11212705, 11169027, 11175258, 11081232, 10929175, 10859232, 10811247, 10818015, 11058210, 11081032, 10585934, 10679006, 10367424, 10155185, 10233361, 10124700, 10244942, 10374222, 10388931, 10271176, 10109131, 9867978, 9855265, 9910467, 10165200, 10152425, 10071584, 9813708, 9922913, 10244061, 10118915, 10349466, 10281465, 10217999, 10385853, 10174553, 10085160, 10011921, 10100229, 10023336, 10283936, 10311405, 10312969, 10279324, 10282801, 10157184, 10345963, 10269659, 10370889, 10528861, 10749594, 10649119, 10432016, 10600381, 10657355, 10880290, 11000496, 10847827, 10922252, 11078394, 10826458, 10803697, 10647835, 10615511, 10899438]
5175A0899438Q6227J60252j47261K22727n3109m1868K48936J32965j20041J60089
5165A1548355J11793J31094J0477n4228j64918K31573K66398J49154N1019j12614
5155A2168103J69760k12132O9547m6902q4374N8069P0919J36349K93621m3586
5145A2579374j25087j70867L96210K50738m70706j55219R9623j6474L09227l3528
5135A2663291l791L70421L03224K2509j44183k77229K4561K04989O5297l8144
5125A3190945J2333R7358L35858j34185J51447M65056m5363j91457K13866L30457
5115A4426315K78602j60943j63093L2618K32808L52560J42323J64420J54835P2787
5105A5533232J29226k16121M33589K73982K18955J77738K04546L15095L8500P1177
$$ y = [10899438, 10985665, 11145917, 10998656, 11221383, 11168274, 11126406, 11375342, 11508307, 11388266, 11548355, 11660148, 11791242, 11801719, 11747491, 11582573, 11814146, 12080544, 12229698, 12280717, 12168103, 12337863, 12125731, 12195278, 12148376, 12064002, 12122071, 12192990, 12329339, 12622960, 12579374, 12454287, 12283420, 12679630, 12930368, 12459662, 12304443, 12404066, 12387592, 12696819, 12663291, 12659500, 13029921, 13333145, 13355654, 13211471, 12934242, 12958803, 13163792, 13229089, 13190945, 13203278, 13300636, 13636494, 13502309, 13653756, 14118812, 14073449, 13881992, 14095858, 14426315, 14704917, 14543974, 14380881, 14413499, 14646307, 14998867, 15141190, 15305610, 15460445, 15533232, 15662458, 15446337, 15879926, 16153908, 16372863, 16550601, 16755147, 17070242, 17108742, 17179919]
5095A7179919L99974L96738j51204L74395K30390O21367J23085J51649L56264
5086A9682577N0051K0947J22j1398L62903L15915K63533O82891N8854j23947L30796
5075B1633244M63276J13998J05210K15796L45629M52030M03627K18781K01796
5066B4153387N88008K16905L83295N47150R4219K64373K67242M03241L98997M16809
5056B7733626J55627L29111J90356J77092O41531L59588r8044L41797M23493K21138
5046C0475315N56418M67445K25069K71087M51930L20150K1858N78120N11768O09044
5036C4488204P50047L26386O18707Q31478Q65556R02768P09649M48454J014961
5027D0956210R23749J202104J139275J030230J232367J405140J235168J589782
$$ y = [17179919, 17579893, 17976631, 17825427, 18199822, 18430212, 19051579, 19174664, 19326313, 19682577, 19732628, 19753575, 19753697, 19742299, 20105202, 20421117, 20684650, 21367541, 21426395, 21302448, 21633244, 22096520, 22210518, 22315728, 22531524, 22877153, 23329183, 23732810, 23951591, 24153387, 24741395, 24958300, 25341595, 25888745, 25982964, 26247337, 26514579, 26917820, 27316817, 27733626, 27889253, 28218364, 28408720, 28585812, 29227343, 29586931, 29488887, 29830684, 30254177, 30475315, 31031733, 31499178, 31724247, 31995334, 32447264, 32767414, 32789272, 33367392, 33879160, 34488204, 35238251, 35564637, 36183344, 37014822, 37880378, 38783146, 39492795, 39941249, 40956210, 41879959, 43082063, 44221338, 45251568, 46483935, 47889075, 49124243, 50714025]
5019E0714025J663329J830595K004597K128131K168520K199385K614734L215088
5011F8538404L520008L140682L720081M452730M892537N058135N539790O101261
5003A04963628O622249P376743P508847Q473397Q629748R126060R538999Q811339
4995A71051010Q640765Q089798O590628N512543L851647J909296J59183j409750
4987B04395120k665346m188004m952892n447368o067122n815975o238048o243085
4979A62777280n762709o050005o010169n304136m877076m885600l781292l773288
4971A22333005l673549l134360k831822k489760k360019j749462j496657j378164
4963A03219212q32688p95176n53827p2896j3230O2129O94266O22306J067034J458503
$$ y = [50714025, 52377354, 54207949, 56212546, 58340677, 60509197, 62708582, 65323316, 68538404, 72058412, 75199094, 78919175, 83371905, 88264442, 93322577, 98862367, 104963628, 111585877, 118962620, 126471467, 134944864, 143574612, 152700672, 162239671, 171051010, 179691775, 187781573, 194372201, 199884744, 203736391, 205645687, 205804870, 204395120, 201729774, 197541770, 192588878, 187141510, 181074388, 175258413, 169020365, 162777280, 157014571, 150964566, 144954397, 139650261, 134773185, 129887585, 126106293, 122333005, 118659456, 115525096, 112693274, 110203514, 107843495, 106094033, 104597376, 103219212, 102386524, 101591348, 101037521, 100964625, 100951395, 101013524, 101707790, 102330096, 103397130, 104855633]
4953A04855633J581474J908047K148343K809224K968361L578220M120850M095862
4945A28066014M802362N377358N772596O749354O822256P639155P678977Q265123
4937A81173195Q593868P720757P063868O095624N032936L584108J802246J00758
4929B21167360j292230k687122l699262n081065n909013o084216o285166o717664
4921A83411622o566552o564854o546787o229269n960547n591206n381395n096603
4913A35474409m269519m445293l819201l556810l403031l070256k955047k716829
4905A07238423k547082k285581k048074k082213j752846k003826j357329j401746
4897I1759726j428926j231803j162349p95618r38177o89974j141788q98837m89941
$$ y = [104855633, 106437107, 108345154, 110493497, 113302721, 116271082, 119849302, 123970152, 128066014, 132868376, 138245734, 144018330, 150767684, 157589940, 165229095, 172908072, 181173195, 189767063, 197487820, 204551688, 210647312, 215680248, 219264356, 221066602, 221167360, 219875130, 217188008, 213488746, 208407681, 202498668, 196414452, 190129286, 183411622, 176845070, 170280216, 163733429, 157504160, 151543613, 145952407, 140571012, 135474409, 131204890, 126759597, 122940396, 119383586, 115980555, 112910299, 109955252, 107238423, 104691341, 102405760, 100357686, 98275473, 96522627, 94518801, 93161472, 91759726, 90330800, 89098997, 87936648, 87141030, 86202853, 85512879, 84371091, 83472254, 82982313]
4888H2982313o34913n80029m59370j59304o08742n62966j10476j34953k37752
4879G9493808n33972J2525j84912m75722k34896m69459n55450k58421j41172j37819
4869G6514510n68228k19176j68242k91585p01003o80183l25168n1385k82972k71949
4859G2954619l98263j48520N0877o3766k39077l2436J7084k5412r6996J22634
4849G2140744K56582l649K90938L0490j30194J22070L38722M52527J17240p1804
4839G3543666N25771M64301L80087L33351L87223N45182P12412N52990M70537
4830G7915520J033212J039952J193018J316165J109672J058413J353722J526855
4822H7546529J614364J875444K064530K173931K381829K280205K237848K400987
$$ y = [82982313, 82347400, 81767371, 81308001, 81148697, 80539955, 79976989, 79866513, 79731560, 79493808, 78959836, 78972361, 78787449, 78311727, 78076831, 77607372, 77051922, 76793501, 76652329, 76514510, 75946282, 75727106, 75558864, 75267279, 74566276, 73886093, 73560925, 73509540, 73226568, 72954619, 72556356, 72407836, 72458713, 72394947, 72155870, 72123434, 72140518, 72115106, 72018110, 72140744, 72397326, 72393677, 72684615, 72715105, 72584911, 72706981, 73045703, 73498230, 73615470, 73543666, 74069437, 74533738, 74913825, 75247176, 75634399, 76179581, 76891993, 77444983, 77915520, 78948732, 79988684, 81181702, 82497867, 83607539, 84665952, 86019674, 87546529, 89160893, 91036337, 93100867, 95274798, 97656627, 99936832, 102174680, 104575667]
4814A04575667K738604K933998L036664K692884K531774K794906K659400K454391
4806A26418288K339136K528159K404181K033375J274791J353400Q60118M33739
4798A39645187J1132m82924m57409p93188j107947j142829j637814j864443k182294
4789A29987471j744359j968256k184669k213162k320729k280084k172132k232160
4781A12871920k000943j541049j704853j955174j777648j839453j837354j420912
4773I8794534j533532j457444j282284j266282j668071j082847j144637r07109
4765H8452328o38495j012543r63359p96452p21370o65791l89924m43897n17344
4756H2303153j44666k46325j88506p2170K62557j83149J0699K09195L63953K59809
$$ y = [104575667, 107314271, 110248269, 113284933, 115977817, 118509591, 121304497, 123963897, 126418288, 128757424, 131285583, 133689764, 135723139, 136997930, 138351330, 139211448, 139645187, 139656319, 139173395, 138715986, 137922798, 136814851, 135672022, 134034208, 132169765, 129987471, 128243112, 126274856, 124090187, 121877025, 119556296, 117276212, 115104080, 112871920, 110870977, 109329928, 107625075, 105669901, 103892253, 102052800, 100215446, 98794534, 97261002, 95803558, 94521274, 93254992, 91586921, 90504074, 89359437, 88452328, 87813833, 86801290, 85837931, 85041479, 84320109, 83654318, 83264394, 82820497, 82303153, 82158487, 81912162, 81723656, 81651486, 81914043, 81730894, 81741593, 81950788, 82314741, 82574550]
4746H2574550L00324O85026M53344M90466M72229O54978P62523N48795L07039
4737H7249274L66694L74882N46742Q60680L95467O16090O38751P9310L10747N14555
4727I1953192M75912K48831K90208N15620J74807J85124L02298L46777P18655
4718I5211424O06217J94892M03278O51292P86065M32754M76075N90682O69454
4709A00022133P36243P80975Q15081J041612J083657Q20265J111303J091833R11281
4700A08414383J358408J428134J141144J536813J451401J677515J624234J557059
4692A20189091J932287J685467J614628J519102J270844J413656J194844J260378
4684A32080297J086694R24598M98054P57436O90784J84201J27109j09608k17135
$$ y = [82574550, 82874874, 83559900, 84013244, 84503710, 84975939, 85630917, 86393440, 86942235, 87249274, 87615968, 87990850, 88537592, 89398272, 89793739, 90409829, 91048580, 91127890, 91438637, 91953192, 92429104, 92677935, 92968143, 93483763, 93658570, 93843694, 94145992, 94492769, 95211424, 95817641, 96012533, 96415811, 97067103, 97853168, 98285922, 98761997, 99352679, 100022133, 100758376, 101539351, 102354432, 103396044, 104479701, 105299966, 106411269, 107503102, 108414383, 109772791, 111200925, 112342069, 113878882, 115330283, 117007798, 118632032, 120189091, 122121378, 123806845, 125421473, 126940575, 128211419, 129625075, 130819919, 132080297, 133166991, 134091589, 134589643, 135347079, 136037863, 136222064, 136349173, 136239565, 136022430]
4675A36022430j40007p21936n53650m67203p18273r26343r74343r71868p87846
4666A29760961q93868o23922n84687o31152n26023m00613k24538j95735m4001
4657A25636422j85230k13947P9498j55026n7486J03648K41662R4794n2394J4860
4647A25506801j22093M21582k9457k16519J7885R0918j58537j12398j78133j24221
4637A25095828N9420n7706o1245J88716L86064J26323L02242N39170N71554P67091
4627A27917457M53544O34090O72916N78568Q66439Q11124J146779J294453J033715
4618A35409085J130862J483094J433331J509824J469068K294696K324076K141231
4610A49195267K272426K069974J980838J994164K323744J964977J786290R93266
$$ y = [136022430, 135882423, 135160487, 134606837, 134139634, 133421361, 132495018, 131520675, 130548807, 129760961, 128867093, 128243171, 127658484, 127027332, 126501309, 126100696, 125876158, 125680423, 125636422, 125451192, 125237245, 125316743, 125161717, 125104231, 125207879, 125449541, 125544335, 125491941, 125506801, 125384708, 125806290, 125776833, 125560314, 125578199, 125669117, 125510580, 125398182, 125220049, 125095828, 125155248, 125097542, 125036297, 125225013, 125611077, 125737400, 126039642, 126578812, 127150366, 127917457, 128371001, 129005091, 129678007, 130256575, 131123014, 131934138, 133080917, 134375370, 135409085, 136539947, 138023041, 139456372, 140966196, 142435264, 144729960, 147054036, 149195267, 151467693, 153537667, 155518505, 157512669, 159836413, 161801390, 163587680, 164580946]
4602A64580946N32084L76858j62267o50441r56937j551610j943195k058968k130890
4593A56035580k104218k470523k288914k213043k384660k340823k440267j924136
4585A37868996j973350k089462k011730j374830j478141j580548j081898j435052
4577A24843985q12416m92932q14372o78372k77432r1738n21202R2664l3377K02108
4567A21416916L53474P49204Q86526O50416R44869J074027J237006J303983J504405
4558A30120826J869543J824395K173078K380669K797191K674862K675958L432271
4550A49948793L772475L922554M513410M937628N130399N679120O360754O902801
4542A91167934P321051P723722Q041278Q672190Q882384R521554J0125593J0125135
$$ y = [164580946, 165113030, 165489888, 165327621, 164677180, 163720243, 162168633, 160225438, 158166470, 156035580, 153931362, 151460839, 149171925, 146958882, 144574222, 142233399, 139793132, 137868996, 135895646, 133806184, 131794454, 130419624, 128941483, 127360935, 126279037, 124843985, 124031569, 123538637, 122724265, 122045893, 121768461, 121676723, 121155521, 121248185, 121214808, 121416916, 121770390, 122519594, 123406120, 124056536, 125001405, 126075432, 127312438, 128616421, 130120826, 131990369, 133814764, 135987842, 138368511, 141165702, 143840564, 146516522, 149948793, 153721268, 157643822, 162157232, 167094860, 172225259, 177904379, 184265133, 191167934, 198488985, 206212707, 214253985, 222926175, 231808559, 241330113, 251455706, 261580841]
4534B61580841R868731R648663Q787238Q151645P464185O069656M782957L558549
4526C19912465J516282K14992j028007k204812l553372m546564n408906n717360
4518B99184718o077866o724720o602288o590266o573207o328762n584330n539003
4510B49164276n386561m662545l963578l352101k616341k448312j984902r88104
4502B23761832q41468M3683O37998R77520J793473K019569K548211L196840K918987
4493B37056645L483209L853297L154126L043265K840578K180433J351889N84413
4485B57547855l82353j277051k169053k910655l624715m522571n008856n578510
4477B32074091n440885n793892o274480o335868o043521o434886o163354o094160
$$ y = [261580841, 271449572, 281098235, 289885473, 298037118, 305501303, 311570959, 316353916, 319912465, 321428747, 321643739, 320615732, 318410920, 314857548, 310310984, 304902078, 299184718, 293106852, 286382132, 279779844, 273189578, 266616371, 260287609, 254703279, 249164276, 243777715, 239115170, 235151592, 231799491, 229183150, 226734838, 224749936, 223761832, 222920364, 222964047, 223602045, 224579565, 226373038, 228392607, 230940818, 234137658, 237056645, 240539854, 244393151, 247547277, 250590542, 253431120, 255611553, 256963442, 257547855, 257165502, 255888451, 253719398, 250808743, 247184028, 242661457, 237652601, 232074091, 226633206, 220839314, 214564834, 208228966, 202185445, 195750559, 189587205, 183493045]
4469A83493045n580067n387742n127613n043004m857231m802618m639958m135521
4461A43919291m171967l553299l236630l430059l339006l075629l271162k537305
4453A17304234k489798k633788k250608k170262k242037j880610j746342j956682
4445I9934107j787397j958192j287518j313435j581702j432510j398250j196756
4437H7978347j058464j148875j254791j196339j168863r04085j097394r54395
4429G9195141j038662q80987q23884o54777j028748q42253q97550o48419q88864
4420G1490997n80234o89939r31957p17387o63823l64872o15394o16352p12798
4411F5598241n48808m59016l26496o57151q49344m86283m05027l34316j09777
$$ y = [183493045, 177912978, 172525236, 167397623, 162354619, 157497388, 152694770, 148054812, 143919291, 139747324, 136194025, 132957395, 129527336, 126188330, 123112701, 119841539, 117304234, 114814436, 112180648, 109930040, 107759778, 105517741, 103637131, 101890789, 99934107, 98146710, 96188518, 94901000, 93587565, 92005863, 90573353, 89175103, 87978347, 86919883, 85771008, 84516217, 83319878, 82151015, 81246930, 80149536, 79195141, 78156479, 77275492, 76451608, 75796831, 74768083, 73925830, 73028280, 72379861, 71490997, 70910763, 70220824, 69288867, 68571480, 67907657, 67542785, 66927391, 66311039, 65598241, 65049433, 64590417, 64263921, 63606770, 62757426, 62271143, 61866116, 61531800, 61422023]
4402F1422023o05401n55623k64062l75785q2368l44140k80180l19837L00416q6700
4392E8808343m25863L6777J73258k65482J08347K42827K59586L00805O67481M29170
4382F0335249M57935N46207M37151O02261R60195R44021O69503J028073Q48002
4373F6828597J021068J349564J326632J059910J233433J408537J128911J387527
4365G6744179J407997J470081J739537J761232J678052J412195J787085J252338
4357H9252696J033511P08512M66969j19998k01584n94798j046257j060744j524077
4348H6914230j986363j457851k089389k250376j889203j834800j714277j848734
4340G1843237k312343j785925j691459j375630j139195j536979j341700j533945
$$ y = [61422023, 60816622, 60260999, 59996937, 59621152, 59538784, 59194644, 58914464, 58594627, 58895043, 58808343, 58382480, 58419257, 58592515, 58327033, 58435380, 58678207, 58937793, 59238598, 59906079, 60335249, 60793184, 61339391, 61776542, 62378803, 63338998, 64283019, 64952522, 65980595, 66828597, 67849665, 69199229, 70525861, 71585771, 72819204, 74227741, 75356652, 76744179, 78152176, 79622257, 81361794, 83123026, 84801078, 86213273, 88000358, 89252696, 90286207, 90994719, 91461688, 91341690, 91140106, 90545308, 89499051, 88438307, 86914230, 84927867, 83470016, 81380627, 79130251, 77241048, 75406248, 73691971, 71843237, 69530894, 67744969, 66053510, 64677880, 63538685, 62001706, 60660006, 59126061]
4332E9126061j291974j100312j299643j228858r29233p97573j006174p60802q72142
4323D9839350r38192n98126o50531n51210n83536o94279q18819n90094j42036
4314D4272527l72159o86016p65774n93129n66452m40922m18637m40047m12887
4305C9576504l76433k48649l02897l56471j97039m9395l65215n14508j30415J86443
4295C7221925k1271j77732j11962N5118k03847k74648k00066J72481N8441l16755
4285C6201684r4705M51908K50177J91282j19628J69682J34006k53020J79075K32370
4275C7342831K30546J43876J68308M44098J75257P0705M14201L68555l0870L89245
4265C9716752O32506L49825K14368K94331M61491K27499J86524N55991L39682
$$ y = [59126061, 57834087, 56733775, 55434132, 54205274, 53276041, 52478468, 51472294, 50711492, 49839350, 48901158, 48303032, 47652501, 47101291, 46517755, 45823476, 45004657, 44414563, 44272527, 43900368, 43214352, 42448578, 41855449, 41288997, 40848075, 40429438, 39989391, 39576504, 39200071, 38951422, 38648525, 38292054, 38095015, 38045620, 37680405, 37165897, 37035482, 37221925, 37200654, 37022922, 36910960, 36966078, 36762231, 36487583, 36287517, 36459998, 36518439, 36201684, 36106979, 36558887, 36809064, 37000346, 36880718, 37050400, 37184406, 36931386, 37110461, 37342831, 37573377, 37717253, 37885561, 38329659, 38504916, 38575621, 38989822, 39358377, 39327507, 39716752, 40349258, 40699083, 40913451, 41207782, 41669273, 41896772, 42083296, 42639287, 42978969]
4256D2978969M16689M80118N09597P03841N65849K04183N41195Q86629P81667
4247D8068737O06710L32428M95716K53398N13498O47300Q80225O14017O00113
4238E3012142Q06746N17155M21910P07638O70562Q63913M94472L30020N84076
4229E8408634Q53811K32539L85988Q06374O10205O96188L00801M66012P18682
4220F3479234N91038R5629L84093M98158M33454M49354M24713O4465J6055J26201
4210F6562394K10200J04493j12806j08858O6950l95861K1857j29308l46473k36895
4200F5635693m40781o64873m68299l87373m82448m90869n15200o52423j186560
4191F0346867q72021p48142q76074p59798q13010p70564j057419j172302r57479
$$ y = [42978969, 43395658, 43875776, 44385373, 45089214, 45655063, 45859246, 46400441, 47287070, 48068737, 48675447, 49007875, 49503591, 49756989, 50270487, 50917787, 51798012, 52412029, 53012142, 53818888, 54336043, 54757953, 55465591, 56136153, 57000066, 57494538, 57824558, 58408634, 59262445, 59494984, 59880972, 60687346, 61297551, 61993739, 62294540, 62760552, 63479234, 64070272, 64165901, 64549994, 65048152, 65481606, 65930960, 66355673, 66420138, 66436193, 66562394, 66772594, 66877087, 66764281, 66655423, 66722373, 66326512, 66348369, 66219061, 65872588, 65635693, 65194912, 64530039, 64061740, 63674367, 63191919, 62701050, 62185850, 61533427, 60346867, 59474846, 58726704, 57850630, 57090832, 56277822, 55507258, 54449839, 53277537, 52320058]
4182E2320058r10477j125074j015638q24880j162930r02874q64987r27164r52980
4173D3633054j006163j034815r88346p14296j117428r32745n69138o48864q51945
4164C5769314j034991o94510p33061o25801p32674p50560p61783m89169o28894
4155B9317871o08758q07551j38038m43171o98209k14133j46298m00967o45113
4146B5215633m35650l15806k25917l89670k52863k77047l18065l18001j38567
4137B2544047k77111n15948l95670m3412l24166q1890j92125l92686k52891j14039
4127A9954109P0259l86929k79163m310j64692M3231l72408m34258J6490Qk76337
4116A8166000k80709j04874l93444m358J04643J43374k51475k56329O9737j86731
$$ y = [52320058, 51409581, 50284507, 49268869, 48443989, 47281059, 46378185, 45513198, 44586034, 43633054, 42626891, 41592076, 40603730, 39889434, 38772006, 37839261, 37270123, 36621259, 35769314, 34734323, 34039813, 33306752, 32680951, 31948277, 31197717, 30435934, 29946765, 29317871, 28709113, 27901562, 27763524, 27320353, 26622144, 26408011, 26261713, 25860746, 25215633, 24779983, 24464177, 24238260, 23848590, 23595727, 23318680, 23000615, 22682614, 22544047, 22266936, 21750988, 21355318, 21311906, 20987740, 20905850, 20713725, 20321039, 20068148, 19954109, 20024368, 19637439, 19358276, 19353966, 19189274, 19232505, 18860097, 18425839, 18442329, 18442337, 18166000, 17885291, 17780417, 17386973, 17382615, 17487258, 17630632, 17379157, 17122828, 17192565, 17005834]
4106A7005834j55016k93509m9321l72848k65466J6700N0921j1519m01746j43154
4096A5380876j1873k07101k76926J31647p678m17548k46382J16278n7670k44908
4086A4158715P6673P6658m41584M5670o3099M5179j79906k07828r3148J49402
4076A3566732m1250k43757p7501j88831J13571j06577n7832O8992j54721k87848
4066A2590978K71366k78889j55302J09232k7847J8307P6509j54466M3071k5565
4056A2467394j10374j71921k8368k61260n893P183l2530J86605j46540n9189j72360
4045A1672747N1054l3140r5317r7677N6718o619j23072J10420J12926j35398p7631
4034A1435011j59870j44312k18078K3778L35368l5636j15993J01082k42615m2593
$$ y = [17005834, 16850818, 16557309, 16507988, 16135140, 15869674, 15886374, 15937295, 15925776, 15524030, 15380876, 15369003, 15161902, 14884976, 15016623, 15008945, 14591397, 14345015, 14461293, 14403623, 14158715, 14235388, 14312046, 13870462, 13916132, 13853033, 13898212, 13718306, 13510478, 13417330, 13566732, 13525482, 13281725, 13204224, 13015393, 13128964, 13022387, 12964555, 13033547, 12878826, 12590978, 12862344, 12583455, 12428153, 12537385, 12509538, 12527845, 12604354, 12449888, 12492959, 12467394, 12357020, 12185099, 12156731, 11895471, 11889578, 11896761, 11864231, 12050836, 11904296, 11845107, 11672747, 11723801, 11690661, 11595344, 11497667, 11554385, 11547766, 11424694, 11535114, 11648040, 11512642, 11435011, 11275141, 11130829, 10912751, 10936529, 11271897, 11236261, 11120268, 11221350, 10978735, 10936142]
4024A0936142J63366l10266k52712K788j9394J86996Q2351R8739J27799l66954
4014A0648855k8614k5082N901N4956K27002k32915Q1863R2513k52200k2430j84372
4003A0365477J86200J57170l44620N1859R4340J3821J08645j22629R6982p7701
3993A0529544k28213J88K32524Q4122J25662j04414m09084o2337j14212O6461
3983A0120241J08445j36401O3973J00780k48472n3933J56230J08849R0498j5065
3973A0295145o1754r4380J19982l01707j2032K23215n566j05145J47111j72172
3963A0032697N0270j09070k69179J85520K1747l0000R6951J63194p0377k44546
3953I827207k4897j78412N8211K09180N9507R6821k46603q1573J67550R427k19186
$$ y = [10936142, 11099508, 10789242, 10536530, 10539318, 10519924, 10706920, 10789271, 10888010, 11015809, 10648855, 10620241, 10595159, 10601060, 10656016, 10883018, 10650103, 10731966, 10824479, 10572279, 10549849, 10365477, 10551677, 10708847, 10364227, 10416086, 10510426, 10524247, 10632892, 10510263, 10607245, 10529544, 10301331, 10301519, 10534043, 10618165, 10743827, 10639413, 10230329, 10167992, 10053780, 10120241, 10228686, 10092285, 10156258, 10257038, 10008566, 9954633, 10110863, 10219712, 10310210, 10295145, 10233391, 10139011, 10258993, 9957286, 9945254, 10168469, 10162903, 10057758, 10204869, 10032697, 10082967, 9973897, 9704718, 9890238, 9911985, 9881985, 9978936, 10142130, 10071753, 9827207, 9802310, 9623898, 9682109, 9891289, 9950796, 10047617, 9801014, 9719441, 9886991, 9896418, 9677232]
3942I677232q1541M3430J49022L9523n9093K67738j70076j76109L1672q8930K56604
3931I889472L26728k16285k1560j20657k51968j85839N4589K00639j35529L16112
3921I855702k57646J3440r8684N8183J97217J3166m093K6775p1028r5813K384
3910I639603j79731K32377j48769j69050n4561K75755K4177j3199J21182j35983
3900I591801J00245k03127J9060K64159l6015m9752q3744N7202J8857j50572J22792
3889I650906p5479K26021r8019j2531j5873k32525K66O2385J79228O9643m59053
3878I294969j31225J68036J18036M7563k35372J3776m3418N8751J35727J95410
3868I622253j59043K73635r8172l30268R211K42234l5270J30188Q1130Q2038j64058
$$ y = [9677232, 9595691, 9639121, 9788143, 9827666, 9768573, 10036311, 9866235, 9690126, 9721798, 9632868, 9889472, 10216200, 9999915, 9978355, 9857698, 9605730, 9419891, 9474480, 9675119, 9539590, 9855702, 9598056, 9611496, 9512812, 9570995, 9768212, 9781378, 9777285, 9804060, 9733032, 9637219, 9639603, 9459872, 9692249, 9543480, 9374430, 9319869, 9595624, 9619801, 9606602, 9727784, 9591801, 9692046, 9488919, 9507979, 9772138, 9736123, 9686371, 9602627, 9659829, 9678686, 9528114, 9650906, 9575427, 9801448, 9703429, 9690898, 9675025, 9442500, 9442766, 9505151, 9684379, 9754022, 9294969, 9163744, 9331780, 9449816, 9497379, 9262007, 9275783, 9232365, 9291116, 9426843, 9622253, 9463210, 9736845, 9638673, 9308405, 9317616, 9559850, 9524580, 9654768, 9735898, 9817936, 9653878]
3857I653878p158Q8105j21570K37149k8530j3346k00832J2754j27640j734L82846
3846I873922P7518k76994K0839J66124N687l805l37284J99388R5185K3675o0019
3835I784236m20583m6101j4478J10330k8593M03022J32587R3345J74291q052l19118
3824I860886P0299Q8027M2928K89911k73973l55866L101J52373L35136K2465k9794
3813A0205493K05598j08197J12011N6979r459j69410p4500J18832R8056m3076
3803A0392327O6037J19584l33553j18057j30346K88626L12669J65038o7130k99510
3793A0395685q073O0229J87270k56551L40256l1105k30938O766J71769K9845J2627
3782A0677780L28723o2028p0150N2900j7724m5551j45380j34124J39829r3682
$$ y = [9653878, 9646720, 9734825, 9613255, 9850404, 9821874, 9808528, 9607696, 9620450, 9492810, 9491076, 9873922, 9951440, 9674446, 9695285, 9861409, 9867096, 9863291, 9526007, 9725395, 9820580, 9844255, 9784236, 9363653, 9317552, 9303074, 9413404, 9384811, 9787833, 9920420, 10013765, 10188056, 10180004, 9860886, 9931185, 10019212, 10062140, 10352051, 10078078, 9722212, 9725313, 9877686, 10212822, 10235287, 10205493, 10411091, 10302894, 10414905, 10471884, 10462425, 10293015, 10218515, 10337347, 10435403, 10392327, 10458364, 10577948, 10244395, 10126338, 9995992, 10284618, 10597287, 10762325, 10695195, 10395685, 10387612, 10447841, 10635111, 10378560, 10718816, 10687711, 10456773, 10463539, 10635308, 10665153, 10677780, 11006503, 10944475, 10874325, 10927225, 10909501, 10863950, 10718570, 10584446, 10724275, 10630593]
3772A0630593j29836J47971K12860L24204j29115k58648L9328j1776K86746K1782
3762A1134109O6009j17810j56292j2019J56935J7940o0227J27020n3410k2853
3752A1079402J93228J69487j12927j03398J48609n1129l8577J89149J0059j0283
3742A1473620O0902q312k0383j33858L7721L33105L31206j12056K35516j93915
3732A2003546j18180K38091j05378K68637j88420k88939J35679K23758l15125
3723A1853669J52081L26263M161j41338J84022j97025j07523n4776P4775O4020
3713A2158329L0703J79796J41153r6629J05645p8839n109P08476m5819k8617q400
3702A3060689n0429Q2351Q7876K35237J4080P0107L47717J8904l4515K2315P3039
$$ y = [10630593, 10500757, 10648728, 10861588, 11185792, 11056677, 10798029, 10837357, 10825581, 11112327, 11134109, 11200118, 11082308, 10926016, 10913997, 11070932, 11088872, 11028645, 11155665, 11102255, 11079402, 11272630, 11442117, 11329190, 11225792, 11374401, 11323272, 11284695, 11473844, 11483903, 11473620, 11534522, 11526210, 11505827, 11371969, 11409690, 11742795, 12074001, 11961945, 12197461, 12003546, 11885366, 12123457, 12018079, 12286716, 12098296, 11809357, 11945036, 12168794, 11853669, 12005750, 12332013, 12336174, 12194836, 12378858, 12181833, 12074310, 12019534, 12094309, 12158329, 12189032, 12368828, 12509981, 12413352, 12518997, 12440158, 12435049, 13143525, 13097706, 13069089, 13060689, 13010260, 13092611, 13180487, 13415724, 13429804, 13499911, 13847628, 13866532, 13832017, 13854332, 13927371]
3691A3927371J14034K53915J03366J95229L83799j83031J55438L85293p13J9825
3681A5354526K04477n6577J7209J73793J72555K72621J77640K11851k0805j48711
3671A6358579J42678P19053L28063K54792K21028L02401Q3658J75710K78231K16347
3661A9080540M01401K45745M02659O45868M69646M20066M52419M79107K96421
3652B2893872N59275M72625L18503P83539O00751P26234L20043K55394N77721
3643B7507957N64711M25737P65078O41360K91050M62459K54372K67821L84337
3634C1564882P58829L64439J36883L68255K1823n7232N5946K61582M52467l1449
3624C3896425j10953K64708k99398J43096J94963k36137k32240l23079L29956
$$ y = [13927371, 14041405, 14295320, 14398686, 14593915, 14977714, 14794683, 14950121, 15335414, 15334701, 15354526, 15559003, 15502426, 15519635, 15693428, 15865983, 16138604, 16316244, 16528095, 16507290, 16358579, 16501257, 17220310, 17548373, 17803165, 18024193, 18326594, 18410252, 18585962, 18864193, 19080540, 19481941, 19727686, 20130345, 20776213, 21245859, 21665925, 22118344, 22597451, 22893872, 23453147, 23925772, 24244275, 25027814, 25628565, 26354799, 26674842, 26930236, 27507957, 28072668, 28498405, 29263483, 29904843, 30195893, 30658352, 30912724, 31180545, 31564882, 32323711, 32688150, 32825033, 33193288, 33215111, 33157879, 33213825, 33475407, 33927874, 33896425, 33785472, 34050180, 33750782, 33893878, 34088841, 33852704, 33620464, 33297385, 33627341]
3615C3627341j3755j00257K33903j85230J03265J71817J10042J42608j25972j50700
3605C3813062l8964k22323K75871r8238j16559K53454J77818L49192J85803M076
3595C4583192K7181L58779k390q2870N2560M36154K57880L55506L94419j05123
3585C6275288L55278L66295M77622L34689O0404m7318M78382L94495L63471L97599
3575C9456205J03915K73328L92378L36144M69232M99540K10301O43390M35853
3566D2820286L54772M91893M72680N07133M61394L70324M04165O98531N27255
3557D7108433N94698O91761L67918N18784O17760M76944O37153O61835O94074
3548E2369360Q11503P09916O62377M86483P96509Q38957J144664J139474Q21312
$$ y = [33627341, 33613586, 33513329, 33747232, 33562002, 33665267, 33837084, 33947126, 34089734, 33963762, 33813062, 33774098, 33551775, 33827646, 33729408, 33612849, 33866303, 34044121, 34393313, 34579116, 34583192, 34610373, 34969152, 34966762, 34883892, 34936452, 35372606, 35630486, 35985992, 36380411, 36275288, 36630566, 36996861, 37474483, 37809172, 37869576, 37822258, 38300640, 38695135, 39058606, 39456205, 39560120, 39833448, 40225826, 40561970, 41031202, 41530742, 41741043, 42384433, 42820286, 43175058, 43666951, 44139631, 44646764, 45108158, 45478482, 45882647, 46581178, 47108433, 47703131, 48394892, 48762810, 49281594, 49899354, 50376298, 51013451, 51675286, 52369360, 53180863, 53890779, 54553156, 55039639, 55836148, 56675105, 57819769, 58959243, 59780555]
3539E9780555J000589J108777J252688J453807J201153J396974J622345J717974
3531G0534862J469239J802348J623713K008333K397695K383946K391262K717914
3523H7329312K899154K635333K872635K983216L467024L404626L756053L703154
3515A13050507L991034L992426M133329M293212M299309M382623M224607M173489
3507A46540536M171884M400382M360511M044952M228958M015925L862825M027313
3499A79653286L834634L520104L680969L405676K705314K977853L093490K647396
3491B05518722K599280K192256K528042K370884J879408J792924J850416K022078
3483B22754010K094640J915781J970030K104292K128983J955676K136502L035448
$$ y = [59780555, 60781144, 61889921, 63142609, 64596416, 65797569, 67194543, 68816888, 70534862, 72004101, 73806449, 75430162, 77438495, 79836190, 82220136, 84611398, 87329312, 90228466, 92863799, 95736434, 98719650, 102186674, 105591300, 109347353, 113050507, 117041541, 121033967, 125167296, 129460508, 133759817, 138142440, 142367047, 146540536, 150712420, 155112802, 159473313, 163518265, 167747223, 171763148, 175625973, 179653286, 183487920, 187008024, 190688993, 194094669, 196799983, 199777836, 202871326, 205518722, 208118002, 210310258, 212838300, 215209184, 217088592, 218881516, 220731932, 222754010, 224848650, 226764431, 228734461, 230838753, 232967736, 234923412, 237059914, 240095362]
3475B40095362K808724L169317L291713L486874L817298M004674M334162M384812
3467B69392936M202702M574229M841410M704594M500776M588538M382743L635644
3459C04823572M006361L633403K947472K897355K160221J501635J269524Q02067
3451C24041610L67862k73857q58278j474767k181396k758911l099434l650798
3443C10112031m048598m280994n318138n353009n875560o088100o394141o608800
3435B66144691o473232o649891o609213o722493o037077o315263o053114n801185
3427B15483223n441403n565760n697016n123970n012352m377008m230102m358752
3419A75676860m379619l536079l377445l464633l465573l055838k626929k701778
$$ y = [240095362, 242904086, 246073403, 249365116, 252851990, 256669288, 260673962, 265008124, 269392936, 273595638, 278169867, 283011277, 287715871, 292216647, 296805185, 301187928, 304823572, 308829933, 312463336, 315410808, 318308163, 320468384, 321970019, 323239543, 324041610, 324409472, 324135615, 323277337, 321802570, 319621174, 316862263, 313762829, 310112031, 306063433, 301782439, 296464301, 291111292, 285235732, 279147632, 272753491, 266144691, 259671459, 253021568, 246412355, 239689862, 233652785, 227337522, 221284408, 215483223, 210041820, 204476060, 198779044, 193655074, 188642722, 184265714, 180035612, 175676860, 171297241, 167761162, 164383717, 160919084, 157453511, 154397673, 151770744, 149068966]
3411A49068966k844571k497141k453390k585556k155934k014727j812551j815265
3403A30889831j444713j508046j115815j262016j327905j011491j030896q46792
3395A21342157n22265p32107p67128q86084m82251l09289m88494l44801l88229
3386A16421509l32005m25458p0008k86791m03758o72144k39244j60511q8855k02309
3376A13540426n69004k97648m2877J99775l53500m03078K81945J67339L6894J02146
3366A12662418R5485L13885P05049L57871J2653P69969J102297O45905O47461
3357A17312993R50483O85002R67765J376728J081489J051492J402417J494938
3349A26323307J466403J397914J639944J772892J847814K133965K248306K165903
$$ y = [149068966, 146224395, 143727254, 141273864, 138688308, 136532374, 134517647, 132705096, 130889831, 129445118, 127937072, 126821257, 125559241, 124231336, 123219845, 122188949, 121342157, 120819892, 120087785, 119320657, 118434573, 117952322, 117643033, 117154539, 116809738, 116421509, 116089504, 115664046, 115594038, 115307247, 114903489, 114231345, 113992101, 113831590, 113742735, 113540426, 112971422, 112673774, 112630897, 112830672, 112477172, 112074094, 112356039, 112523378, 112560272, 112662418, 112757903, 113071788, 113776837, 114134708, 114147361, 114917330, 116019627, 116665532, 117312993, 118263476, 118948478, 119916243, 121292971, 122374460, 123425952, 124828369, 126323307, 127789710, 129187624, 130827568, 132600460, 134448274, 136582239, 138830545, 140996448]
3341A40996448K282622K323387K287716K701997K614278K798045K829840K796524
3333A61630857K815117K942175L002034L084671L069098L361715L397064L404866
3325A86707597L442342L480391L887699L809816M053582M344021M392432M419131
3317B18537011M281712M509145M716488M671982M684506M376980M384102M065397
3309B54227323M261583L791358L385890K967036K593491K011608J453782R65863
3301B75657934P61881L19435k67449p93856j010385r75105j666732j913068k289891
3292B67822764k707631k579679k632732k901469l115832l480934l569041l618415
3284B43217031l843565l582442m001780m217363m351295m295562m420423m567445
$$ y = [140996448, 143279070, 145602457, 147890173, 150592170, 153206448, 156004493, 158834333, 161630857, 164445974, 167388149, 170390183, 173474854, 176543952, 179905667, 183302731, 186707597, 190149939, 193630330, 197518029, 201327845, 205381427, 209725448, 214117880, 218537011, 222818723, 227327868, 232044356, 236716338, 241400844, 245777824, 250161926, 254227323, 258488906, 262280264, 265666154, 268633190, 271226681, 273238289, 274692071, 275657934, 276419815, 276739250, 276471801, 275677945, 274667560, 273692455, 272025723, 270112655, 267822764, 265115133, 262535454, 259902722, 257001253, 253885421, 250404487, 246835446, 243217031, 239373466, 235791024, 231789244, 227571881, 223220586, 218925024, 214504601, 209937156]
3276B09937156n084266m818810m634619n147152m490014m648681m682347m553888
3268A71877379m226109m447373m501032m106550m079881l744496l999776l568374
3260A39203788l301348l305037k734496k915014k839312k574534k431495k519300
3252A16583252k197435k221015k026256j835981j715534j671245j421897j431778
3244A02062111j538530j677493r16385j368721r26675j085817j236355j121142
3236I2190993q46176r26782q66943p43567r10675q56329j019039q90987r74079
3227H4156416r71083r72560q68883j295950j055432j047890r88790j279812j176346
3218G4499670r43373j140747r21300j141004j379581j035878r88899q67245j197022
$$ y = [209937156, 204852890, 200034080, 195399461, 190252309, 185762295, 181113614, 176431267, 171877379, 167651270, 163203897, 158702865, 154596315, 150516434, 146771938, 142772162, 139203788, 135902440, 132597403, 129862907, 126947893, 124108581, 121534047, 119102552, 116583252, 114385817, 112164802, 110138546, 108302565, 106587031, 104915786, 103493889, 102062111, 100523581, 98846088, 97929703, 96560982, 95634307, 94548490, 93312135, 92190993, 91344817, 90418035, 89551092, 88807525, 87896850, 87040521, 86021482, 85130495, 84156416, 83185333, 82212773, 81343890, 80047940, 78992508, 77944618, 76955828, 75676016, 74499670, 73556297, 72415550, 71494250, 70353246, 68973665, 67937787, 66948888, 66081643, 64884621]
3209F4884621j193663p25553q78802j482631q68005o83552q55523o76605o55440
3200E6864847p04502o75429q47791n35372n92775k16443p29826m84098m04022
3191E1674589k82901l77270j77651k09970n74868o21716l91597j46561J2684J03531
3181D9008270l03827k74564l13287l36989l10750J11957k35405n4134r7549K1692
3171D7215414n5801j00331K50033K9444l7079l55543k32365N8412R6092L13098
3161D7181374J26587K81271k50143P5980j0888K73888J06327K65155K85547K17666
3151D8552764J76530L70808L4235J24126M31946K77448M21624L74041N24781L87903
3141E1676206M52852M71954P36283M51317M30476O14395R51883L52569P53370
$$ y = [64884621, 63690958, 62965405, 62086603, 60603972, 59735967, 59052415, 58196892, 57520287, 56864847, 56160345, 55484916, 54637125, 54101753, 53508978, 53292535, 52562709, 52078611, 51674589, 51391688, 51014418, 50836767, 50626797, 50051929, 49430213, 49038616, 48892055, 48904739, 49008270, 48704443, 48429879, 48116592, 47779603, 47468853, 47580810, 47345405, 47291271, 47193722, 47215414, 47159613, 47059282, 47309315, 47338759, 47301680, 46946137, 46713772, 46772184, 46868276, 47181374, 47307961, 47589232, 47339089, 47415069, 47404181, 47678069, 47784396, 48049551, 48335098, 48552764, 48729294, 49100102, 49134337, 49258463, 49690409, 49967857, 50389481, 50763522, 51288303, 51676206, 52129058, 52601012, 53337295, 53788612, 54219088, 54833483, 55785366, 56137935, 56891305]
3132E6891305Q77757Q48778N38895O77555J283405Q12906J126479R47129J029935
3123F5034144J099453J145355J473182J014414J558774J616368J253648J746876
3115G5942214J806392J906574K053606J752976K017295K643068K765620K599681
3107I3487426K640691K841728L420467L543177L496487L671523M326297M823715
3099A22251511M649694M688116N114529N789916N721109O242226O663534O742661
3091A67863296P326846P914994Q512486Q609737R102613R179972R853554J0214614
3083B38578112J0235794J0600886J0940500J0948148J1033509J0990305J0860809
3076C14188063J0706556J0965567J0900937J1224833J1472108J0866804J1147978
$$ y = [56891305, 57769062, 58617840, 59156735, 59834290, 61117695, 61930601, 63057080, 64004209, 65034144, 66133597, 67278952, 68752134, 69766548, 71325322, 72941690, 74195338, 75942214, 77748606, 79655180, 81708786, 83461762, 85479057, 88122125, 90887745, 93487426, 96128117, 98969845, 102390312, 105933489, 109429976, 113101499, 117427796, 122251511, 126901205, 131589321, 136703850, 142493766, 148214875, 154457101, 161120635, 167863296, 175190142, 183105136, 191617622, 200227359, 209329972, 218509944, 228363498, 238578112, 248813906, 259414792, 270355292, 281303440, 292336949, 303327254, 314188063, 324894619, 335860186, 346761123, 357985956, 369458064, 380324868, 391472846]
3069C91472846J0956973J0898669J0077579R455341Q348020P420719N673833L461453
3061D57765433J805146n90029k671601m511893o340825q575125r704968j0431735
3053D16744403j1809801j2309313j2788351j3011715j3267657j2913828j2943153
3046C27700585j2828555j2158578j1821257j1826817j0967701j0478760j0139249
3039B47479668r469464r386370q924416q455492p818846o976211o944320o711423
3031A82793126o168895n837450n634409n344827n017058m762853m676239m542615
3023A40808780m354797l906736l860949l751985l562044l194225k969871k952636
3015A12255537l009836k698137k826458l066597k401935k386406k494700k040822
$$ y = [391472846, 402429819, 413328488, 423406067, 432861408, 441209428, 448630147, 454303980, 457765433, 459570579, 458980550, 456308949, 451797056, 445456231, 436881106, 427176138, 416744403, 404934602, 392625289, 379836938, 366825223, 353557566, 340643738, 327700585, 314872030, 302713452, 290892195, 279065378, 268097677, 257618917, 247479668, 238010204, 228623834, 219699418, 211243926, 203425080, 196448869, 189504549, 182793126, 176624231, 170786781, 165152372, 159807545, 154790487, 150027634, 145351395, 140808780, 136453983, 132547247, 128686298, 124934313, 121372269, 118178044, 115208173, 112255537, 109245701, 106547564, 103721106, 100654509, 98252574, 95866168, 93371468, 91330646]
3007I1330646k029601j907086j956418k183117j622905j781868j564106j894040
2999G6391505j524360j317051j396060j615136j447948j331387j377451j342429
2991F5039683j341750r91811p58745q89912j271198j336571p90076j270063o32066
2982E5757491p60624j076655j092529j115767p66929m33294o29100q03698q50470
2973D8228425q91811p17909o12144m01880p73266m83290n68583o79681m51291
2964D2648570m65597p34271n77200m43906k61744m75021k78209l42724n65646
2955C8504252n99503l67280n59097m27952p10787m00949m84680o56580k00516
2946C4096908k57808n85699p6605j96419o91418l17559l41379j64445l80122l42245
$$ y = [91330646, 89301045, 87393959, 85437541, 83254424, 81631519, 79849651, 78285545, 76391505, 74867145, 73550094, 72154034, 70538898, 69090950, 67759563, 66382112, 65039683, 63697933, 62706122, 61947377, 61057465, 59786267, 58449696, 57659620, 56389557, 55757491, 54996867, 53920212, 52827683, 51711916, 50944987, 50511693, 49882593, 49078895, 48228425, 47336614, 46618705, 46006561, 45604681, 44831415, 44348125, 43779542, 43099861, 42648570, 42182973, 41448702, 40871502, 40427596, 40165852, 39690831, 39412622, 39069898, 38504252, 37904749, 37537469, 36978372, 36550420, 35839633, 35438684, 34954004, 34297424, 34096908, 33839100, 33253401, 33176796, 32980377, 32288959, 31971400, 31630021, 31465576, 31085454, 30743209]
2936C0743209m35283j32076m09149j67034k42920k73314p30231l99524k12456
2927B7741222l9102l05795n96959J17379r0199m35941j67168j69212k60082k87970
2917B5506173k65447k62406K4050j69004n13119J0644m65446m39894l09370j43419
2907B2972762l08659l00685j63119j42727l02557Q0231O9458k80954o36367l40077
2897B0647306j67081j70981j66430o2934j84885j52439l9721j13385k47243k68244
2887A9073963j48056p4241k93592J12670m1665O338r1575k91988j87208J70206
2877A8234852j30484n30071N1780l03731L9670K15680l07193j89756l63818k37735
2867A6479194J04406j68245k50705J20475j1031n47741L8765j79066n9510p7195
$$ y = [30743209, 30307926, 30175850, 29766701, 29599667, 29356747, 29083433, 28353202, 27953678, 27741222, 27702120, 27396325, 26799366, 26916745, 26826546, 26390605, 26223437, 26054225, 25794143, 25506173, 25240726, 24978320, 25002370, 24833366, 24320247, 24330891, 23865445, 23425551, 23116181, 22972762, 22664103, 22363418, 22200299, 22057572, 21755015, 21835246, 21904704, 21623750, 20987383, 20647306, 20480225, 20309244, 20142814, 20079880, 19894995, 19742556, 19702835, 19589450, 19342207, 19073963, 18925907, 18851666, 18558074, 18670744, 18629079, 18635417, 18543842, 18251854, 18064646, 18234852, 18104368, 17574297, 17626077, 17322346, 17362016, 17577696, 17270503, 17080747, 16716929, 16479194, 16583600, 16415355, 16164650, 16285125, 16274094, 15726353, 15765118, 15586052, 15526542, 15449347]
2857A5449347Q6528J77890j81186l55933j49060J97917L14409l79810K004J72095
2847A5334201j54656l01059k41238J07667J24668j19501j96863N6270j40532j49955
2837A4319002k7222o2839k82700j51408R9890J04548j21609m1195j33466m15589
2827A3287412J01489J83847J02274k14844k15081J04044n530K9758l2622p6670
2817A3264077J27993J83340k83501j0643K56103l23540k17304O9856k02746O9455
2807A2933090J31046N6959l8742N417Q7807k57781l3306j5909j29594J74526K54907
2796A3168420m6795m8558J9258J77180k0021j82593K83733j37787m2582J44228
2786A3314483q5483J29811k18548L5637J32178k51002P7302O5580J98641r1338
$$ y = [15449347, 15535875, 15713765, 15532579, 15176646, 15027586, 15225503, 15539912, 15160102, 15162106, 15334201, 15179545, 14878486, 14637248, 14744915, 14869583, 14750082, 14553219, 14609489, 14468957, 14319002, 14291780, 14228941, 13946241, 13794833, 13894723, 13999271, 13877662, 13836467, 13703001, 13287412, 13388901, 13572748, 13675022, 13460178, 13245097, 13349141, 13343611, 13373369, 13340747, 13264077, 13392070, 13575410, 13291909, 13281266, 13537369, 13213829, 12996525, 13066381, 12863635, 12933090, 13064136, 13121095, 13082353, 13087770, 13175577, 12917796, 12884490, 12868581, 12738987, 12913513, 13168420, 13121625, 13073067, 13092325, 13269505, 13249484, 13066891, 13350624, 13212837, 13170255, 13314483, 13229000, 13358811, 13140263, 13175900, 13308078, 13057076, 13134378, 13199958, 13398599, 13307261]
2776A3307261k75074o6361j31630o6342L2936L5187Q2202j20814j42985j70172
2766A2484208j85373j68363J2826j37316p6892r902J8169o4042j15095j95685
2756A1562535J02334j74191m27665j47423J71860o3600k1347j35253j07414Q2647
2746A0842483P8134j91592l94471m4442n0458j01679j45563K16664J37841k07287
2736A0139630o602k27964p0523K30978l41297n3591J844q8956K37572p9880l98443
2725I342768J0595N9915P7964k8660J90961j13347j02997k16477j09922M6337
2715I157137J23024l8783J4624j20802j63145J07606K6322l32331k24067Q6131
2705H635716J47896K22292J82041j69073q3600k13392j23794p0994J87561j30117
$$ y = [13307261, 13032187, 12965826, 12834196, 12767854, 12800790, 12835977, 12918179, 12797365, 12654380, 12484208, 12298835, 12130472, 12143298, 12005982, 11929090, 11919188, 11937357, 11873315, 11758220, 11562535, 11664869, 11490678, 11063013, 10915590, 11087450, 11023850, 11002503, 10867250, 10759836, 10842483, 10920617, 10729025, 10334554, 10290112, 10239654, 10137975, 9992412, 10209076, 10346917, 10139630, 10133028, 9905064, 9834541, 10065519, 9724222, 9670631, 9672475, 9583519, 9821091, 9741211, 9342768, 9353363, 9413278, 9491242, 9462582, 9653543, 9540196, 9437199, 9220722, 9110800, 9157137, 9280161, 9241378, 9256002, 9135200, 8972055, 9079661, 9105983, 8773652, 8549585, 8635716, 8783612, 9005904, 9187945, 9018872, 8935272, 8721880, 8598086, 8527092, 8714653, 8584536]
2695H584536m2499K82461Q9388m9360k81703n0004o3153K47648q6881K6864l33027
2684H324270J36717J13773k02404j75360k59469K67164l417k1356j85728O3471
2674H057661m0048k47569K21566J07855J0550J21453r6474p1927k08584j7316
2664G837167J22541j85770k10733K57726k0293j21593L00874j8765j34508j51676
2654G674970m8929k2321L6083J09085J52500m44442r9767J93767K1703K38683
2644G811332o8528o8714j73219j40429J24132K8709J10654j20846o1777L517m8408
2633G396423j47858N2309L7388l904l1745j09681j73139Q9823J72926o0017J73532
2622G396057J59292k37321j24447L7595J40567o1645J41220r4174j15779J20259
$$ y = [8584536, 8542037, 8824498, 8913886, 8864526, 8582823, 8532819, 8469666, 8717314, 8630433, 8657297, 8324270, 8460987, 8574760, 8372356, 8196996, 7937527, 8204691, 8201274, 8179918, 7994190, 8057661, 8017613, 7770044, 7991610, 8099465, 8110015, 8231468, 8134994, 8063067, 7854483, 7837167, 7959708, 7773938, 7563205, 7820931, 7800638, 7679045, 7979919, 7961154, 7826646, 7674970, 7626041, 7603720, 7639803, 7748888, 7901388, 7456946, 7357179, 7550946, 7572649, 7811332, 7742804, 7674090, 7500871, 7360442, 7484574, 7513283, 7623937, 7503091, 7441314, 7444831, 7396423, 7248565, 7300874, 7338262, 7334358, 7302613, 7192932, 7019793, 7109616, 7282542, 7222525, 7396057, 7555349, 7318028, 7193581, 7231176, 7371743, 7310098, 7451318, 7357144, 7241365, 7361624]
2612G361624j10253R8000J14678k15011l93725j09326K44751J66949J10257j78849
2602G089095J39038J31852j26395K96578n851L0968K04887j63072j68868Q1344
2592G509576r2693J76515k02190j70294K06157k49078j61381L02402k79363j34610
2582F905041K21054p7190O3508j2252k10828Q2522j18736m14609K38356K40320
2572F917186k29419j61063L64649k7303j07659j90983k7751J657L67480k4019
2562F882775k26149p8087k2968L927P7436L55459j98330L7059l40284j49075K69602
2551F611365K64687o3723j08209J2703q289n1399L04301k54510j82492P1019j38683
2540F456770J55014j1528n3082J72486j3588O0329k2223j28906L56759J2724m6409
$$ y = [7361624, 7251371, 7349371, 7464049, 7249038, 6855313, 6745987, 6990738, 7157687, 7267944, 7089095, 7228133, 7359985, 7233590, 7530168, 7524317, 7555285, 7760172, 7597100, 7428232, 7509576, 7416883, 7593398, 7391208, 7220914, 7427071, 7177993, 7016612, 7319014, 7039651, 6905041, 7126095, 7048905, 7112413, 7100161, 6889333, 6971855, 6853119, 6438510, 6676866, 6917186, 6687767, 6526704, 6891353, 6864050, 6756391, 6565408, 6537657, 6539314, 6906794, 6882775, 6656626, 6578539, 6555571, 6559498, 6636934, 6992393, 6794063, 6831122, 6490838, 6341763, 6611365, 6876052, 6812329, 6704120, 6716823, 6708534, 6657135, 6961436, 6706926, 6524434, 6595453, 6456770, 6611784, 6600256, 6547174, 6719660, 6706072, 6766401, 6744178, 6615272, 6972031, 6984755, 6938346]
2529F938346k75561J3024L33453k03770j10997R8324j71497l2243j20855p3697
2519F394527K9116m1500j40553M2549Q4418O1886N9821j23681q4905L4790j1550
2508F304918j15176L32531l4427M4306J28223p0550k21490P2133k41527J96396
2498F395337N9309J9357k4491k54794J00188K43649l6580j7732M6502j25971O3802
2487F468576J59143N6512k92334m9694N9470j53880r2947L8122J27389r150L3969
2476F345176J71997J54876m09782o00N9080J44639J06095j61570R1187M994j14020
2465F392072o1865R5093J16898K21858p0225j41177o9577J51590q219j64147R858
2454F472159K29092j48598j75664k08741N0605K18320r3724k31628p1784J35262
$$ y = [6938346, 6662785, 6675809, 7009262, 6805492, 6694495, 6792819, 6621322, 6589079, 6468224, 6394527, 6423643, 6382143, 6241590, 6284139, 6368557, 6430443, 6490264, 6366583, 6281678, 6316468, 6304918, 6189742, 6522273, 6487846, 6532152, 6660375, 6589825, 6368335, 6440468, 6198941, 6395337, 6454646, 6474003, 6449512, 6194718, 6294906, 6538555, 6501975, 6484243, 6530745, 6404774, 6468576, 6627719, 6684231, 6391897, 6342203, 6401673, 6247793, 6154846, 6192968, 6320357, 6311207, 6345176, 6517173, 6672049, 6262267, 6261667, 6320747, 6465386, 6571481, 6409911, 6501098, 6506092, 6392072, 6330207, 6425300, 6542198, 6764056, 6693831, 6552654, 6483077, 6634667, 6626448, 6462301, 6472159, 6701251, 6552653, 6376989, 6168248, 6218853, 6437173, 6343449, 6111821, 6040037, 6175299]
2444F175299J85666O7043o0921M4931K40955J57568k35009J65291K54561l14841
2434F680543l40826K87764L95216k85752j38892L6245K01446k57116j74069k4246
2424F380313M02266J09806K1636K7107n478p490L6846L1051j14323J20090J43701
2413G145525q4805Q0422r4102J76148J14401K13692j5295J37018O640o0225K160
2402G621579r3196K65428K44228k35982j09101J3200O3896K45554l2896J02622
2392H085332L89225J05179Q8656Q8232j28249K87681L8729J26922J22428l3305
2382I170830j5100j09952M54285J97908j4570L10646R0408K13144R7836L52133
2372A0747568L37073J14134J11976J03011L44992L85118J05358M84327L54824
$$ y = [6175299, 6360965, 6428008, 6367087, 6412018, 6652973, 6810541, 6575532, 6740823, 6995384, 6680543, 6339717, 6627481, 7022697, 6736945, 6598053, 6634298, 6835744, 6578628, 6404559, 6380313, 6782579, 6892385, 6914021, 6941128, 6935650, 6928160, 6965006, 6996057, 6881734, 7001824, 7145525, 7060720, 7141142, 7047040, 7223188, 7337589, 7551281, 7535986, 7673004, 7679644, 7619419, 7621579, 7528383, 7793811, 8038039, 7802057, 7692956, 7706156, 7770052, 8015606, 7982710, 8085332, 8474557, 8579736, 8668392, 8756624, 8628375, 8916056, 8954785, 9081707, 9204135, 9170830, 9155730, 9045778, 9500063, 9697971, 9683401, 9994047, 10084455, 10297599, 10395435, 10747568, 11084641, 11198775, 11310751, 11413762, 11758754, 12143872, 12249230, 12733557, 13088381]
2363A3088381N57949O12522L74511N13362N59058L56837O17510P56530R04880
2354A8341540O59678R98901J191648J217136J065100J096624J212821J649888
2346B7433336K140399J669435J539170K128912K267009K789604K657406L076314
2338D5701585L216465L120980L089264K953785K451007K171026J923837J015170
2330F5643119K64106j89398o01101j438338j489206j543363k112997k100936k231129
2321E4200757k271617k428566k267816k108614k046633k002713j838764j837569
2313C7398465j834891j618023j528413j211966j039138j374518j537519r29351
2305B6324646p77553r06198q75298o61206o17344p10929j011415o54212m54887
$$ y = [13088381, 13646330, 14258852, 14633363, 15146725, 15705783, 16062620, 16680130, 17436660, 18341540, 19001218, 20000119, 21191767, 22408903, 23474003, 24570627, 25783448, 27433336, 29573735, 31243170, 32782340, 34911252, 37178261, 39967865, 42625271, 45701585, 48918050, 52039030, 55128294, 58082079, 60533086, 62704112, 64627949, 65643119, 65907225, 65717827, 65116726, 63678388, 62189182, 60645819, 58532822, 56431886, 54200757, 51929140, 49500574, 47232758, 45124144, 43077511, 41074798, 39236034, 37398465, 35563574, 33945551, 32417138, 31205172, 30166034, 28791516, 27253997, 26324646, 25547093, 24640895, 23765597, 23104391, 22487047, 21776118, 20764703, 20110491, 19655604]
2296A9655604o42052n06015m26580o83867o91332k34633k25523l33412l76824
2287A5535366n68390l85342m27530j65024k04658k6268m31299k35549l5969m84004
2277A2571333n51867j87505J18191j97382j67353m13010r5170n3066j37044j60552
2267A0726575l41553k0558l11065l1212k03548J32624j26719j58609j67251k73564
2257I225120N3956L07462m4912k11828k5851l83400o7745j13337j75336J81163
2247H745292j63024L409n01861q1249j92968R641L10779n0527n2630j89939M3495
2236G880418j10587o5192j61580j84261P1325p2890L3392P6j94734M4524j1412
2225G229079k95025O2864L40466p1004j70906j51212Q864m00101j38132J86956
$$ y = [19655604, 19013552, 18507537, 18080957, 17397090, 16705758, 16471125, 16245602, 15912190, 15535366, 14966976, 14581634, 14154104, 13989080, 13784422, 13758154, 13326855, 13091306, 13055337, 12571333, 12019466, 11831961, 11950152, 11752770, 11585417, 11172407, 11077237, 11024171, 10887127, 10726575, 10385022, 10364464, 10053399, 10022187, 9818639, 9951263, 9824544, 9665935, 9498684, 9225120, 9279076, 9586538, 9541626, 9329798, 9303947, 8920547, 8852802, 8739465, 8564129, 8745292, 8582268, 8585677, 8083816, 8002567, 7809599, 7819240, 8130019, 8079492, 8026862, 7836923, 7880418, 7769831, 7704639, 7543059, 7358798, 7430123, 7357233, 7390625, 7390701, 7195967, 7240491, 7229079, 6934054, 6996918, 7337384, 7266380, 7095474, 6944262, 6953126, 6553025, 6414893, 6601849]
2215F601849K21076k06962J67231l19641o2359L31837J71478j70806l08116n7935
2205F367652K6578k06043n6993R0k1083q3515k99589K73817N158p7330j94168
2194E734574J15432J88678J06868P9452k01459j25607j07829j09712R6482O1676
2184E838555K1212J53162p9502k57728J48910P7969k05256P3486o4266O5101j36090
2173E635553l13995J64786K0549j04234j4033o5410k4275j2224Q7980l6884j44805
2162E193008m7840k89051M5874K55139k93877j0847K47518m6735j53984L49431
2152E248636K64276k10434J40302O6021l60849j12700k59075M4697K89373o9230
2142E041017j32946J4254K9905n3850j08132p4882J63018N5751j70970j58945
$$ y = [6601849, 6822925, 6615963, 6783194, 6463553, 6401194, 6733031, 6904509, 6733703, 6425587, 6367652, 6394230, 6188187, 6131194, 6131284, 6110201, 6026686, 5727097, 6000914, 6006072, 5928742, 5734574, 5850006, 6038684, 6145552, 6225004, 6023545, 5897938, 5790109, 5680397, 5776879, 5838555, 5859767, 6012929, 5933427, 5675699, 5824609, 5902578, 5697322, 5770808, 5706542, 5771643, 5635553, 5321558, 5486344, 5506893, 5402659, 5388626, 5323216, 5298941, 5286717, 5374697, 5337813, 5193008, 5145168, 4856117, 4901991, 5157130, 4863253, 4852406, 5099924, 5053189, 4899205, 5248636, 5512912, 5302478, 5442780, 5508801, 5147952, 5035252, 4776177, 4820874, 5110247, 5041017, 4908071, 4922325, 4952230, 4898380, 4790248, 4715366, 4878384, 4934135, 4763165, 4604220]
2132D604220K86784r7970l05390l0861J11909K2925Q86j436K76327j37893j78404
2121D551097J84764K38431k58662j42723J80628k62754Q7790J79290J6140j95230
2111D578771R8172m1751K15145P9312n5817r0279J23074k4671r7163J62071k7703
2100D919161k7337j30397j44164j22472k1252K15560o2328o6761J75963p4199
2090D661774j91538L0768j43027j48508j48514J12441J35180J25811L76404O5397
2080D876188j69665l94607j69932J2791J63478L1560o7232L639K98835j46612
2070D438443n9533M14194j33310j27505l1508Q3614Q0893k03181M6171M1292N0010
2059D599580p408l8823p2894K12759k37222P5472L3906k13724r9330q7157J74716
$$ y = [4604220, 4891004, 4793034, 4487644, 4456783, 4568692, 4591617, 4592503, 4591067, 4867394, 4729501, 4551097, 4735861, 4974292, 4715630, 4572907, 4753535, 4490781, 4578571, 4757861, 4774001, 4578771, 4676943, 4635192, 4850337, 4929649, 4873832, 4783553, 4906627, 4881956, 4784793, 4946864, 4919161, 4891824, 4761427, 4617263, 4494791, 4473539, 4689099, 4626771, 4560010, 4735973, 4661774, 4470236, 4501004, 4357977, 4209469, 4060955, 4173396, 4308576, 4434387, 4810791, 4876188, 4706523, 4311916, 4141984, 4154775, 4318253, 4349813, 4282581, 4286220, 4585055, 4438443, 4378910, 4793104, 4659794, 4532289, 4500781, 4584395, 4665288, 4462107, 4508278, 4549570, 4599580, 4592172, 4553349, 4480455, 4693214, 4455992, 4531464, 4565370, 4351646, 4252316, 4165159, 4339875]
2048D339875j64854J55330k7984k77578J69178J65772P678l1362j54660J52906
2038D334301r7806j41651r7085N5476M82858j62795o3253J64024k02343j90555
2028D081171K74369R8540k23056j9955J21101J39739j04842o7741J0865j01147
2018D209044M4109M3782J27390L4584j61292J9639J07865o9249k84510n5964J00998
2007D116396J70375j30764l78401J75152J92380j50682K03690P7509R825j53124
1997D132356k81658J60002J316L0771j89118N7779L0454j7021r5716J04973M370
1986C938508k40465R6342L2727K66919m8722k431m0545L3891p173j20913J35468
1975D043606J27118K67135k06269k76045j21567J78381p4318l12349P4252J23180
$$ y = [4339875, 4175021, 4330351, 4302367, 4024789, 4193967, 4359739, 4367417, 4336055, 4181395, 4334301, 4236495, 4094844, 3997759, 4053235, 4536093, 4373298, 4310045, 4474069, 4271726, 4081171, 4355540, 4454080, 4231024, 4211069, 4332170, 4471909, 4367067, 4299326, 4310191, 4209044, 4253153, 4296935, 4424325, 4458909, 4297617, 4317256, 4425121, 4355872, 4071362, 4015398, 4116396, 4286771, 4156007, 3777606, 3952758, 4145138, 3994456, 4198146, 4275655, 4285480, 4132356, 3850698, 4010700, 4012016, 4042787, 3853669, 3911448, 3941902, 3924881, 3829165, 3934138, 3938508, 3698043, 3794385, 3827112, 4094031, 4045309, 4042878, 4002333, 4036224, 4029051, 3908138, 4043606, 4170724, 4437859, 4231590, 3955545, 3833978, 4012359, 3938041, 3625692, 3699944, 3823124]
1965C823124K47876k55616k61959O5095o0446j52908J90640K51158L5303j17168
1955C765099r3308J56363Q7320j68832J62177J21986j8228j71220r2316j86595
1945C562446J51447L29161j80704l86668K30805j58152L37501J6965q9484K95675
1935D108992n0435j88951k23871L5950J96158J8284j63744J4708j72637K002o5412
1924C511044j19766K04594R0246M847N8597j07652l9626j16859J51551n2512j0156
1913C574308M4956j3212j2118J69418j82876j88787L9557J98011L5196j88650
1903C475803j35562J49561K05615o9955q2088J15956K34810k51565n2622N8506
1893C648459R7541k16380l46637K78683J50665q7301l2310J26635j83177K4571
$$ y = [3823124, 4071000, 3815384, 3553425, 3618520, 3558074, 3405166, 3595806, 3846964, 3882267, 3765099, 3671791, 3828154, 3915474, 3746642, 3908819, 4030805, 4012577, 3841357, 3749041, 3562446, 3713893, 4043054, 3862350, 3475682, 3706487, 3548335, 3885836, 3902801, 3813317, 4108992, 4058557, 3869606, 3645735, 3681685, 3877843, 3896127, 3732383, 3747091, 3574454, 3576456, 3511044, 3391278, 3595872, 3686118, 3690965, 3749562, 3641910, 3602284, 3485425, 3636976, 3584464, 3574308, 3619264, 3606052, 3593934, 3763352, 3580476, 3391689, 3431246, 3629257, 3664453, 3475803, 3340241, 3489802, 3695417, 3625462, 3543374, 3659330, 3894140, 3642575, 3589953, 3648459, 3746000, 3529620, 3182983, 3461666, 3612331, 3525030, 3492720, 3619355, 3436178, 3460749]
1883C460749J46875N4629k28605O634j80937K93460K66121j05548n32752M23430
1873C604056P6969j43292K74910j44045R8181l5603j19649l25575J52611L05665
1863C744228J10219l45547j3128j75584K9169J37621l22694J49348L3299Q3143
1853C430074K09861j11343j88466j39047J33889J6585J33218K57611J33270k39610
1843C636042J82377k91216q6162J4230N7404o3876q000J81175k8276K8205P4060
1832C695963j32259l196j8092j18605P1091o0501k03964j87767J80738n0912j24101
1821C048395J45354P8184L6771J19466j19554J70310O8832k16012q7119J79147
1811C423774K99151k07430j83286k2330J12903J8876R766m7580K60656K10524
$$ y = [3460749, 3607624, 3662253, 3433648, 3440282, 3259345, 3552805, 3818926, 3713378, 3180626, 3604056, 3681025, 3537733, 3812643, 3668598, 3766779, 3731176, 3611527, 3285952, 3438563, 3744228, 3854447, 3508900, 3495772, 3320188, 3349357, 3486978, 3164284, 3313632, 3346931, 3430074, 3639935, 3528592, 3340126, 3201079, 3334968, 3351553, 3484771, 3742382, 3875652, 3636042, 3818419, 3527203, 3441041, 3455271, 3512675, 3448799, 3440799, 3621974, 3593698, 3621903, 3695963, 3563704, 3560508, 3542416, 3423811, 3494902, 3434401, 3230437, 3042670, 3223408, 3172496, 3048395, 3193749, 3271933, 3308704, 3428170, 3308616, 3478926, 3547758, 3331746, 3244627, 3423774, 3722925, 3515495, 3332209, 3309879, 3422782, 3441658, 3451424, 3403844, 3664500, 3875024]
1801C875024m36379k29996K83046k5156j83462k92737q0155L28323j41553p1538
1791C025417J03360J08108M8492k9998l7091K89458J879j39998q9269j2693J95078
1780C462743j04961p3470N2426O9690j5960O0225r761j16874P3438l2295N4797
1769C419998m6020J67583k03238k31094N9829K4777K48365k63708j27665K13684
1759C262511J34762M0695K6899j24019j2374O72K2308k18831j62727L39238o7546
1748C241588Q5393p2029j6301k62910q4967K66702P888j40229J86939j2209J8694
1737C218559k4115k69752J09824J92334P6616j664k5364m6420q6013J02326Q2393
1726C328724j30369j50455Q039k7847Q3653k04157q2488K44450J20092l5523Q9509
$$ y = [3875024, 3438645, 3208649, 3491695, 3466539, 3283077, 2990340, 2910185, 3238508, 3096955, 3025417, 3128777, 3236885, 3285377, 3255379, 3218288, 3507746, 3509625, 3369627, 3280358, 3267665, 3462743, 3357782, 3284312, 3336738, 3406428, 3390468, 3450693, 3440932, 3324058, 3397496, 3365201, 3419998, 3373978, 3541561, 3338323, 3107229, 3167058, 3191835, 3440200, 3176492, 3048827, 3262511, 3397273, 3437968, 3464867, 3340848, 3328474, 3329146, 3351454, 3132623, 2969896, 3309134, 3241588, 3326981, 3254952, 3238651, 2975741, 2890774, 3157476, 3165364, 3025135, 3212074, 3199865, 3218559, 3194444, 2924692, 3034516, 3226850, 3303466, 3301802, 3276438, 3230018, 3144005, 3246331, 3328724, 3198355, 3047900, 3055939, 3028092, 3111745, 2907588, 2825100, 3069550, 3189642, 3154119, 3243628]
1715C243628l2702m9460l6144k80709k52312P7031M10044Q1975k0701O6176k3109
1704C183717L8208j74096k85420K8268J15287K52685Q3527Q0130K6647O0138k30725
1693C178366O2090m1727k5405k43265N2575K3238J9316J83228N938j86444j08943
1682B918967J04764P2220L69667N1330k75431R9782j38517l4202m0653j07283
1672C020644j7350j56496J76813K20260k2737q3077j65733j36259q251L8983L12061
1661C178858k09025O8241J34343O0026N159J74954j06156l19233K40398J09441
1651C337006j69196j22609J85478j67874j28279K0648k6737p5525O8729M8345
1641B969986N3231j23677j31581K74429J70740l45798J09955Q9571k67931k09883
$$ y = [3243628, 3210926, 3161466, 3125322, 2844613, 2592301, 2669332, 3079376, 3161351, 3140650, 3206826, 3183717, 3221925, 3047829, 2762409, 2790677, 2905964, 3158649, 3242176, 3322306, 3348953, 3409091, 3178366, 3240456, 3198729, 3173324, 2930059, 2982634, 3005872, 3025188, 3208416, 3214354, 3027910, 2918967, 3023731, 3095951, 3465618, 3516948, 3241517, 3341299, 3202782, 3168580, 3127927, 3020644, 3003294, 2846798, 3023611, 3243871, 3221134, 3138057, 2972324, 2836065, 2827814, 2866797, 3178858, 2969833, 3038074, 3172417, 3232443, 3237602, 3412556, 3306400, 2987167, 3227565, 3337006, 3167810, 3045201, 3230679, 3062805, 2934526, 2955174, 2928437, 2852912, 2921641, 2969986, 3023217, 2899540, 2767959, 3042388, 3213128, 2867330, 2977285, 3066856, 2798925, 2589042]
1631B589042J01953j22035L50979L24653k60972K4226k88835J36488L33428r6730
1621C092197j62549j391K05827o0877J01930j48170J53427j78497j46695L05013
1611C160215J1370O4263l867M0322j72389L986O0792p8207l59355K25807j24846
1600B828091J78284R7528j11526j76045J44818L90956m0252k78021R4729l50207
1590B778355R6407J75147j03857k81522J87949K52201P6039r4525j54487k636
1580B929071l30429K59348r563m9746K42409J02447j48245j11135P4374r8308
1570B860223k3541L22234j93127L26144o8301j76222J98105m35352k21292j88639
1560B400232K63444J30712r7588Q304M532R2328r5847J59693k3496N7314j04084
$$ y = [2589042, 2690995, 2568960, 2919939, 3244592, 2983620, 3007846, 2719011, 2855499, 3188927, 3092197, 2929648, 2928257, 3134084, 3073207, 3175137, 3026967, 3180394, 3001897, 2855202, 3160215, 3171585, 3235848, 3231981, 3272303, 3099914, 3103900, 3164692, 3086485, 2727130, 2952937, 2828091, 3006375, 3103903, 2992377, 2816332, 2961150, 3352106, 3311854, 3033833, 3128562, 2778355, 2874762, 3049909, 2946052, 2664530, 2852479, 3104680, 3180719, 3086194, 2931707, 2929071, 2598642, 2857990, 2848427, 2798681, 3041090, 3143537, 2995292, 2884157, 2958531, 2860223, 2836682, 3158916, 2965789, 3291933, 3223632, 3047410, 3245515, 2810163, 2588871, 2400232, 2663676, 2794388, 2696800, 2705104, 2709636, 2801964, 2706117, 2865810, 2842314, 2899628, 2795544]
1549B795544k2409P1509R4780j77048R3570O7840j08154J79796k94012k83032
1539B418384K21335Q8575K0685J32659J7173J97268K19926k92314k24640Q8286
1529B887337j47042l9510R8067q7983O6560P4442M0492J49478K357j43542m9351
1518B851305K3304l54033j39599J41917K60347j13571o5581n1172R8947Q0823
1508B732687J75998K14457m4228j2373o1868R322J43480J42964k2489j42160k22194
1497B913596J19068j23582o6042M5622k7406o1371J29403R9436j84655j80223
1487B663846J04608J40120j66234J06406P2126j93858J15040o0039j16055j35557
1477B530403L11089q560l86383K52869J44583m03867P9793J5377R9800J33680
$$ y = [2795544, 2773135, 2844644, 2939424, 2762376, 2855946, 2923786, 2815632, 2995428, 2701416, 2418384, 2639719, 2728294, 2748979, 2881638, 2898811, 3096079, 3316005, 3023691, 2799051, 2887337, 2740295, 2700785, 2798852, 2710869, 2777429, 2851871, 2892363, 3041841, 3044198, 2900656, 2851305, 2874609, 2520576, 2380977, 2522894, 2783241, 2669670, 2604089, 2552917, 2651864, 2732687, 2908685, 3123142, 3078914, 3066541, 3004673, 3013995, 3157475, 3300439, 3277950, 3135790, 2913596, 3032664, 2909082, 2843040, 2888662, 2861256, 2799885, 2929288, 3028724, 2844069, 2663846, 2768454, 2908574, 2742340, 2848746, 2920872, 2727014, 2842054, 2782015, 2665960, 2530403, 2841492, 2832932, 2446549, 2699418, 2844001, 2440134, 2519927, 2535304, 2635104, 2768784]
1467B768784K5869m3951q9359n734O1413J23777J3504P1057j66252o8055L1223
1456B722276J03458j55670N61L04483Q9354m0183q5888l38511O0941k06229J30389
1445B584981L64123K14866k34928k81624M5439o3358R2046O3362K0606k37644
1435B567869K90776J60017j99869j05959K0822J58300L7482j01345k731J04389
1425B929751j73441r3541j3630j52351K61986L8338k4873J139j10650j6856j6317
1414B629555K4318J32085j59574J74036j19033k31934k7163J22658J76445j86715
1404B534678n3056N7292J65265o2279j12042r1755K22087m9750J94708j04280
1394B700868k8183n6133j57438J11056K13619k3298l3075l3893j55935k57548
$$ y = [2768784, 2794653, 2750702, 2661343, 2655609, 2717022, 2840799, 2854303, 2925360, 2759108, 2691053, 2722276, 2825734, 2670064, 2670625, 2975108, 3064462, 3024279, 2938391, 2599880, 2660821, 2454592, 2584981, 2949104, 3163970, 2929042, 2647418, 2692857, 2629499, 2721545, 2784907, 2805513, 2567869, 2858645, 3018662, 2818793, 2712834, 2733656, 2891956, 2929438, 2828093, 2825362, 2929751, 2756310, 2662769, 2649139, 2496788, 2758774, 2797112, 2772239, 2773378, 2662728, 2645872, 2629555, 2653873, 2785958, 2626384, 2800420, 2681387, 2449453, 2422290, 2544948, 2721393, 2534678, 2481622, 2538914, 2704179, 2641900, 2529858, 2438103, 2660190, 2610440, 2805148, 2700868, 2672685, 2616552, 2459114, 2570170, 2783789, 2760491, 2727416, 2693523, 2537588, 2280040]
1384B280040O4721o7150p3258J62030K35863J57286j62950K2198j29589n2254
1374B436937K37173p5195l62954j05904L67482K70653L2292R0725k37077p9334
1364B574798J03751O2878J79996m551j87110o3182J21196L0514l97907O4990N05367
1353B990740l31646j88341K95163p7753m7491J83924j99444j64491J115l6454
1343B425322J03220j83396j5076K70411j42083j53279K20788J33156j86622J175
1333B473616o8501J3163J99796k9986O3307k42868k1492M6114J92508r257k30484
1322B385916k0942q6916Q5635Q5770k86934J108J94332N6100o0355J83470J56500
1311B693684j38150m5466j789J63319l8491k00843K39994o8537J6262p6110n6054
$$ y = [2280040, 2344761, 2277611, 2204353, 2366383, 2602246, 2759532, 2596582, 2618780, 2489191, 2436937, 2674110, 2598915, 2235961, 2130057, 2497539, 2768192, 2800484, 2891209, 2654132, 2574798, 2678549, 2741427, 2921423, 2916872, 2729762, 2666580, 2787776, 2818290, 2420383, 2485373, 2990740, 2659094, 2470753, 2765916, 2688163, 2640672, 2824596, 2625152, 2460661, 2461776, 2425322, 2528542, 2345146, 2330070, 2600481, 2458398, 2305119, 2525907, 2659063, 2472441, 2473616, 2405115, 2418278, 2618074, 2588088, 2651395, 2408527, 2387035, 2433149, 2625657, 2616400, 2385916, 2364974, 2278058, 2363693, 2449463, 2162529, 2163637, 2357969, 2414069, 2353714, 2537184, 2693684, 2555534, 2510068, 2508279, 2671598, 2633107, 2432264, 2672258, 2603721, 2619983, 2543873, 2487819]
1300B487819j5633l1017K09106j21913N6184p881r460J75723j15087Q731K38525
1289B875097j629N4318m6136j82788K44713m30013l8913N2128k61555j29995K54950
1278B390177J77176l3319R0988j38700L22094p6978J81798J81438j30160n9511
1268B905003k1213l02130p3213K05117o0856l54370j89243J72030O4439J94738
1258B540302o2516k77927J5730K45875R9444j07129j22039Q4708J98890J9340
1248B634678k02043p2486K37203j36255k45871J60590J91531L8289m4930p7841
1238B482865J63952l7389j94958p2475J38580K5731p5278K8975j74118J04704
1228B390589L05961N9391l14908k24676k5394J32515O2781R5541r9683K047m6665
$$ y = [2487819, 2472186, 2441169, 2650275, 2528362, 2584546, 2576665, 2567205, 2742928, 2627841, 2636572, 2875097, 2873468, 2927786, 2881650, 2698862, 2943575, 2513562, 2474649, 2526777, 2265222, 2135227, 2390177, 2567353, 2534034, 2625022, 2486322, 2808416, 2731438, 2913236, 3094674, 2964514, 2905003, 2883790, 2581660, 2508447, 2713564, 2652708, 2298338, 2109095, 2281125, 2345564, 2540302, 2477786, 2199859, 2215589, 2461464, 2560908, 2453779, 2331740, 2416448, 2615338, 2634678, 2432635, 2360149, 2597352, 2461097, 2215226, 2375816, 2567347, 2605636, 2560706, 2482865, 2646817, 2609428, 2414470, 2341995, 2480575, 2506306, 2431028, 2460003, 2285885, 2390589, 2696550, 2755941, 2441033, 2216357, 2190963, 2323478, 2386259, 2481800, 2382117, 2384164, 2337499]
1217B337499j38142P5483K44913O1329k11882p0588j17116q5225q2846L37879
1207B351304n4614m5565J00649J31442j54761K47217L207o9424J78690j57083
1197B531062k30125J60105L15287p9086P4103n1757j3286j52116j68609o8552
1187B317026j87390K86842M5379n5176J41374j03573N1855k7699j42351J21047
1177B447334M047k68926J55041q6912N5751m4220O4628o1212n5009N4275J7247
1166B282044K50215r8261J66547r0797k9391j792l2043k99460j04582N977J10786
1155B159243P3686r450Q0067N146N6855p3069m5453j4779K23518j05882j25272
1144B224610J97105l719k6241M8684q7131K54228M770K78972p0963l52553M0370
$$ y = [2337499, 2199357, 2274840, 2519753, 2581082, 2369200, 2298612, 2181496, 2096271, 2013425, 2351304, 2296690, 2251125, 2351774, 2483216, 2328455, 2575672, 2578879, 2509455, 2688145, 2531062, 2300937, 2461042, 2776329, 2697243, 2771346, 2719589, 2706303, 2554187, 2385578, 2317026, 2129636, 2416478, 2461857, 2406681, 2548055, 2444482, 2496337, 2468638, 2326287, 2447334, 2451381, 2182455, 2337496, 2250584, 2306335, 2262115, 2326743, 2265531, 2210522, 2264797, 2282044, 2532259, 2433998, 2600545, 2509748, 2480357, 2478565, 2446522, 2147062, 2042480, 2048457, 2159243, 2232929, 2223479, 2303546, 2308692, 2365547, 2292478, 2247025, 2232246, 2455764, 2349882, 2224610, 2421715, 2417996, 2391755, 2440439, 2353308, 2607536, 2612306, 2891278, 2820315, 2467762, 2508132]
1133B508132J43442j34089j85972J31852j59030J00675q5394M6937K65033l7825
1123B593761j0367j41131K3623M4594j3824l0477j0558m5248n6374k4864k56628
1112B072507o4704J52407J12439P5502m3499n9365K5278J77360R8842l57832j49416
1101B039519M3293N223K37622j52865J93093k80513O437L92904j59753j30993
1091B193967k9558J15195M5400j84613K76405J66355m62414k85850J92748L22431
1081B350066J44429k53708j90122K7414M6966J96286j43313Q8150M1127j67277
1071B140018K6702K32828k01434o5190J67962k9953j80397R8440L2979M4160R8763
1060B364878J09582Q0182q1005J74988j78799j30767j6300J3626l2540k6389j08217
$$ y = [2508132, 2651574, 2517485, 2331513, 2463365, 2304335, 2405010, 2319616, 2366553, 2631586, 2593761, 2583394, 2442263, 2465886, 2510480, 2496656, 2466179, 2455621, 2410373, 2353999, 2329135, 2072507, 2007803, 2160210, 2272649, 2348151, 2304652, 2245287, 2270565, 2447925, 2546767, 2188935, 2039519, 2082812, 2088035, 2325657, 2172792, 2365885, 2085372, 2091809, 2484713, 2324960, 2193967, 2164409, 2279604, 2325004, 2140391, 2416796, 2583151, 2120737, 1834887, 2027635, 2350066, 2494495, 2240787, 2050665, 2078079, 2125045, 2321331, 2178018, 2266168, 2307295, 2140018, 2166720, 2399548, 2198114, 2132924, 2300886, 2270933, 2090536, 2188976, 2221955, 2266115, 2364878, 2474460, 2554642, 2473637, 2648625, 2469826, 2339059, 2322759, 2336385, 2303845, 2277456, 2169239]
1049B169239R8543O6195o1205O2445j8788j48038J14641J26886N7813r0771k16457
1038B160503J48193j21812l10567j70249J01158L41083N1872j04579K45117m7200
1028B293519p7515J47920j88229j45149O8205K8533j46822J13250j57049J09489
1018B046152J35240K03027J40417k80162K42571k33527P1020j10295k6490M031
1008B191984Q3795m2599p9176J37855O8414j03129r2298R410K20009J33426o7200
997B460491J25886K36585j43270k67917l51160j79280K93140J39676J08571P7747
987B500469q4230l88820j7872K30218k40648J86864J87225j73892j58528J66641
977B207427k8584K9148j58623j1827K74290K21865M8561j04634l80915j08042
$$ y = [2169239, 2267782, 2333977, 2272772, 2335217, 2316429, 2168391, 2283032, 2409918, 2467731, 2376960, 2160503, 2308696, 2186884, 1876317, 1706068, 1807226, 2148309, 2200181, 2095602, 2340719, 2293519, 2216004, 2363924, 2175695, 2030546, 2098751, 2127284, 1980462, 2093712, 1936663, 2046152, 2181392, 2384419, 2524836, 2244674, 2487245, 2253718, 2324738, 2214443, 2187953, 2191984, 2275779, 2233180, 2154004, 2291859, 2360273, 2257144, 2164846, 2174256, 2394265, 2527691, 2460491, 2586377, 2822962, 2679692, 2411775, 2060615, 1881335, 2174475, 2314151, 2422722, 2500469, 2416239, 2027419, 2009547, 2239765, 1999117, 2185981, 2373206, 2199314, 2040786, 2207427, 2178843, 2207991, 2049368, 2037541, 2311831, 2533696, 2582257, 2477623, 2096708, 1988666]
967A988666Q2657J75605L0839j2248K55418j05178n4077q098J19192k4833J50979
956B598922j96068o2043j38575K55214o6892j3551j70598P1693k5853M3245K4122
945B319616Q5192J74718K6869j09788O8024l41245j16017L49253N1703m4043k37694
934B226588R1673j12943j73302J38311J41831k6642r3436j33508p954N1809j21355
923A981072J14721J05591l5331j31073j08163K8539k6410J13004J3609P0666M5148
912B171373n5440N1982o4402J67383K33687j8424k11050k70138Q6936R4530k20886
901A965551k2282n0532n8513J24276J37297J48850P1424j74515j77725j59636
891A804195J92726J47730J19036K40525l2419j27349n12930j2748J39100L38959
$$ y = [1988666, 2071323, 2246928, 2277767, 2265519, 2520937, 2415759, 2361682, 2353584, 2472776, 2447943, 2598922, 2402854, 2340811, 2202236, 2457450, 2390558, 2377007, 2206409, 2278102, 2252249, 2295494, 2319616, 2404808, 2579526, 2606395, 2496607, 2564631, 2223386, 2107369, 2456622, 2508325, 2464282, 2226588, 2318261, 2205318, 2032016, 2170327, 2312158, 2285516, 2192080, 2058572, 2050618, 2102427, 1981072, 2095793, 2201384, 2166053, 2034980, 1926817, 1955356, 1928946, 2041950, 2055559, 2126225, 2171373, 2115933, 2167915, 2103513, 2270896, 2504583, 2486159, 2275109, 2004971, 2091907, 2186437, 1965551, 1943269, 1892737, 1834224, 1958500, 2095797, 2244647, 2316071, 2141556, 1963831, 1804195, 1996921, 2144651, 2263687, 2504212, 2471793, 2344444, 1831514, 1818766, 1957866, 2296825]
881B296825j11153J40935J4132k57310j57364J85377J48399l82595J62778J81017
871B221041k51392K60786J83280P3080l43708j51307j66183L40886K27496k58619
861B135360o2418K48316j92132j1673k47156k80581L69006L42068j93250j21730
851A985810Q0865j7052j06703k67162J08493M1941K15139J20162K63898j23918
841B301473P0278j02949k47323k40433k24948K55090K10663M30K39518J04924
831B366723J63781l64981n3885J52576k3031J43577j85569J7325K18856k21042
821B214330l6380j51470j40186J38595K31027O3243Q281j72811j150P0034J17388
810B340901j83154Q7081J52744j85295l2793j09433J74653J78882r6126O8267
$$ y = [2296825, 2185672, 2326607, 2340739, 2083429, 1926065, 2111442, 2259841, 1877246, 2040024, 2221041, 1969649, 2230435, 2413715, 2486795, 2143087, 1991780, 1825597, 2166483, 2393979, 2135360, 2072942, 2321258, 2129126, 2117453, 1870297, 1589716, 1958722, 2300790, 2107540, 1985810, 2066675, 2049623, 1942920, 1675758, 1784251, 1826192, 2041331, 2161493, 2425391, 2301473, 2371751, 2268802, 2021479, 1781046, 1556098, 1811188, 2021851, 2022281, 2261799, 2366723, 2530504, 2165523, 2111638, 2264214, 2241183, 2384760, 2199191, 2216516, 2435372, 2214330, 2177950, 2026480, 1886294, 2024889, 2255916, 2319159, 2327440, 2154629, 2153479, 2223513, 2340901, 2157747, 2244828, 2397572, 2212277, 2179484, 2070051, 2244704, 2423586, 2327460, 2395727]
800B395727j61181L8219p0771j26434j44256l2106L10765l73170M7333K86513
790B170639L9999j75147R628J79032K14824k82210k21115r1023J99168K12976
780B256771N6220Q0921r815j65559l16598K31184j20465J65143j71605p7127J49521
769B078591k01729r4800p7368M3387K26125J06795l20021L47528k602K502o1384
758B047024O7406q419n9989J06834j98471P172R6489r5910j25758P5825j7756
747A894447r4531R6639J10118O2009j29348j53190J06869J69535k0911J94256
737B235893l14179j22169M07087k2458r2130n8479q4531j4684M8339J69838L25329
726B477856m4147l19140L5258k176l4474m5133q1012K65727j35960k23206J02230
$$ y = [2395727, 2234546, 2272765, 2201994, 2075560, 1931304, 1899198, 2209963, 1836793, 1884126, 2170639, 2210638, 2035491, 2045119, 2224151, 2438975, 2156765, 1935650, 1844627, 2043795, 2256771, 2312991, 2393912, 2384097, 2218538, 1901940, 2133124, 2012659, 2177802, 2006197, 1929070, 2078591, 1876862, 1782062, 1704694, 1748081, 1974206, 2081001, 1760980, 2108508, 2105906, 2108408, 2047024, 2114430, 2106011, 2046022, 2152856, 1954385, 1961557, 2058046, 1962136, 1836378, 1912203, 1894447, 1799916, 1896555, 2006673, 2068682, 1939334, 1786144, 1893013, 2062548, 2041637, 2235893, 1921714, 1799545, 2206632, 2184174, 2092044, 2033565, 1949034, 1934350, 1982689, 2152527, 2477856, 2433709, 2114569, 2149827, 2147651, 2113177, 2068044, 1987032, 2252759, 2116799, 1893593, 1995823]
715A995823J50029k16480J41917L05189J55409j71419p3719l26471k52943J0044
705A717379K30457J98030j47447n4735p9187l0842J70626r865l8531q2464P4661
694A948082K50540j41458O0302o4498P1297k48494M7747J38688k1888J13875j85847
683A968346k23189k6846j9958L8167J14557J75169P2896m6664N9J58507n9713
672B151331j31349j95062Q6671Q275L8584k786k59392J93297R5137j5312O6513
661B035907j19365j644J82971Q1562m5908l02884L13929L00868k23412j41265
651B080759J23597K7111l61397J8580K08267k60599K10749J0808k45159m6264
641A766452K09979J42084Q3837J00827N8125k06953j66288J64963n5928j38130
$$ y = [1995823, 2145852, 1929372, 2071289, 2376478, 2531887, 2360468, 2286749, 1960278, 1707335, 1717379, 1947836, 2145866, 1998419, 1943684, 1864497, 1833655, 2004281, 1994416, 1955885, 1873421, 1948082, 2198622, 2057164, 2117466, 2052968, 2124265, 1875771, 1923518, 2062206, 2040318, 2154193, 1968346, 1745157, 1718311, 1698353, 1736520, 1851077, 2026246, 2099142, 2052478, 2052537, 2211044, 2151331, 2019982, 1824920, 1911591, 1919866, 1958450, 1955664, 1696272, 1889569, 1984706, 1969394, 2035907, 1916542, 1914898, 2097869, 2179431, 2133523, 1830639, 2144568, 2445436, 2222024, 2080759, 2204356, 2231467, 1870070, 1888650, 2096917, 1836318, 2047067, 2057875, 1812716, 1766452, 1976431, 2118515, 2202352, 2303179, 2361304, 2154351, 1988063, 2153026, 2097098, 1958968]
631A958968j23843K17061q2932k64658K48809j48280L31874R7984j57064K36259
621B314178L3376j16053n17075o8566p4853O8711K60590p0665Q4568L15342j96035
610B033518j02717N2759J60719q8315j2358Q4948k44681j47985n4552J6711M1889
599A739936K43480j134J60485m17031O481K39697J49685k44105J87848J72476
589B237818m15539J81915L90756j45754m7034j66738m1555J37861k32410n3040
579A846280p2544K49668r8023J19339k69249J18590j96041j21327Q6377P5935
569A739005K34302J02088k3381r6598p6196j04055q0835K14481K11419l88922
559A731308J04151j6018q476j99739j3053Q8188M6445N8611o7751J27048j89211
$$ y = [1958968, 1835125, 2052186, 1969254, 1704596, 1953405, 1805125, 2136999, 2234983, 2077919, 2314178, 2347554, 2231501, 1714426, 1645860, 1571007, 1639718, 1900308, 1829643, 1914211, 2229553, 2033518, 1930801, 1983560, 2144279, 2055964, 2043606, 2128554, 1883873, 1735888, 1681336, 1698047, 1739936, 1983416, 1982282, 2142767, 1725736, 1732217, 1971914, 2121599, 1877494, 2065342, 2237818, 1822279, 2004194, 2394950, 2249196, 2202162, 2035424, 1993869, 2131730, 1899320, 1846280, 1773736, 2023404, 1925381, 2044720, 1775471, 1894061, 1698020, 1576693, 1663070, 1739005, 1973307, 2075395, 2052014, 1955416, 1879220, 1775165, 1694330, 1908811, 2120230, 1731308, 1835459, 1819441, 1810965, 1611226, 1598173, 1686361, 1732806, 1791417, 1723666, 1850714, 1661503]
548A661503K74765N2885o1716p9267j91504o0239L064o0967J6387K59989K22700
537B037600M196J74830k69963q0570p1586k66893J69227j6696m3400J06749J24659
526A868153J19799J60659j4231m918p8781k4688l5157j99464n7437J17302J55881
515B007118l86372K5729R5709J38634n6068J27125K56293k58295j09873l1807
505A808193o2411j02432J41457J03596M0010K7088J3995q6631L3922j78204J90802
494A929385J8516m1492J43308q42k00395K85040K5802L700l71581n5447k9821
483A706173N789J26309P2850J27780l60796K15321K09992j70119n8876M0286R7944
472B012653J41189j48776j27115J14919p4801q8672m2152k09104Q959M38332J05240
$$ y = [1661503, 1936268, 1989153, 1927437, 1848170, 1656666, 1596427, 1599491, 1538524, 1554911, 1814900, 2037600, 2041796, 2216626, 1946663, 1866093, 1794507, 1527614, 1696841, 1680145, 1636745, 1743494, 1868153, 1987952, 2148611, 2134380, 2129462, 2050681, 2025993, 1990836, 1791372, 1733935, 1851237, 2007118, 1620746, 1646475, 1742184, 1880818, 1824750, 1951875, 2208168, 1949873, 1840000, 1808193, 1745782, 1643350, 1784807, 1888403, 1928413, 1955501, 1969496, 1882865, 1916787, 1738583, 1929385, 1947901, 1906409, 2049717, 2048875, 1848480, 2133520, 2159322, 2163022, 1791441, 1735994, 1706173, 1711962, 1838271, 1911121, 2038901, 1678105, 1893426, 2103418, 1933299, 1874423, 1914709, 2012653, 2153842, 2005066, 1877951, 1992870, 1918069, 1829397, 1787245, 1578141, 1587100, 2025432, 2130672]
461B130672j88j58367N8663k41017m42992K81552K75775j12932r4914k4662J26821
450A798411J01467J06095l1962k3786j70743m2654n1640O9720J09263p9602M0417
439A824986l843j4160J61683K27469k75228O203j36633M257j3312J47198P6893
428B005513l1755k34361J30256o4708L1964J40999m0794m0601k63545J8937J58239
417A810144J69676R5220k54843J08049n3585o2747j0403l8217k31360J50935J38811
406A821680Q3485L4189m7865J76n2822p6599l688k48393L53566k41810l2834O2417
394A651502M0027R4555k25980J95832J35515j06226k54449N21623j20012j39239
384A793148J1972M9035j37571P4116k12891k6998K48123L2558m4188j41716J14562
$$ y = [2130672, 2130484, 1972117, 2030780, 1789763, 1346771, 1628323, 1904098, 1791166, 1696252, 1671590, 1798411, 1899878, 2005973, 1974011, 1950225, 1779482, 1736828, 1685188, 1754908, 1864171, 1784569, 1824986, 1821143, 1806983, 1968666, 2196135, 1920907, 1927110, 1790477, 1794734, 1781422, 1928620, 2005513, 1973758, 1739397, 1869653, 1804945, 1836909, 1977908, 1937114, 1896513, 1632968, 1651905, 1810144, 1979820, 2075040, 1820197, 1928246, 1874661, 1811914, 1801511, 1763294, 1531934, 1682869, 1821680, 1905165, 1939354, 1891489, 1891665, 1838843, 1762244, 1758556, 1510163, 1863729, 1621919, 1589085, 1651502, 1691529, 1786084, 1560104, 1755936, 1891451, 1785225, 1530776, 2052399, 1932387, 1793148, 1805120, 1854155, 1716584, 1790700, 1577809, 1550811, 1798934, 1831492, 1787304, 1645588, 1760150]
373A760150P588R0028J89335j39402k27073J20692K23183l01766j97148k00177
363A325410M34612k00766n2107L93383j92057j08339J31709k42072J00678N1618
353A642069J73167q0921M9026L21970j67376p5792l7397j34932M6758R4478m5739
342A785311J35514j452r5781l5614J42952N7038Q1343r1174l6154q3627N2349
331A910705K29048k15702P6054k210J39514L60191m55498j28283J3762k5930j09913
320A791738O5001J89893k7950m5334K9927j07571l2687q7763o9676J00510k85651
309A520437J51701J39470j01070J11754p1057j75294l04703O7899M42544j63397
299A618284J7775k0718j75663k10098J27393K84102j01517P8704J31347j68907
$$ y = [1760150, 1767738, 1857766, 2047101, 1907699, 1680626, 1801318, 2024501, 1722735, 1525587, 1325410, 1760022, 1559256, 1507149, 1900532, 1708475, 1600136, 1731845, 1489773, 1590451, 1642069, 1815236, 1734315, 1783341, 2105311, 1937935, 1862143, 1824746, 1689814, 1736572, 1831050, 1785311, 1920825, 1919373, 1823592, 1787978, 1930930, 1987968, 2069311, 1978137, 1941983, 1858356, 1910705, 2139753, 1924051, 2000105, 1997895, 2137409, 2497600, 2042102, 1913819, 1927581, 1901651, 1791738, 1856739, 2046632, 2018682, 1973348, 2003275, 1895704, 1863017, 1775254, 1705578, 1806088, 1520437, 1672138, 1811608, 1710538, 1822292, 1751235, 1575941, 1271238, 1339137, 1781681, 1618284, 1636059, 1615341, 1439678, 1229580, 1356973, 1641075, 1539558, 1618262, 1749609, 1580702]
289A580702N5447N892j14774K51387o1724K4206J32898j67684L7977J59317j92879
278A710765j41930J53823P4758J20744j32851k46786K47182J981K61571k73670
268A775587j24749j07282J56372l15753O7726L30712l06824k52303N38564m2581
258A719469K2793R1917J1050J22765k41559J89242n3023j62278N7848l2368o2456
247A663400Q1958J38602l2376l11558q7382J62036J43190J8671N4639K4034j01930
236A753284M7031m3983r2240L68N5009Q1501o3257J79477l13753j01018M4121
225A546540Q7295j02818N8215j41061K72006J40476m00486L3230J24600k05481
215A412516K3186K10713M2875j18542J14287K0133q9796Q3452k06485j69817J46518
$$ y = [1580702, 1636149, 1642041, 1527267, 1778654, 1716930, 1741136, 1874034, 1706350, 1744327, 1903644, 1710765, 1568835, 1722658, 1797416, 1918160, 1785309, 1538523, 1785705, 1787686, 2049257, 1775587, 1650838, 1543556, 1699928, 1384175, 1451901, 1782613, 1475789, 1223486, 1762050, 1719469, 1742262, 1834179, 1845229, 1967994, 1726435, 1915677, 1862654, 1700376, 1758224, 1725856, 1663400, 1745358, 1883960, 1851584, 1540026, 1452644, 1614680, 1757870, 1776541, 1831180, 1855214, 1753284, 1800315, 1756332, 1664092, 1664460, 1719469, 1800970, 1737713, 1917190, 1603437, 1502419, 1546540, 1633835, 1531017, 1589232, 1448171, 1720177, 1860653, 1460167, 1493397, 1617997, 1412516, 1435702, 1646415, 1689290, 1570748, 1685035, 1705168, 1615372, 1698824, 1492339, 1322522, 1469040]
204A469040j13505J58100J05873k66005P67J67064O0390J20288j94343J25063
194A632732j382k1996O8305J4451Q0419j77117k97626N9314M6173n5512J03081
183A450842N7813L3782j03876J67871j05225k73915J48634r6530j98248J02870
$$ y = [1469040, 1355535, 1513635, 1619508, 1353503, 1354270, 1521334, 1581724, 1702012, 1507669, 1632732, 1631350, 1609354, 1677659, 1692110, 1772529, 1595412, 1297786, 1357100, 1403273, 1347761, 1450842, 1508655, 1542437, 1438561, 1606432, 1501207, 1227292, 1375926, 1279396, 1081148, 1184018]
$$ [...]
##END NTUPLES=NMR SPECTRUM
##END=
