##TITLE=1H_DE-80H_X3
 200.13MHz, d2o
 8 sc
 
 19ns.26.2.2025
##JCAMPDX= 6.0         $$ Bruker NMR JCAMP-DX V2.0
##DATA TYPE= NMR SPECTRUM
##DATA CLASS= NTUPLES
##ORIGIN= UXNMR, Bruker Analytische Messtechnik GmbH
##OWNER= pz
$$ XWIN-NMR		Version 3.5
$$ Tue Dec  9 10:58:30 2025 Russian Standard Time (UT+4h)  Yarkov@DPX200
##.OBSERVE FREQUENCY= 200.1313
##.OBSERVE NUCLEUS= ^1H
##.ACQUISITION MODE= SIMULTANEOUS
##.ACQUISITION SCHEME= undefined
##.AVERAGES= 8
##.DIGITISER RES= 18
##SPECTROMETER/DATA SYSTEM= spect
##.PULSE SEQUENCE= zg30
##.SOLVENT NAME= CDCl3
##.SHIFT REFERENCE= (INTERNAL, CDCl3, 0, 15.4703)
##AUDIT TRAIL= $$ (NUMBER, WHEN, WHO, WHERE, WHAT)
$$ ##TITLE= Audit trail, XWIN-NMR		Version 3.5
$$ ##JCAMPDX= 5.01
$$ ##ORIGIN= Bruker BioSpin GmbH
$$ ##OWNER= Yarkov
$$ C:/Bruker/XWIN-NMR/data/yarkov2/nmr/H-C/1/pdata/1/auditp.txt
$$ ##AUDIT TRAIL=  $$ (NUMBER, WHEN, WHO, WHERE, WHAT)
(   1,<2025-12-09 10:57:44.07 +0400>,<Yarkov>,<DPX200>,
      <created by zg, POWCHK disabled, PULCHK disabled
       configuration hash MD5:
       00 E9 B6 7A A2 85 ED C7 34 08 36 98 17 FE 4E 26
       data hash MD5: 16K
       30 4F D4 63 27 BB A9 8B 2A 76 16 E0 E6 6D FB 58>)
(   2,<2025-12-09 10:57:49.62 +0400>,<Yarkov>,<DPX200>,
      <Start of raw data processing
       efp BC_mod = 2 LB = 0.25 FT_mod = 6 PKNL = 1 PHC0 = -5306.083 PHC1 = 17.82193 SI = 16K 
       data hash MD5: 16K
       13 EC C8 05 0C 9C 94 AB 4F B9 7D EF AC C2 3C D2>)
(   3,<2025-12-09 10:57:53.93 +0400>,<Yarkov>,<DPX200>,
      <abs ABSG = 5 
       data hash MD5: 16K
       0B 57 78 08 1B 49 50 63 39 D3 C9 57 B2 F0 F8 4D>)
$$ ##END=
$$ 
$$ hash MD5
$$ E4 20 98 2C 56 7F 24 EA E0 1A E5 8D 75 86 0B 9C
##$RELAX= 
##$RELAX= 
##$RELAX= 
##$RELAX= 
##$RELAX= 
##$RELAX= 
$$ Bruker specific parameters
$$ --------------------------
##$DU= <C:/Bruker/XWIN-NMR>
##$EXPNO= 1
##$NAME= <H-C>
##$PROCNO= 1
##$TYPE= <nmr>
##$USER= <yarkov2>
##$AMP= (0..31)
100 100 100 100 100 100 100 100 100 100 100 100 100 100 100 100 100 100 
100 100 100 100 100 100 100 100 100 100 100 100 100 100 
##$AQSEQ= 0
##$AQ_mod= 1
##$AUNM= <au_zg>
##$AUTOPOS= <>
##$BF1= 200.13
##$BF2= 200.13
##$BF3= 200.13
##$BF4= 200.13
##$BF5= 200.13
##$BF6= 200.13
##$BF7= 200.13
##$BF8= 200.13
##$BYTORDA= 1
##$CFDGTYP= 0
##$CFRGTYP= 5
##$CHEMSTR= <none>
##$CNST= (0..31)
1 1 145 1 1 1 1 1 1 1 1 1 1 1 1 1 1 1 1 1 1 1 1 1 1 1 1 1 1 1 1 1 
##$CPDPRG= <>
##$CPDPRG1= <>
##$CPDPRG2= <>
##$CPDPRG3= <>
##$CPDPRG4= <mlev>
##$CPDPRG5= <mlev>
##$CPDPRG6= <mlev>
##$CPDPRG7= <mlev>
##$CPDPRG8= <mlev>
##$CPDPRGB= <>
##$CPDPRGT= <>
##$D= (0..31)
0 0.7 0 0 0 0 0 0 0 0 0 0.03 0 0 0 0 0 0 0 0 0 0 0 0 0 0 0 0 0 0 0 0 
##$DATE= 1765263463
##$DBL= (0..7)
120 120 120 120 120 120 120 120 
##$DBP= (0..7)
150 150 150 150 150 150 150 150 
##$DBP07= 0
##$DBPNAM0= <>
##$DBPNAM1= <>
##$DBPNAM2= <>
##$DBPNAM3= <>
##$DBPNAM4= <>
##$DBPNAM5= <>
##$DBPNAM6= <>
##$DBPNAM7= <>
##$DBPOAL= (0..7)
0.5 0.5 0.5 0.5 0.5 0.5 0.5 0.5 
##$DBPOFFS= (0..7)
0 0 0 0 0 0 0 0 
##$DE= 6
$$ [...]
##$SUBNAM3= <"">
##$SUBNAM4= <"">
##$SUBNAM5= <"">
##$SUBNAM6= <"">
##$SUBNAM7= <"">
##$SUBNAM8= <"">
##$SUBNAM9= <"">
##$SW= 18.0517328524113
##$SWIBOX= (0..15)
0 0 2 0 0 0 0 0 0 0 0 0 0 0 0 0 
##$SW_h= 3612.71676300578
##$TD= 16384
##$TD0= 1
##$TE= 0
##$TE2= 300
##$TE3= 300
##$TEG= 300
##$TL= (0..7)
0 120 120 120 120 120 120 120 
##$TP= (0..7)
150 150 150 150 150 150 150 150 
##$TP07= 0
##$TPNAME0= <>
##$TPNAME1= <>
##$TPNAME2= <>
##$TPNAME3= <>
##$TPNAME4= <>
##$TPNAME5= <>
##$TPNAME6= <>
##$TPNAME7= <>
##$TPOAL= (0..7)
0.5 0.5 0.5 0.5 0.5 0.5 0.5 0.5 
##$TPOFFS= (0..7)
0 0 0 0 0 0 0 0 
##$TUNHIN= 0
##$TUNHOUT= 0
##$TUNXOUT= 0
##$USERA1= <user>
##$USERA2= <user>
##$USERA3= <user>
##$USERA4= <user>
##$USERA5= <user>
##$V9= 5
##$VALIST= <valist>
##$VCLIST= <CCCCCCCCCCCCCCC>
##$VD= 0
##$VDLIST= <DDDDDDDDDDDDDDD>
##$VPLIST= <PPPPPPPPPPPPPPP>
##$VTLIST= <TTTTTTTTTTTTTTT>
##$WBST= 1024
##$WBSW= 4
##$XGAIN= (0..3)
0 0 0 0 
##$XL= 0
##$YL= 0
##$YMAX_a= 775168
##$YMIN_a= -689423
##$ZGOPTNS= <>
##$ZL1= 120
##$ZL2= 120
##$ZL3= 120
##$ZL4= 120
##$ABSF1= 15.49017
##$ABSF2= -2.56168
##$ABSG= 5
##$ABSL= 3
##$ALPHA= 0
##$AQORDER= 0
##$ASSFAC= 0
##$ASSFACI= 0
##$ASSFACX= 0
##$ASSWID= 0
##$AUNMP= <proc_1d>
##$AZFE= 0.1
##$AZFW= 0.1
##$BCFW= 0
##$BC_mod= 2
##$BYTORDP= 0
##$COROFFS= 0
##$CY= -3
##$DATMOD= 1
##$DC= 0
##$DFILT= <>
##$DTYPP= 0
##$F1P= 0
##$F2P= 0
##$FCOR= 1
##$FTSIZE= 16384
##$FT_mod= 6
##$GAMMA= 0
##$GB= 0
##$INTBC= 1
##$INTSCL= 3.241238e-09
##$ISEN= 128
##$LB= 0.25
##$LEV0= 0
##$LPBIN= 0
##$MAXI= 10000
##$MC2= 0
##$MEAN= 0
##$ME_mod= 0
##$MI= 1.114404
##$NCOEF= 0
##$NC_proc= -5
##$NLEV= 6
##$NOISF1= 3.799351
##$NOISF2= 2.8
##$NSP= 0
##$NTH_PI= 0
##$NZP= 0
##$OFFSET= 15.47034
##$PC= 1
##$PHC0= -5306.083
##$PHC1= 17.82193
##$PH_mod= 1
##$PKNL= yes
##$PPARMOD= 0
##$PSCAL= 0
##$PSIGN= 0
##$REVERSE= no
##$SF= 200.130010278936
##$SI= 16384
##$SIGF1= 3
##$SIGF2= 2
##$SINO= 0.751879
##$SIOLD= 32768
##$SREGLST= <19F.Aceton>
##$SSB= 0
##$STSI= 16384
##$STSR= 0
##$SW_p= 3612.71676300578
##$SYMM= 0
##$S_DEV= 0
##$TDeff= 16384
##$TDoff= 0
##$TI= <>
##$TILT= no
##$TM1= 0
##$TM2= 0
##$TOPLEV= 0
##$USERP1= <user>
##$USERP2= <user>
##$USERP3= <user>
##$USERP4= <user>
##$USERP5= <user>
##$WDW= 1
##$XDIM= 16384
##$YMAX_p= 349853001
##$YMIN_p= -232833
$$ End of Bruker specific parameters
$$ ---------------------------------
##NTUPLES= NMR SPECTRUM
##VAR_NAME=  FREQUENCY,     SPECTRUM/REAL,   SPECTRUM/IMAG
##SYMBOL=    X,             R,               I
##VAR_TYPE=  INDEPENDENT,   DEPENDENT,       DEPENDENT
##VAR_FORM=  AFFN,          ASDF,            ASDF
##VAR_DIM=   16384,         16384,           16384
##UNITS=     HZ,            ARBITRARY UNITS, ARBITRARY UNITS
##FACTOR=    0.220516191357247, 1,           1
##FIRST=     3096.07925820648, 0,            0
##LAST=      -516.637504799297, 0,           0
##MIN=       -516.637504799297, -232833,     0
##MAX=       3096.07925820648, 349853001,    0
$$ Real data points
##PAGE= N=1
##DATA TABLE= (X++(R..R)), XYDATA
$$ [...]
8158 -80787 -94636 -69322 -92639 -85187 -31873 -53225 -80886 -91799 -69661 -66315 -75620 -62110
8146 -62110 -58806 -68831 -35366 -31928 6733 2708 -6064 -38073 -45780 -12573 -49253 -39184 -8368
8133 -8368 4089 15649 6567 -10110 -23419 -49740 -61967 -59847 -49219 -51673 -54915 -61107 -33664
8120 -33664 -51902 -58422 -33178 -23158 -36427 -36087 -58514 -64150 -39348 -47168 -59971 -62465 -8684
8107 -8684 13292 4043 -48018 -54568 -64644 -53444 -30507 -15851 -18419 -2505 -7811 -41497 -75598
8094 -75598 -50526 -26131 -37517 -45665 -24839 -30668 -58833 -65753 -21473 -34719 -58318 -51140 -41513
8081 -41513 -31144 -39827 -38989 -79326 -72634 -60060 -31295 -59392 -59765 -62940 -37230 -37758 -42272 -49070
8067 -49070 -39885 -34980 -55614 -26432 -22198 -1966 -37537 -60082 -41560 -39043 -34696 -31582 -33400
8054 -33400 -27087 -59153 -48786 -25403 -9430 -51739 -92200 -74305 -50310 -60083 -81362 -66128
8042 -66128 -37760 -41386 -40520 -44370 -33220 -3994 -26931 -35051 -49051 -44813 5861 -1471 -22732
8029 -22732 -21576 -25422 385 -26669 -20626 -21967 21013 22288 -4853 -4767 -2102 4190 -23740 -17209
8015 -17209 -16156 -15539 -22095 -42567 -29556 -4063 22044 19736 5475 22028 22319 10744 -11190
8002 -11190 -20545 -10433 -29234 9396 18748 -6190 -4429 12076 6707 2275 -8218 -41803 -39583
7989 -39583 -49297 -70729 -24418 23023 -7499 -12201 9611 38464 12681 -16680 -36162 -18060
7977 -18060 -887 -14096 -71052 -57691 -19682 -4548 5399 -15438 -34483 -21706 -25656 -29467
7965 -29467 -6291 15261 21105 8847 768 3692 25901 22982 -9581 28850 13472 -29989 -5174
7952 -5174 -5990 -3308 -3990 15766 -19567 -47825 -51675 -44313 -30155 -30285 -13302 -19933 -31131 -16744
7938 -16744 -15470 21571 -14483 -25008 -15074 -19947 -9416 -9924 12951 -8813 -10632 -27032 -21285
7925 -21285 27524 29793 50676 12817 7535 13974 33071 -9526 -26685 9106 32460 19152
7913 19152 22494 -17270 -20086 -25097 -25781 -29508 -23652 -19207 -25080 -8643 -28688 -21917 -31488 -31508 -8366
7898 -8366 13655 2909 -11545 -32434 -35361 -29503 -43516 -30574 3337 -1902 -3579 3455 5413
7885 5413 -4751 -17415 -12660 -16078 -45085 1329 -16299 27215 13323 -6431 18374 6258
7873 6258 -36396 -12839 -17138 -27339 -47998 -57548 -58935 -56746 -19646 12926 20861 -27673 -59561
7860 -59561 -54337 -57690 -48874 4527 33453 33917 8787 -4044 -7011 4449 29416 12422 -11575
7847 -11575 -11692 -27503 -28945 -549 13427 14212 -13418 -25899 -52127 -21705 -14820 -34244 -36275
7834 -36275 -16777 -40012 -41183 -30324 -38041 -26647 -17391 16997 -30608 -34418 22374 22367 13008 -13612
7820 -13612 -21217 -2034 -9074 -8127 -10312 8334 -6070 -7481 -2934 23607 5710 -43574 -232833
7807 -232833 -151419 -42226 -48812 -12701 -15662 -38209 -59078 -39691 -29233 9522 -24367 -36643
7795 -36643 2640 3600 -72790 -13837 -18625 -36366 14404 6933 -11364 -24462 -5855 -28060 20955
7782 20955 54609 29028 14229 19655 29344 36183 5406 -15320 -7084 27424 28665 -3667 -30185
7769 -30185 -26884 16348 12601 23050 37036 14210 -36542 -49007 -54523 -3402 18502 31372
7757 31372 -3367 7516 1084 -5102 14307 44389 83504 44018 38683 27032 10501 25938
7745 25938 87735 89885 52892 21767 31677 58180 49117 59677 57987 25841 48494 40331 -6559
7732 -6559 -31664 -20291 -18937 10185 4438 -14220 14004 31042 22436 24904 29521 18242 18905
7719 18905 -9095 -23417 17827 3803 3610 -20392 -16923 20895 37336 20925 15035 18852 23692
7706 23692 13641 16917 -2971 31385 53323 50447 75643 49691 37202 51299 85949 74931
7694 74931 88546 122130 133680 143974 167479 143290 158843 141273 134607 141635 183550 226893
7682 226893 240529 233660 217858 246981 315621 350449 383542 374672 338416 286040 296804 346565
7670 346565 336377 315400 332981 361265 328712 315873 293673 285818 265270 290907 306753 313294
7658 313294 313536 298136 295134 290113 286322 269644 226546 205467 230653 216561 200718 207178 202062
7645 202062 181509 159813 122464 116850 115116 90702 93268 108046 101365 98763 88729 95709 91394
7632 91394 77042 90728 80820 58457 56349 46046 89016 110755 87802 104938 63165 81463
7620 81463 79761 85593 93762 78765 48658 16219 34693 43561 78436 108603 81416 106636 125092
7607 125092 99742 102036 92081 80292 90699 118561 145632 156767 158122 187082 187313 188071 203136
7594 203136 200514 228184 263052 252896 251552 232557 262595 258479 266365 264462 242829 245830 240563
7581 240563 241806 231540 224991 256559 271093 273027 232920 211188 248512 233841 226877 269923
7569 269923 227640 206058 207806 186878 175685 182468 169994 148391 100721 122118 109809 58131
7557 58131 75182 72510 56062 67113 67805 53992 71869 105290 92745 88952 63583 40543 45627
7544 45627 83906 86814 31855 42293 21526 25588 41029 54484 51578 74620 83496 87023 56569
7531 56569 29378 43074 57981 88758 109407 82334 63359 82532 100503 59079 34387 26655
7519 26655 54240 47949 41989 73030 90358 98805 104629 107279 162295 230427 318562 426141 535113
7506 535113 572285 546508 504441 397941 295005 224991 161096 150867 131562 110011 82038
7495 82038 112730 117790 60085 43323 60323 68448 95885 85111 56874 63793 81043 45109
7483 45109 49314 84360 46236 59523 72522 48613 49924 60807 45768 50609 42534 22726 61022
7470 61022 45320 57107 79807 61331 62623 49916 62554 79200 70762 90131 84321 68511
7458 68511 69044 54197 60842 73157 75935 80781 58687 51303 65781 58443 59969 49128 73577
7445 73577 86320 74224 77167 60610 61719 68980 85370 65920 60934 70503 44862 62388 54325
7432 54325 44429 46882 63619 66264 66854 53335 66813 58311 69388 94380 113565 118044 99523
7419 99523 110064 130719 146145 140316 106014 94678 95282 85937 121530 150053 166087 168283 150606
7406 150606 162991 185970 177330 169245 199584 229167 235442 217626 252387 257638 286783 302173
7394 302173 349018 398664 449713 498333 545808 581351 605181 599270 573251 591892 582904 571112
7382 571112 571407 526007 484924 464959 450252 411277 362469 343865 262836 247217 238622 242241
7370 242241 293197 273760 244913 240623 257005 256286 250184 262629 268794 245123 252415 235308 243383
7357 243383 261694 244028 254873 300993 290884 330630 373939 388494 373808 403180 451841 427500
7345 427500 416859 452922 485422 504402 500903 515937 534100 586360 594900 583796 605260 589435
7333 589435 562149 531092 509052 550796 536340 538039 533820 509536 476332 432836 440682 384835
7321 384835 370243 343109 313921 282711 257606 255289 254744 247190 275216 275404 277091 249942 262217
7308 262217 249139 240158 243690 249897 242865 234464 267351 252119 239695 277910 259403 260344 269609
7295 269609 264694 239826 280195 255129 245792 235046 215724 196798 200946 228983 253690 276684
7283 276684 232871 228132 231843 245790 241560 228083 226600 208999 215304 210099 239728 240881 208809
7270 208809 210168 210636 156524 133905 129459 153003 112209 99613 115690 165194 160496 135093 135007
7257 135007 164058 165807 191585 208780 198371 208795 256902 252121 242052 227982 218243 256377
7245 256377 273118 276879 252241 268491 263335 273909 273121 218543 210591 250495 251022 241997 244790
7232 244790 254742 266448 271557 249964 249939 251936 256763 251480 283802 284798 301500 315152 323246 333484
7218 333484 355188 367490 327827 350711 344487 326910 346125 332528 317908 314345 320348 289184
7206 289184 299857 327854 355643 370337 387919 426527 437704 486638 505378 456105 430681 474628
7194 474628 495477 508152 532613 517490 557699 555767 564216 600933 664864 658730 658189 693080 695501
7181 695501 652972 661220 625470 640707 645321 644826 661621 667556 659474 666738 673220 696383 657983
7168 657983 644749 670632 702098 720229 742148 741124 791191 796464 806094 870104 914425 940840
7156 940840 980308 1011225 1035867 1054941 1105303 1104966 1170790 1221434 1287813 1339125 1444814 1503002
7144 1503002 1577421 1655316 1747173 1839236 1992896 2103331 2214077 2306884 2393249 2423834 2507966
7133 2507966 2532410 2595113 2689149 2826831 2919088 3093373 3304521 3588931 3829248 4118848
7123 4118848 4420284 4856421 5187348 5635558 6180941 6972760 7901692 9092022 10553233
7114 10553233 12328091 14404690 17157280 21144074 27955597 40570822 64315075 92751737
7106 92751737 105071206 102986563 89603200 68124919 48272734 34384032 25804543
7099 25804543 20122559 15981323 13072777 11087582 9716815 8773420 8021605 7401709 6825613
7090 6825613 6253938 5713063 5350539 5022113 4757551 4493994 4277876 4089335 3871116 3642366
7080 3642366 3503169 3308412 3181264 2991313 2800651 2628771 2545459 2378197 2321016 2253483
7070 2253483 2214300 2188489 2169253 2106899 2064728 2008208 1932660 1893675 1895394 1786025 1754810
7059 1754810 1692815 1653846 1586033 1518555 1420352 1411431 1389055 1374124 1372717 1355056 1318406 1327165
7047 1327165 1305907 1282314 1267770 1253147 1203081 1174479 1124277 1076533 1039375 970813 872345
7036 872345 862628 873117 871716 877510 877484 776557 724551 672334 637869 648523 678676 674425 684760
7023 684760 678808 662021 622063 608242 605089 609543 615275 620593 606337 603198 599659 580037 537600
7010 537600 584488 602495 590900 598102 602492 566553 557331 560731 559865 529921 502262 497706 491403
6997 491403 496920 489112 505413 532054 511180 487271 482258 483639 457563 457158 469155 488991 482032
6984 482032 475603 457832 423805 395626 360308 374198 384217 374775 374193 393315 391029 390689 350411
6971 350411 332800 343769 349480 357738 368811 355053 366976 364656 327882 332244 367745 344815
6959 344815 349374 352708 363423 363756 364965 332703 361675 357811 374059 383172 389089 356123 346680
6946 346680 348193 368952 354134 356119 358609 332815 312304 303483 270399 268801 259013 264074 302214
6933 302214 342434 309915 262147 261945 274485 254652 262753 222610 247570 267424 278005 295306
6921 295306 277500 277680 236016 215503 210940 243047 199592 177950 217141 222227 229642 220532 231276
6908 231276 217058 197993 214765 216947 198938 226275 227336 219718 202186 165537 148092 147373 147735
6895 147735 149783 157387 177562 198058 204194 208060 187658 192386 217527 207279 214836 224913 217834
6882 217834 226754 217784 201247 203598 200500 163372 192352 174492 181420 169808 166166 185923 175288
6869 175288 173731 177419 157324 158421 156086 181479 176404 164229 147434 136280 180248 162822 151941
6856 151941 136001 138173 160271 162583 167077 211959 243804 191651 167069 150442 179125 190914
6844 190914 186927 174047 217448 207666 223853 238592 198358 224807 217745 210740 224321 182265
6832 182265 176184 176733 200910 215030 203025 177842 149278 178170 168643 142230 134457 162937 164117
6819 164117 192514 187192 180770 190618 202651 203361 198089 235870 235167 191783 206739 190986 152916
6806 152916 149409 138019 155532 175315 175060 159350 112262 137734 169045 185817 240858 228595
6794 228595 185251 178111 201316 219406 203200 186810 200034 190115 178062 148432 158152 186259
6782 186259 171762 179790 191187 153027 133111 166482 148553 162364 140051 167365 184411 168763
6770 168763 198349 184874 157567 160728 181300 147660 141655 151579 138768 128035 134344 127932 140215
6757 140215 169536 152508 131653 135341 184932 214841 211804 211346 157776 138611 118322 127811 176743
6744 176743 188041 203962 203207 149303 129686 153675 170889 176710 206288 207533 214075 146596 144356
6731 144356 164601 146091 156853 209701 212278 213004 197085 172002 166503 184328 156371 171036
6719 171036 154114 151578 173387 181726 213480 228980 261635 250554 221749 196663 213506 230152
6707 230152 259247 262173 258498 324763 443597 614236 733654 728831 699637 577289 465668
6696 465668 354704 332687 284400 261373 286511 298912 296339 243564 231045 264829 237802 245477
6684 245477 242631 212236 204317 205336 208505 213240 242522 215094 199711 247787 231967 217729 198241
6671 198241 198853 212117 205697 194561 188471 191767 194701 173539 224139 209744 233000 264870 243402
6658 243402 232318 232108 211214 175811 165289 158043 166526 206900 233472 228706 220185 200639 182455
6645 182455 195199 176403 158717 185936 186740 170480 177376 190464 184357 195981 185840 191483 202949
6632 202949 209867 209488 177841 146519 178019 222085 227804 189092 213692 187176 198649 192695 178777
6619 178777 175160 164429 164640 173689 198707 215974 220465 239066 226518 230999 237694 200844 215854
6606 215854 205610 222862 198445 214441 211543 183946 187943 199003 236863 206139 184521 174561
6594 174561 144394 173128 163571 179532 194950 196989 167421 179535 192205 136234 158719 198945
6582 198945 208801 194853 212075 171978 192475 202625 209219 214225 194605 209301 191279 213017
6570 213017 273574 270750 257637 225085 219797 214945 201579 218527 238007 262919 264757 292850
6558 292850 279352 216328 234967 252770 242317 252348 246005 255752 280962 251052 282409 282280
6546 282280 283330 283861 314341 296956 290191 285653 302170 296858 278390 270097 267823 244492 216942
6533 216942 206275 222948 258735 234929 232906 226076 228469 203681 195952 208159 228709 240773
6521 240773 249915 243260 244166 230486 193189 200328 201931 201464 179592 210623 216364 230336 268848
6508 268848 294985 305443 286632 302327 326487 314666 323440 368474 320529 323910 327602 329742
6496 329742 319359 306887 274526 304966 322719 263017 216387 248076 233341 260300 254477 267586
6484 267586 245714 225184 259002 257816 237155 268192 271361 251812 255146 262602 253744 251963 262259
6471 262259 220397 185223 185415 185072 196573 229597 239091 243252 240673 214004 211076 232070 240651
6458 240651 245118 247415 245853 262320 253057 222358 222967 254884 244375 217806 218376 214203 221594 235317
6444 235317 210386 227269 279879 229418 161303 213350 252062 215873 236910 276602 272741 244855
6432 244855 245438 238772 242695 243152 245409 248632 284212 325722 291390 289529 271475 284050 304523
6419 304523 271762 314416 298973 268812 234637 261521 249430 231020 218842 218598 238432 246782
6407 246782 270324 275618 270929 272402 291790 270293 248440 256713 278747 332725 345411 361754
6395 361754 386633 423259 448009 517569 548381 605236 662278 748115 781461 806900 785917 747191
6383 747191 722443 647429 592047 543480 565741 559320 509881 502235 505138 480508 474614 467789 446514
6370 446514 463154 469721 464959 485427 455692 480410 513689 582974 605201 618889 696461 802032
6358 802032 923484 1075163 1170585 1226916 1239694 1145788 1036176 903367 807312 700645 629956
6347 629956 575291 524820 497368 449615 439209 425382 444661 423872 411205 402053 398409 373665
6335 373665 353803 313733 278917 288036 284311 291018 316668 303471 335782 322364 290308 290158 267404
6322 267404 246615 276314 314065 276926 251463 261633 270317 265749 282479 276078 264393 276199
6310 276199 307944 304404 293544 290818 306569 302731 260844 258730 262925 230733 246455 274028 267356
6297 267356 266715 257491 265198 272532 236654 246082 262797 233840 233388 236033 249893 246309 221883 213686
6283 213686 238987 228512 242243 261370 231281 235230 236972 289479 276600 244364 248777 218048
6271 218048 221353 239054 279323 288514 296255 297780 301440 303147 267083 271373 254177 294532 343075
6258 343075 333141 327438 321246 306361 308110 299595 330039 304107 270035 307389 313195 286991 288174
6245 288174 326974 316434 291193 340205 332801 332419 343362 333854 313383 310395 299073 309229 293562
6232 293562 320851 319191 308002 324662 306343 318075 350486 370267 366834 417802 386198 374094
6220 374094 364846 377663 375321 401858 429204 421843 377619 404358 425889 432997 454973 455107 441213
6207 441213 426495 441373 460457 453441 462820 436075 440624 448136 484692 526394 516773 513549 563850
6194 563850 595256 557882 593474 617600 626024 637887 659887 646799 626734 645262 690630 711563
6182 711563 743891 743284 743616 800734 839795 828150 844919 814709 769001 781039 765062 721278
6170 721278 711968 698030 747531 774222 800693 793136 779573 795998 799791 792426 770387 805899
6158 805899 794867 779099 807607 814484 786988 775223 755382 725761 710256 698014 684608 733292
6146 733292 728776 680488 700164 702392 706526 725695 733037 737548 719710 761803 752976 789614 809096
6133 809096 819774 851191 855981 896546 943343 984262 1033346 1145010 1239791 1250259 1211918 1152080
6121 1152080 1057875 982499 960570 931592 867615 857174 868325 838408 834584 856058 817524 796997
6109 796997 793509 755167 779089 787433 782316 767967 767275 766136 753496 762096 722468 723626 716902
6096 716902 714615 716753 688225 697132 711883 724641 749119 751227 756192 726125 723100 723323 716319
6083 716319 671272 683126 733381 751800 750796 784179 794516 781219 787913 778094 782249 819040
6071 819040 781390 771831 811176 834064 811966 813179 842080 845430 856713 852375 874041 873690 890433
6058 890433 865167 873078 896050 873798 869139 883404 882826 899400 969335 993999 988049 1027061 1045763
6045 1045763 1083937 1126950 1150430 1176419 1231967 1284017 1318908 1346292 1443094 1490506 1587956
6034 1587956 1661675 1707930 1773193 1788905 1810271 1835165 1816311 1788535 1752282 1685341 1677617 1676419
6022 1676419 1708209 1710178 1721483 1769815 1760015 1767064 1803153 1868595 1903725 1955507 2006076 2008180
6010 2008180 2044237 2109712 2169562 2212696 2235338 2266609 2305611 2342697 2373542 2384579 2414866
5999 2414866 2423855 2410281 2419263 2453749 2431684 2418026 2443481 2443506 2476760 2501755 2552256 2586106
5987 2586106 2638643 2748587 2791834 2893637 2936431 3015781 3113104 3225956 3342043 3459931
5977 3459931 3546163 3640357 3677387 3723463 3741830 3679644 3676520 3659812 3574426 3529181 3475255 3450276
5965 3450276 3487984 3475935 3480510 3544124 3624082 3722684 3828476 3907384 4002806 4131608 4304195
5954 4304195 4516847 4759883 5047493 5369902 5734117 6174058 6675211 7259584 7920558 8636982
5944 8636982 9382778 10143772 10827294 11322215 11589604 11599655 11389300 11018481 10559669 10083481
5934 10083481 9658049 9293801 8933658 8681958 8463963 8268165 8095655 8019478 7972749 7928714
5924 7928714 7912614 7948325 8000911 8103327 8217552 8366874 8466579 8597676 8733831 8863127
5914 8863127 8986362 9154074 9367066 9597642 9880869 10190046 10561733 11004438 11481525 11960407
5904 11960407 12493181 13104758 13763558 14508564 15272594 16010195 16705753 17308922 17656670
5895 17656670 17752093 17641509 17263721 16702310 16043854 15296395 14561306 13871307 13202634 12653795
5885 12653795 12207851 11883087 11608341 11404757 11254959 11212454 11244673 11276304 11375766 11548903
5875 11548903 11791492 12128721 12505849 12926079 13431334 14058261 14796872 15658528 16548051
5866 16548051 17484693 18477124 19555171 20627396 21616514 22493527 23244652 23818854 24195193
5857 24195193 24420815 24490490 24399729 24213333 23913244 23546384 23158018 22685515 22187182 21679258
5847 21679258 21136514 20622799 20141687 19664909 19260731 18918137 18579656 18311809 18142676
5838 18142676 18082604 18063082 18152549 18351403 18640281 19044454 19579201 20227790 21060779 21960445
5828 21960445 23026800 24244303 25518775 26861130 28204009 29562952 30933615 32194301
5820 32194301 33407327 34574958 35604243 36559049 37334988 37952004 38356824 38491473 38312244
5811 38312244 37830714 37075083 36107662 34934302 33661529 32325059 30948190 29635118 28414442
5802 28414442 27256145 26211975 25359650 24588322 23944212 23473588 23113838 22894689 22690322
5793 22690322 22570416 22437569 22247466 22034993 21729664 21424891 21032685 20631736 20326529
5784 20326529 20084077 19898011 19784812 19845590 20020086 20246797 20541933 20910897 21361356 21892649
5774 21892649 22404247 22855086 23180031 23241339 22966520 22403795 21500338 20412697 19193029
5765 19193029 17939258 16711014 15538441 14514838 13572922 12727996 12008494 11419295 10875818
5756 10875818 10392037 9935204 9530680 9180595 8885817 8621938 8383179 8169319 7984937
5747 7984937 7838838 7694352 7547486 7454253 7369702 7314271 7284373 7238831 7177059 7134251 7085906
5736 7085906 7018069 6909662 6797912 6622435 6394759 6190536 5969012 5737163 5537364 5398649
5726 5398649 5234969 5057692 4929426 4807072 4704719 4625183 4517785 4442643 4362832 4320687
5716 4320687 4260073 4199040 4158810 4147957 4122611 4103868 4060633 4052277 4042398 3994184 3975160 3963846
5704 3963846 3965377 3926477 3897313 3919169 3910712 3870936 3866567 3855528 3833643 3851983 3879474 3880288
5692 3880288 3872562 3909606 3898999 3907535 3904301 3947662 3966712 3977389 4007252 4013744 3973033 4006379
5680 4006379 4050002 4014996 4026039 4018975 3988827 3966287 3957691 3926758 3920133 3951700 3990327 4001857
5668 4001857 4063166 4110158 4168408 4221011 4232576 4303098 4393192 4460331 4537479 4593083 4693670
5657 4693670 4805252 4969012 5126742 5283796 5480687 5717381 5961393 6276897 6669419 7100620
5647 7100620 7634335 8298369 9192953 10248260 11238446 12076451 12726069 13229680 13712980
5638 13712980 14235765 14747331 15288451 15715812 15978598 16058880 15942349 15672218 15242527 14680597
5628 14680597 14085098 13474286 12846549 12228742 11653126 11136989 10684042 10307507 10023883
5619 10023883 9840562 9718571 9706229 9843057 10234421 10893174 12004610 13567025 14829843
5610 14829843 15181030 14800801 13941800 12915692 12124047 11688696 11573997 11642416 11877702
5601 11877702 12261414 12858727 13620808 14572856 15629886 16870398 18306122 19832729 21408859
5592 21408859 23121494 24945648 26824152 28894548 31020330 33074093 34941135 36473843
5584 36473843 37727109 38881993 40234582 41975069 44071007 45654369 46301783 46215807 45451498
5575 45451498 44371210 43257262 42134683 40864964 39426210 37717923 35847340 33854188
5567 33854188 31807261 29746462 27703186 25725859 23860148 22111377 20559133 19134402
5559 19134402 17832868 16704754 15707999 14863843 14145488 13497444 13011132 12635084 12415035
5550 12415035 12360097 12501542 12703801 12758645 12568795 12158528 11660882 11225796 10898322 10679643
5540 10679643 10564095 10523346 10573345 10711326 10995210 11299415 11669149 12119982 12631253 13277176
5530 13277176 14017915 14896970 15875015 16959061 18188213 19529772 20967405 22481729 24045601
5521 24045601 25586994 27057329 28436650 29642106 30533240 31112792 31300914 31074607 30469823
5512 30469823 29540317 28357559 26953844 25449711 23878688 22312175 20721135 19216645
5504 19216645 17815369 16459355 15250508 14154947 13121903 12243907 11462221 10749938 10086627
5495 10086627 9553752 9120890 8700166 8290541 7915526 7604248 7306985 7029699 6813904
5486 6813904 6629566 6443544 6286756 6156229 6027132 5923489 5816584 5728019 5709618 5698883
5476 5698883 5692419 5670872 5696649 5777585 5873503 5997923 6178107 6355060 6593057 6920043 7291568
5465 7291568 7734681 8230370 8782557 9350080 9905945 10488121 11138933 11718757 12212801 12596827
5455 12596827 12828749 12918410 12791537 12541530 12073099 11517734 10915444 10279581 9606569 9013239
5445 9013239 8415656 7811644 7271501 6776472 6306210 5917721 5496445 5144685 4881430 4620356
5435 4620356 4435185 4228206 4030385 3862935 3744124 3594980 3494446 3388771 3316262 3204516
5425 3204516 3136919 3058664 2966796 2887549 2839183 2782909 2696405 2658770 2582424 2559862 2507327
5414 2507327 2441162 2393377 2354395 2313447 2267936 2249027 2201939 2177260 2156283 2118953 2088781
5403 2088781 2048609 2066601 2041026 1994308 1997460 1973536 1960606 1974311 1971550 1924118 1883031 1925910
5391 1925910 1927730 1944550 1938199 1918916 1923012 1936421 1922080 1898031 1909593 1936665 1972523 2027643
5379 2027643 2022523 2017578 2039639 2062502 2075283 2073488 2074083 2107770 2134448 2196781 2277399 2356101
5367 2356101 2392419 2467894 2547896 2672160 2788573 2890401 3065895 3284836 3547599 3943077
5357 3943077 4420273 4956132 5584564 6532667 7923313 10225790 14328049 20858915 27019904
5348 27019904 29198625 27997824 24046366 18743498 14052017 10735756 8489955 6956955
5340 6956955 5826842 5025342 4424827 4004569 3675420 3405670 3238644 3055743 2859572
5331 2859572 2720559 2632034 2484965 2383798 2314094 2211286 2138441 2095474 2056655 2022238 1961329
5320 1961329 1858794 1784513 1755682 1690401 1669214 1654316 1630739 1617864 1610955 1632827 1632807 1628132
5308 1628132 1590737 1600332 1565330 1529280 1533090 1533983 1515620 1476656 1424815 1407388 1430407 1450911
5296 1450911 1432715 1432314 1410484 1413838 1403362 1383458 1397077 1382888 1386479 1354977 1307434 1314419
5284 1314419 1289825 1266156 1255031 1265385 1246109 1224382 1250007 1280627 1289240 1333349 1414975 1473941
5272 1473941 1564566 1581682 1571927 1468666 1382764 1303947 1268624 1206431 1182655 1136069 1103357
5261 1103357 1124333 1117820 1129127 1139586 1132230 1186344 1189936 1133649 1093272 1065390 1083672 1100310
5249 1100310 1066856 1065747 1046021 1014151 1009645 1028713 1009109 991075 984232 980360 985919 974040
5237 974040 904811 903020 908226 939683 955195 964116 1042658 1132560 1194544 1245529 1261931 1188128
5225 1188128 1110909 1078436 1035344 966856 906683 871425 881137 876159 860416 834023 804050 813973
5213 813973 834017 838554 840170 838566 854640 830503 834875 823339 823078 806974 822860 840958 831128
5200 831128 799576 797945 808340 796725 795878 789587 785630 812094 791937 784152 794534 770360 758627
5187 758627 759557 779660 759037 720524 717463 696498 716757 720344 704295 711871 686725 716188 736325
5174 736325 768105 786441 804411 823639 795571 766009 797163 805121 826417 871441 865233 847839
5162 847839 836412 851241 877896 854344 810978 831184 880327 854168 836390 849896 837999 825928
5150 825928 823966 832328 851303 854767 855117 868726 875300 922228 942374 927548 906997 924075 948031
5137 948031 892163 883646 883736 866644 871518 837342 848783 875043 899843 898777 877598 871853 890546
5124 890546 848859 822046 818611 858640 868662 880983 922281 950371 917876 948764 1019490 1026425
5112 1026425 1003686 953635 945567 925438 921897 928676 945022 915418 937746 945449 900607 890545
5100 890545 911490 915149 890047 958742 941304 930766 956342 923423 933477 941992 943088 939225
5088 939225 936470 955457 976079 994488 943834 910319 931624 950205 979184 949466 968992 1011595
5076 1011595 1027315 1038594 1050774 1057628 1078634 1092503 1138666 1173874 1171514 1192531 1212108 1237537
5064 1237537 1216144 1189685 1205191 1235115 1272803 1273609 1277365 1286035 1313436 1351361 1357041 1377441
5052 1377441 1372595 1422628 1440616 1438788 1442445 1488310 1496252 1543713 1591330 1592336 1593232 1600717 1601952
5039 1601952 1632994 1644177 1645956 1688320 1661920 1656724 1651447 1669610 1705285 1796689 1869976 1895909
5027 1895909 1865779 1831208 1829547 1796719 1800746 1823949 1858181 1881270 1904667 1941645 1933622 1946965
5015 1946965 1999962 2059685 2127635 2174604 2205581 2248951 2320266 2370842 2433359 2478311 2522206
5004 2522206 2620696 2696768 2781929 2840614 2953305 3012545 3132432 3237980 3402334 3575663
4994 3575663 3701782 3844478 3961702 4063993 4142986 4175222 4224818 4290223 4396280 4491798
4984 4491798 4635415 4816824 5008087 5225230 5504449 5827191 6149548 6530843 7037818 7578318
4974 7578318 8367255 9363164 10565506 11995424 13657368 15546068 18011188 21524845 27269637
4965 27269637 37198242 52208364 68416712 82039877 89325180 86347348 75900435 62059967
4957 62059967 48225126 37019842 29205144 24015140 20531669 18040741 16344523 15111344
4949 15111344 14213525 13499578 12964172 12513485 12142844 11849746 11647580 11520711 11400459
4940 11400459 11324118 11314498 11408751 11492895 11594061 11742861 11916137 12064794 12211287 12492571
4930 12492571 12899520 13490215 14294302 15366740 16687276 18327036 20369994 22982676 26801072
4921 26801072 33033944 43612263 57945380 70994559 81379645 88643870 87815936 79873087
4913 79873087 68675556 56013679 44500428 35794884 29862500 25841977 22915992 20724725
4905 20724725 19093131 17821490 16871686 16074349 15408388 14843752 14329373 13901886 13575248
4896 13575248 13276470 13006210 12792510 12643464 12519355 12444172 12429374 12407603 12412743 12360790
4886 12360790 12295931 12232949 12198726 12210561 12248620 12295266 12386331 12441017 12433601 12454448 12464090 12428562
4874 12428562 12436234 12486399 12529349 12597375 12685074 12762259 12747655 12757568 12774479 12772785 12755593 12706140
4862 12706140 12698013 12702501 12705824 12666238 12628978 12624033 12642296 12729510 12860990 13025013 13227970
4851 13227970 13489132 13812523 14139567 14509070 14948541 15400917 15834055 16240671 16691819
4842 16691819 17065258 17349066 17585620 17761855 17835957 17812685 17733179 17570749 17398355 17147122
4832 17147122 16833625 16511993 16166660 15805715 15482262 15139568 14823925 14558472 14328482
4823 14328482 14084139 13897194 13763059 13648321 13538675 13438979 13389603 13386685 13374690 13371225 13418635
4812 13418635 13488806 13560396 13673379 13737299 13792146 13808213 13846333 13810683 13749476 13665533 13567185
4801 13567185 13439539 13274265 13085501 12904664 12726372 12563248 12478293 12405139 12382250 12387670
4791 12387670 12424228 12537659 12654253 12794684 12967268 13095223 13204744 13391997 13652961 13923198
4781 13923198 14201457 14485164 14754440 15106614 15465245 15800261 16188808 16667720 17265467
4772 17265467 17944864 18762418 19670906 20683799 21733105 22686017 23401921 23730968 23730245 23488299
4762 23488299 23069108 22687749 22444652 22394893 22553420 22886040 23415326 24104699 24873128 25759437
4752 25759437 26734818 27828996 28859558 29819457 30608829 31151014 31358348 31282191 30901831
4743 30901831 30254905 29400416 28449701 27470630 26566361 25770247 25085145 24580033 24204335
4734 24204335 24001794 23951440 23962567 24141379 24452689 24823591 25212052 25601035 25980136 26371057
4724 26371057 26706183 26968671 27174235 27301461 27352331 27350433 27277600 27124181 26907576 26639245
4714 26639245 26410290 26138591 25921272 25730234 25569919 25392517 25236324 25121522 25076028 25115823
4704 25115823 25219195 25423173 25687172 26019119 26345141 26630785 26819092 26856078 26737972 26508291
4694 26508291 26199563 25888017 25512458 25151954 24827118 24583268 24387904 24230074 24188254 24252388
4684 24252388 24435571 24669397 25036549 25468020 25983980 26575778 27248926 28038663 28939110
4675 28939110 29897873 30907934 32020827 33124398 34373813 35641144 36874681 38087820
4667 38087820 39201899 40322195 41346195 42330248 43209736 44011473 44773084 45442470 46005334
4658 46005334 46529088 46968475 47385095 47750860 48049408 48383400 48760010 49147633 49565747
4649 49565747 49971878 50361596 50673029 50860300 50903388 50816642 50585161 50221491 49748875 49216771
4639 49216771 48579736 47813386 47029316 46219326 45366147 44409371 43452359 42506157 41552942
4630 41552942 40625624 39719320 38930046 38299319 37844641 37571392 37583295 37794898 38199846 38763021
4620 38763021 39359683 40025069 40635546 41281207 41963861 42608873 43216673 43752139 44190487
4611 44190487 44480613 44568542 44495644 44288425 43873875 43327287 42689811 42027144 41257863 40480484
4601 40480484 39708986 38921071 38233327 37596961 37143261 36912931 36902225 37163945 37697055 38424788
4591 38424788 39383795 40654577 42268740 44311260 46954093 50426087 54980203 60756838
4583 60756838 67384782 73603755 77682854 78604947 76362984 71826895 66282813 60936264
4575 60936264 56408503 52778499 50016634 47897342 46342601 45243808 44435537 43810894
4567 43810894 43317266 42876558 42522550 42360850 42371750 42498781 42835446 43362382 44053103 44990107
4557 44990107 46097868 47427127 48985351 50737906 52705741 54859780 57208597 59804438
4549 59804438 62614372 65710467 69284807 73432415 78478194 84726507 92610952 102739149
4541 102739149 115747166 131930686 150660413 170021994 187700954 201195809 208608064
4534 208608064 209204691 203417242 192570179 179036366 165402806 153371882 143688716 136099898
4526 136099898 129652731 123250810 116242469 108170132 99163877 89774278 80658125 72426377
4518 72426377 65410413 59667092 55027589 51294258 48223435 45614303 43392167 41432254
4510 41432254 39678445 37985688 36414091 34954758 33637903 32474960 31482724 30647800
4502 30647800 29938027 29325773 28798102 28291547 27806536 27279613 26707140 26123649 25487315
4493 25487315 24794786 24106392 23454290 22835635 22248681 21704739 21297339 20895780 20517991
4484 20517991 20218353 19965642 19753033 19529459 19354761 19183648 19039060 18952839 18847079 18704352
4474 18704352 18567982 18428501 18301931 18157074 18022747 17914300 17836001 17775983 17784178 17798089
4464 17798089 17797234 17849916 17943664 18107548 18267535 18485276 18733266 19030572 19328154 19716317
4454 19716317 20159668 20654333 21238853 21860313 22599540 23495409 24514825 25663005 27015021
4445 27015021 28555245 30307890 32348260 34660994 37366421 40492986 44155247 48409200
4437 48409200 53389745 59276439 66180723 74341883 83946102 95142122 107895489 121528553
4429 121528553 134810755 145947101 152859938 154253204 150127975 141543496 130222127 117801357
4421 117801357 105559998 94235355 84211112 75547998 68196396 62029714 56830475 52411433
4413 52411433 48629982 45341807 42397407 39778670 37365391 35213097 33230899 31370182
4405 31370182 29704746 28161289 26726642 25429152 24209632 23115713 22100668 21208540
4397 21208540 20384005 19648049 19026446 18442581 17947457 17562879 17174845 16857979 16563977
4388 16563977 16267157 15971912 15681948 15369517 15010640 14618971 14242127 13832941 13456226
4379 13456226 13103904 12792467 12505828 12207155 11940401 11658213 11386922 11120177 10907292
4370 10907292 10652899 10393702 10109646 9862031 9645573 9442123 9274040 9140643 8979762
4361 8979762 8815436 8666877 8502422 8356365 8222518 8115361 8046264 8042856 8109610 8202874
4351 8202874 8270014 8250390 8081831 7836243 7538496 7211165 6904415 6662262 6495644 6353264
4341 6353264 6218291 6089718 6007502 5972390 5842403 5721173 5666115 5569371 5487671 5420031 5333430
4330 5333430 5273485 5221567 5141039 5078032 5081683 4987164 4914205 4904894 4820801 4788623 4780676 4714170
4318 4714170 4675954 4653914 4640720 4634416 4630701 4582138 4554909 4550721 4535136 4524221 4488894 4511751
4306 4511751 4482101 4487043 4471117 4483763 4455596 4429523 4401183 4392539 4358218 4364420 4378766 4387331
4294 4387331 4389745 4384011 4406281 4413306 4425668 4485102 4477238 4485389 4531237 4538421 4583363 4635971 4704574
4281 4704574 4741135 4793003 4880993 4951740 4969110 5010020 5083286 5155786 5164802 5204005 5253381 5322673
4269 5322673 5387641 5481070 5564141 5621718 5658665 5672474 5687971 5698202 5726260 5751833 5777242
4258 5777242 5803936 5842477 5899080 5994410 6112331 6210359 6347637 6503595 6646241 6768280
4248 6768280 6855579 6930176 6995446 7024763 7115291 7168591 7254722 7361078 7476479 7614550 7763849
4237 7763849 7917295 8102695 8296607 8470333 8706677 8983044 9308405 9657329 10039200 10489267
4227 10489267 10971225 11450875 11959434 12369940 12760373 13144822 13515397 13922063 14393185
4218 14393185 14861060 15355392 15962191 16638394 17372409 18111029 18899728 19640146 20253750
4209 20253750 20772177 21121489 21386180 21619208 21795871 22021161 22280942 22663051 23104625
4200 23104625 23622826 24199361 24745023 25216114 25511033 25568797 25365684 25012362 24518455 23985476
4190 23985476 23475555 23031777 22704750 22433534 22246282 22086735 21887019 21671597 21371739
4181 21371739 20926224 20313265 19601156 18818586 18040041 17288482 16547563 15849779 15234490
4172 15234490 14694850 14227815 13747168 13284108 12831861 12376620 11915394 11400620 10882106
4163 10882106 10361345 9856615 9392450 8938331 8546636 8168924 7848472 7542648 7258869
4154 7258869 6969293 6717841 6484520 6216582 6000203 5786939 5597607 5379224 5188578 5012437
4144 5012437 4852958 4698841 4534390 4367964 4279511 4182251 4077759 4058385 3968606 3907347
4134 3907347 3870028 3817216 3729647 3685648 3653405 3639374 3603971 3563817 3585646 3551334 3526049
4123 3526049 3508505 3445789 3399072 3322025 3221866 3128527 3036584 2978191 2884443 2806565 2704379
4112 2704379 2619402 2569706 2499078 2443713 2374272 2392582 2378462 2298959 2265327 2205290 2186334
4101 2186334 2126335 2105111 2058263 2004160 2010496 2029372 1992060 1963889 1916822 1886041 1859612 1845941
4089 1845941 1840125 1785648 1773964 1715405 1641365 1643353 1667751 1676242 1647942 1629157 1639499 1610256
4077 1610256 1563426 1561351 1541360 1527836 1529196 1514175 1519365 1480468 1453456 1459700 1446102 1453524
4065 1453524 1437214 1415883 1405937 1364592 1333509 1360538 1346801 1324344 1305480 1290932 1302714 1261951
4053 1261951 1265080 1298457 1272506 1290296 1270415 1257539 1259684 1249464 1227889 1221072 1257637 1237021
4041 1237021 1217276 1174886 1180110 1198065 1206452 1230405 1202812 1173966 1166496 1133400 1147920 1097585
4029 1097585 1073189 1094869 1081544 1083991 1077089 1064087 1033310 1044364 1036716 1007285 1004720 1016160
4017 1016160 1007612 990589 992999 969769 981249 1007650 1010340 997147 979381 963000 960321 1004824
4005 1004824 984901 973854 973457 921388 944703 898849 884207 873493 856013 876998 923776 899722
3993 899722 910448 901567 894019 891610 862852 829901 847144 853841 813390 837068 800087 787661
3981 787661 783428 802327 829291 817231 804788 774227 759555 727255 749699 750708 754397 727051
3969 727051 713535 726689 723320 708800 694643 696021 690447 692479 664269 660773 659173 686493 718231
3956 718231 711050 681449 699105 668514 673715 668979 693277 699425 691204 703777 702672 675708 670956
3943 670956 647353 667308 681013 683316 692633 697754 714143 701496 681127 707443 707596 718502 692376
3930 692376 700130 685103 660684 702312 684158 654021 651380 697201 684739 672905 687225 691491
3918 691491 644057 645211 639930 662318 666188 664310 687425 671970 671617 691941 699490 698739 683243
3905 683243 659206 648327 652784 692936 734649 717710 655942 671479 697071 684100 678222 668253
3893 668253 678479 651971 640418 637914 665024 659990 659828 682504 669374 688028 692153 706148 706818
3880 706818 736907 718410 706276 750703 736575 713784 702391 697370 693259 696399 715629 707767
3868 707767 700815 695740 673838 704899 721355 713495 725412 726654 720851 726157 774548 803935 811680
3855 811680 809502 859119 908676 907236 907942 933940 967345 1004651 1015950 1005071 1001899 991680 970358
3842 970358 938157 913092 918263 865583 799437 784713 767628 775258 768410 727605 716812 715669
3830 715669 702953 678719 693118 716592 692991 668374 661241 660092 681404 666949 609584 588145
3818 588145 609823 640021 659713 624501 595731 621447 635184 626995 669297 677237 648544 638108
3806 638108 666038 668442 631457 654430 651577 692762 697294 678306 660960 643137 635362 646523
3794 646523 623566 628322 647333 649864 666657 661094 677257 681927 689082 691703 669371 677972 693797
3781 693797 691979 672776 705737 738584 746142 756301 760644 744339 738105 743314 740302 772386 793227
3768 793227 824830 852913 850316 885325 870543 892556 942223 966700 976948 1017865 1048110 1082395
3756 1082395 1107790 1132867 1151691 1170689 1198239 1198588 1216951 1259558 1279840 1351489 1388276 1417622
3744 1417622 1440764 1459170 1476817 1497441 1545731 1593499 1584516 1596649 1586160 1604167 1659912 1662432
3732 1662432 1683581 1660790 1683385 1718248 1699223 1694826 1701563 1666611 1665402 1661197 1676422 1637729
3720 1637729 1648189 1617381 1602562 1589812 1557453 1568990 1541983 1549885 1539588 1500802 1520765 1506117
3708 1506117 1535419 1562054 1595562 1601154 1635362 1609354 1616162 1671562 1652308 1671679 1684141 1710667
3696 1710667 1705260 1678416 1691679 1727376 1742416 1747247 1756113 1735411 1756103 1798953 1814830 1836878
3684 1836878 1854939 1890118 1940569 1948621 1967351 1973480 1985077 2006257 2043993 2077233 2115309 2153158
3672 2153158 2199710 2242332 2269348 2356613 2370017 2341303 2362013 2371731 2432412 2449586 2484186 2501070
3660 2501070 2534234 2614137 2659513 2667818 2692638 2756664 2788887 2824212 2869084 2946280 2998147 3016885
3648 3016885 3097745 3161690 3154958 3167060 3231372 3268602 3279387 3298925 3331781 3373903 3428821 3468924
3636 3468924 3497427 3527365 3529552 3568444 3575933 3602330 3589950 3540197 3511561 3522966 3474081 3451470
3624 3451470 3405327 3390677 3341785 3284886 3292715 3264866 3235216 3203682 3190075 3125027 3107160 3088773
3612 3088773 3075530 3067380 3025004 3028384 3016131 2992804 2975134 2984097 3014484 3030444 3029546 3055401
3600 3055401 3081713 3134578 3147469 3200161 3223420 3329813 3391527 3460793 3516827 3528844 3581187
3589 3581187 3641868 3677607 3766884 3834371 3878707 3942395 3992892 4045059 4096963 4188671 4256522
3578 4256522 4315664 4396078 4494731 4545648 4601431 4675354 4736443 4773159 4875986 4932641 4999764
3567 4999764 5060992 5171880 5301702 5420268 5522558 5653392 5765320 5892493 6036821 6206949
3557 6206949 6361253 6463490 6613634 6743629 6871769 6993073 7111079 7255008 7380621 7521707
3547 7521707 7635315 7705901 7781770 7862094 7972639 8065440 8173311 8283453 8416967 8575017
3537 8575017 8721692 8885070 9037860 9204225 9343332 9457196 9567897 9712813 9840368 9966890
3527 9966890 10091858 10244319 10352253 10502116 10704675 10856132 11063561 11263171 11507898 11722459
3517 11722459 11942923 12233107 12498860 12769251 13056868 13420028 13768749 14139373 14559510
3508 14559510 14958848 15442583 15932004 16427477 16941125 17485274 18072663 18714120 19397305
3499 19397305 20050253 20767550 21552592 22387101 23244119 24177776 25175317 26225066 27376290
3490 27376290 28586149 29897940 31344650 32888751 34560663 36402866 38369569 40521771
3482 40521771 42874215 45414053 48131822 51042005 54237680 57618448 61212721 65067679
3474 65067679 69145678 73337580 77620582 81947153 86212468 90437418 94613648 98724849
3466 98724849 102805063 106966646 111290906 115879768 120806171 126106141 131843176 137920742
3458 137920742 144109044 150265464 156047593 161083645 165112850 167885045 169266720 169322784
3450 169322784 168223379 166192304 163601503 160769841 157976293 155414418 153115200 150956006
3442 150956006 148773948 146345498 143380506 139696075 135191186 129791011 123636392 116871964
3434 116871964 109724255 102494862 95394545 88672774 82363633 76633016 71463071 66885785
3426 66885785 62800362 59272579 56318787 53915344 52290376 51490485 50956733 49802486
3418 49802486 47969193 45595907 42956485 40535123 38519146 36854408 35446107 34244766
3410 34244766 33175189 32246746 31433388 30708529 30080758 29495265 28941120 28420344 27963515
3401 27963515 27589147 27263726 26952102 26681843 26395625 26125462 25919313 25817893 25848868 26139531
3391 26139531 26981902 28813620 31830402 34405326 35115523 34191628 31887230 29057947 26617590
3382 26617590 24850546 23577397 22659421 21950961 21442910 21029181 20679690 20423330 20175710
3373 20175710 19982886 19820662 19683363 19571273 19534993 19573481 19679806 19798685 20084092 20426131
3363 20426131 20807575 21364262 22062852 23004312 24289490 26121452 28489094 30665024 31951263
3354 31951263 32544450 32648126 32492079 32508736 32685471 32905859 33052909 33035685 32846297 32487977
3344 32487977 31941662 31175967 30302820 29447673 28539863 27680713 26907758 26216235 25619509
3335 25619509 25181678 24836109 24640459 24507685 24467789 24499717 24657528 24800686 24973021 25226299
3325 25226299 25459835 25723222 26026931 26333038 26577121 26877467 27177269 27538100 27954669
3316 27954669 28472848 29060326 29739456 30515707 31473060 32587518 33901758 35429975 37264927
3307 37264927 39326305 41729147 44438243 47467922 50863130 54531558 58608689 62906781
3299 62906781 67384048 71889416 76239211 80271597 83824872 86806105 89120662 90729170
3291 90729170 91641789 91978261 91788596 91244376 90588768 89819186 89244147 88998023 89159689
3282 89159689 89795987 90931296 92598176 94704366 97182983 99898997 102740090 105584501
3274 105584501 108282160 110731228 112809741 114403391 115452085 115849254 115561461 114644916
3266 114644916 113080089 110857224 108087505 104849573 101285844 97523648 93693446 89880894
3258 89880894 86210717 82749530 79582667 76669364 74011846 71593328 69348882 67224196
3250 67224196 65159950 63106968 60984462 58804232 56568012 54273078 51915164 49542384
3242 49542384 47207013 44926923 42674849 40537347 38538285 36659597 34981301 33372964
3234 33372964 31961566 30701279 29554287 28555686 27643540 26875241 26163836 25561655 25102532
3225 25102532 24694963 24361077 24166902 24010118 23922133 23885836 23860340 23843867 23839354 23801767 23713645
3214 23713645 23606685 23420690 23239695 23053750 22813061 22627603 22454072 22256551 22066994
3205 22066994 21903735 21796445 21722761 21667976 21675317 21722089 21718142 21686738 21628934 21464638 21262526
3194 21262526 20981895 20617702 20174518 19623891 19048396 18405888 17772006 17133402 16554859
3185 16554859 15952244 15409228 14926660 14463830 14070809 13700222 13347953 13054100 12802644
3176 12802644 12569458 12397346 12213652 12052912 11917252 11785246 11681111 11611613 11504150 11398312
3166 11398312 11299551 11188816 11124786 11091052 11071210 11076696 11141373 11206916 11304863 11406896 11450971
3155 11450971 11410343 11331678 11209919 11093009 11010569 10914167 10844377 10770670 10696458 10652722 10665140
3144 10665140 10645588 10664334 10694830 10719860 10755447 10774082 10745875 10740320 10775677 10780897 10756081 10796728
3132 10796728 10869431 10968553 10992699 11027337 11125332 11226826 11274556 11350592 11516218 11667217 11875460
3121 11875460 12104298 12336940 12641530 13014439 13381332 13848430 14373114 14869403 15459518
3112 15459518 16043690 16682709 17392197 18134867 18918265 19756254 20645224 21581244 22558047
3103 22558047 23596026 24683744 25844075 27022285 28193636 29434939 30702448 32052037
3095 32052037 33475970 34937691 36425886 37839940 39165347 40334059 41368902 42279589
3087 42279589 43281455 44457335 45817789 47505016 49509473 51924977 54745117 58037760
3079 58037760 61785776 65993660 70725330 76056515 82138842 89128582 97295054 106976082
3071 106976082 118609743 132693812 149896876 171118848 197083141 228109289 262908163
3064 262908163 297924341 327629452 346160055 349853001 338578578 315438338 285378565
3057 285378565 253233963 222546607 195161905 171692010 151995056 135556399 121782391
3050 121782391 110165367 100290899 91828061 84484631 78134371 72636533 67895103 63775339
3042 63775339 60309685 57253872 54535208 52107533 49841116 47715086 45702194 43848275
3034 43848275 42122830 40489800 38920230 37386679 35877331 34405510 32964929 31617720
3026 31617720 30376946 29220744 28126144 27140893 26233590 25383772 24573209 23793153 23047663
3017 23047663 22362280 21750083 21167120 20610551 20052652 19523211 19013612 18508389 18100136
3008 18100136 17662202 17307400 16961383 16637657 16324609 16034176 15728456 15475469 15219402
2999 15219402 14966768 14729442 14409976 14084946 13723301 13333883 12935546 12561952 12216970
2990 12216970 11909802 11662779 11403597 11107197 10868336 10659163 10469521 10308769 10211621 10111091
2980 10111091 10023071 9995343 9856681 9613583 9436535 9222080 8968600 8764146 8597909 8406845
2970 8406845 8220368 8078392 7968311 7821295 7720042 7631333 7547918 7475225 7340802 7243464
2960 7243464 7130395 7009691 6902502 6771443 6660636 6515274 6472396 6414810 6315697 6207640
2950 6207640 6104756 6030319 5923340 5823500 5763682 5678139 5591081 5576124 5525485 5455549 5386320
2939 5386320 5338230 5275890 5223285 5137369 5064558 4984886 4939604 4860049 4775193 4723138 4663586
2928 4663586 4590216 4543440 4492264 4437059 4417732 4363704 4317758 4308845 4273384 4226633 4197275 4140073
2916 4140073 4134399 4137468 4118664 4122547 4108684 4069066 4054439 4047212 4021804 3976129 3969226 3936677
2904 3936677 3884861 3825629 3792418 3783725 3723976 3607318 3573487 3498239 3436204 3394965 3267102
2893 3267102 3234828 3204550 3173876 3126450 3084673 3047388 3024761 2962517 2958858 2919451 2869661 2871202
2881 2871202 2807426 2780241 2767738 2710221 2706968 2660098 2652452 2605676 2550896 2538836 2513158 2482850
2869 2482850 2472889 2455434 2428343 2386723 2363493 2343967 2327634 2369616 2328304 2293825 2292377 2275870
2857 2275870 2264782 2247927 2250013 2236189 2209785 2223266 2205029 2236502 2215090 2222007 2230900 2207229
2845 2207229 2162752 2165115 2210060 2240824 2273638 2273448 2242439 2225887 2246870 2228971 2204206 2176768
2833 2176768 2143213 2158728 2175158 2156873 2127319 2127580 2089427 2059561 2051657 2027928 2021594 2025250
2821 2025250 2030388 2029077 2010500 1969667 1958600 1972113 1975209 1979802 2003922 2000791 1993952 2005273 2006788
2808 2006788 2015675 2002598 2008723 2024162 2019004 2007178 2009140 1996175 2026921 2075770 2085309 2132797
2796 2132797 2180374 2244309 2271354 2280558 2306039 2332082 2371218 2386646 2401967 2415678 2491499 2577010
2784 2577010 2677532 2784254 2890964 2971110 3088157 3178983 3168799 3156144 3115295 2975285
2774 2975285 2864337 2766607 2614388 2485934 2397545 2335180 2280604 2226014 2121127 2065594 2019112
2763 2019112 1997916 1985088 1969823 1926647 1905983 1881973 1852110 1827857 1831202 1805296 1756156 1725799
2751 1725799 1672305 1710408 1699318 1704430 1707314 1668664 1614562 1595479 1618974 1617837 1606036 1565046
2739 1565046 1568841 1573033 1583819 1566544 1535066 1518747 1519140 1523200 1498120 1455198 1433232 1468401
2727 1468401 1421711 1387676 1384275 1350155 1326983 1286826 1303872 1345184 1355774 1332838 1323001 1302709
2715 1302709 1315924 1312206 1319069 1344268 1336118 1326333 1310499 1303755 1338730 1318506 1296087 1297919 1282494
2702 1282494 1260365 1242975 1256647 1261363 1256861 1260562 1250255 1250190 1231298 1208437 1188994 1189072 1234135
2689 1234135 1224925 1220496 1221505 1251103 1220489 1211934 1202245 1197635 1197723 1182085 1211070 1201247 1150247
2676 1150247 1150930 1110634 1089563 1100271 1116416 1141986 1155754 1133421 1092312 1080048 1079925 1101651
2664 1101651 1136282 1144563 1111472 1134417 1134435 1146506 1120362 1094847 1056478 1112096 1099711 1129562
2652 1129562 1099545 1102748 1107124 1089596 1093319 1086231 1107693 1075428 1058598 1033358 1073134 1057074
2640 1057074 1047554 1054306 1076751 1075441 1073642 1073718 1070640 1067168 1076489 1045158 1064241 1059293 1055486 1050830
2626 1050830 1035302 1045699 1055006 1050872 1039428 1047707 1033260 1043391 1057011 1061390 1066889 1089452
2614 1089452 1063225 1047528 1072499 1106957 1142099 1139209 1092633 1066154 1030103 1033982 1031992 1003299
2602 1003299 1009855 1017458 992366 943218 973125 962791 958135 980551 971369 958566 970775 964660
2590 964660 974234 974606 979107 965090 944508 945741 960395 938574 928945 921377 903001 919933 937388
2577 937388 933138 910802 929511 924289 904938 917339 935462 921963 904050 907037 907672 902953 903870
2564 903870 901377 897331 903973 893387 873099 863200 880900 913351 916962 921513 905558 881695 915223
2551 915223 894233 864265 873464 863375 844290 855118 849358 907822 884515 843086 859778 860481
2539 860481 851649 852420 854627 852699 836858 814765 852592 859161 850228 837412 845347 840521 808448
2526 808448 805594 835013 830094 802626 797133 838309 815245 821529 768529 800324 834275 811599
2514 811599 771527 784310 797766 815810 827723 792629 778092 803739 821680 782151 761486 747281
2502 747281 746447 727163 717650 736079 762409 753553 766845 758583 738098 731545 707156 725498 760548
2489 760548 748462 762110 735679 699565 715554 727660 745072 707463 704973 738994 733287 746772
2477 746772 760916 740118 740396 732195 701336 720177 733982 747683 713461 660634 686280 705843
2465 705843 693312 713950 699098 669787 670176 706162 708722 722416 757027 762634 749131 755288 770306
2452 770306 765041 764660 753760 707954 715347 696737 717054 748320 696135 699972 723579 747301 714457
2439 714457 733949 740495 702219 684287 672919 733816 749057 725445 717033 747313 756279 701090
2427 701090 672014 679041 741507 724243 679562 688967 684082 673704 690783 709282 706663 702869 727365
2414 727365 739718 729039 735108 723815 709154 695685 715802 725969 734132 715506 729200 759019
2402 759019 735179 746110 721663 699883 766979 773380 775230 776533 733849 750857 786308 818184
2390 818184 835956 808733 791937 787919 812724 783469 788656 838651 887404 916257 928531 949781
2378 949781 964426 988867 1028785 1021310 976011 963664 985901 1043367 1037187 1055664 1097745 1118368
2366 1118368 1163275 1206609 1267461 1344671 1440276 1613079 1761683 1986478 2139548 2211997 2250197
2355 2250197 2349292 2423771 2648982 2964951 3377987 3922249 4652685 5681749 7501689 10961024
2345 10961024 16978998 22616437 24347824 23239079 19445279 14585862 10787671 8198816
2337 8198816 6548471 5344351 4447251 3860448 3435995 3142446 3027711 3000340 2955276 2835480
2327 2835480 2671420 2473020 2278021 2125748 1972697 1844894 1780594 1697372 1642284 1583310
2317 1583310 1488634 1411978 1356679 1326547 1302086 1246537 1233064 1238416 1210959 1177699 1119452 1104032
2305 1104032 1117514 1114770 1065490 1072166 1051920 1039592 1002015 975916 995090 1004834 1012868 977500
2293 977500 947498 939636 897746 889237 896167 853787 854194 839947 854327 883197 877069 838681 839114
2280 839114 864421 834701 817722 794334 768503 765703 764557 764240 766923 761773 772957 751995 691751
2267 691751 658281 657845 672723 687750 684969 687380 689709 691424 641546 618613 638285 647685 606773
2254 606773 618317 623699 637670 640760 643984 638986 631155 640427 626457 663509 631512 639734 655543
2241 655543 658385 652880 626792 624631 595471 582521 602774 595737 606804 614043 635233 622532 595696
2228 595696 573538 557333 549425 552784 516738 533970 555850 571966 589290 579467 579128 564395 548239
2215 548239 546741 559212 548301 518664 527620 516205 491083 528478 557037 549873 504795 476194
2203 476194 512586 540383 547139 534894 512356 517722 536349 534819 523578 525211 511212 482671
2191 482671 510084 488503 494092 506031 534896 535378 533309 494733 497059 517249 526704 508380 451950
2178 451950 486371 485517 481918 473078 475129 470425 468510 456689 454805 455697 446353 456309 448169 429961
2164 429961 443821 426204 447997 465056 448436 434803 436297 430816 446280 446843 458565 468013 446396
2151 446396 419357 441336 433916 458474 477543 490639 497683 468855 424344 411827 411732 434178 455134
2138 455134 431530 442861 438320 443637 431688 444441 442164 459790 425008 408662 423309 425447
2126 425447 420199 428998 416099 385739 398833 403338 399438 399108 402041 416098 416894 441883 441463 420344
2112 420344 393969 388425 404948 423101 437918 425630 429853 427752 394621 388187 397870 397935 385779
2099 385779 409191 418891 426443 436968 409993 438373 454191 416719 406179 430955 418556 436713
2087 436713 435604 454906 438223 479544 461614 443738 438143 427906 418474 402895 445922 467861
2075 467861 490959 508479 494775 485157 461748 423187 414841 407526 418528 434570 410460 369565
2063 369565 364641 361289 368068 352295 360550 398210 392663 355921 346857 370935 389901 407475 370596
2050 370596 368555 364455 363964 403513 407614 368163 384759 386801 369190 338611 327024 332662 352199
2037 352199 362032 353872 372659 377648 378549 373002 378931 368919 367123 364400 349642 372501 382591
2024 382591 370593 339323 345170 331868 303310 323082 314679 327661 310718 330978 318953 332875
2012 332875 284357 272997 312902 326903 335129 341743 339931 338677 369732 362514 348450 328596 337179
1999 337179 348193 358585 409955 386584 380068 363694 373491 372749 356591 338219 363754 339231
1987 339231 273650 326250 344756 311861 325039 328089 355982 372427 356653 364524 367212 326905
1975 326905 327401 344938 327544 322979 312811 322143 333394 332038 378368 352318 335403 309597 312125
1962 312125 320918 278061 295793 318586 326946 312903 335987 291462 295566 307151 301770 314859
1950 314859 314453 307606 306182 322541 302202 306517 344264 306623 334493 345104 315903 321988 330667
1937 330667 343919 325878 307926 317782 310483 293822 289756 312532 308173 310363 287878 293041 311528
1924 311528 294334 288416 273852 267520 278286 309720 302034 289854 291882 304056 293557 287252 280212
1911 280212 279045 298013 336647 319195 273349 288632 299457 311547 321456 325334 318832 336913
1899 336913 322365 321456 288117 276729 304946 304409 277297 289185 306677 279245 287054 264209 258598
1886 258598 242924 237667 275380 268185 268465 300695 311468 284834 302273 305833 281710 284545 312001
1873 312001 286593 267457 261452 253934 272523 289865 299150 310616 271007 273561 275327 254583 281627
1860 281627 283462 284251 297365 287389 266297 256294 282460 299556 292064 300559 294163 279031 273930
1847 273930 255611 254008 274624 287314 284429 240128 254138 284472 258470 241336 243611 238235
1835 238235 223928 242219 271336 295392 284727 276172 274152 279256 283574 308169 278247 252758
1823 252758 275483 253293 255009 225074 252358 274944 248489 197970 226174 225956 251683 256548
1811 256548 231004 217682 253748 262996 249268 239340 265606 246500 224484 221066 215918 223170 208463
1798 208463 247250 278994 256105 226498 233039 244233 256224 264435 274756 230987 234424 225380
1786 225380 208737 241170 255106 236126 238099 209375 214298 224242 206069 239098 250425 270474
1774 270474 236660 215738 240701 231567 233638 214611 218597 233294 205445 205921 202413 187557 212764
1761 212764 201694 187512 193059 207208 209266 212307 236881 214398 209570 232279 254987 240389
1749 240389 192942 197145 226498 218489 218566 199473 204593 217822 201439 196138 227111 217218 201035
1736 201035 195383 202935 213266 234715 240278 226321 202588 216374 219661 178726 178941 206030 235127
1723 235127 235214 222972 224243 222553 238408 239222 226703 242810 251333 256661 236999 235433 222449 218911
1709 218911 199473 201239 192955 182666 177441 218050 182221 196122 222675 241744 211857 208669
1697 208669 232143 208419 208777 207602 202848 209131 188588 134221 170131 186853 208558 220947 209872
1684 209872 214062 215467 214426 199484 189566 190604 190657 200146 184377 178110 198053 204144 234295 199350
1670 199350 181311 179981 238759 256392 242074 214820 184957 211807 206968 155581 156043 182196
1658 182196 160335 193728 194907 169465 157616 188428 196872 164124 183730 199813 181917 180180
1646 180180 174366 165987 210725 188276 140812 187805 168781 162171 186833 210791 209216 191269
1634 191269 197247 200083 199707 197977 191122 212525 203364 173485 147886 150381 192079 190091 182045 184190
1620 184190 199706 215641 186865 183015 193847 172797 157955 179761 165893 154585 165936 173008
1608 173008 183173 177971 176790 155005 146746 142370 190394 202232 165347 163185 156984 163334 160262
1595 160262 154450 157423 161838 167585 177901 158250 157938 151769 191257 190819 198396 168581 159277 145392
1581 145392 175178 141974 128518 151497 128205 154475 175176 150339 140278 142777 130267 165903
1569 165903 203336 191714 183521 164706 162619 190295 192907 186905 170185 190312 191324 170238 155423
1556 155423 171241 135660 140668 166543 151279 128872 152216 159637 179465 200394 184249 145749
1544 145749 158812 164515 174346 178527 181889 188048 152037 122044 151115 149721 116780 158028 156186
1531 156186 139662 141450 131033 158188 160356 168812 125382 135929 144916 132058 138872 163808 166167
1518 166167 146716 143787 103936 133739 151541 139381 120430 126470 146477 115443 103367 130025
1506 130025 166636 153148 137701 144328 136459 130800 165485 176478 149723 135191 137753 165408
1494 165408 175258 166181 182281 175632 164989 173997 154579 128068 98564 108984 135501 157538
1482 157538 116694 101699 132827 135351 136028 148313 150517 151633 159523 122845 104131 102577 96061
1469 96061 86739 118861 104485 68956 90553 92948 116593 137201 120067 66682 82994 97238
1457 97238 106311 109758 88652 118395 137650 167054 167219 157490 180386 161481 143619 154548 154882
1444 154882 144482 127933 111402 127631 139142 127179 119165 109447 87993 132849 115785 104681
1432 104681 117212 86225 94755 113377 135058 137988 129791 127415 125789 134066 126320 114928 131455
1419 131455 136809 135094 171983 147209 122776 106575 72079 89127 118950 129457 118990 116819
1407 116819 129595 134385 114558 113069 116301 128366 109495 84576 70589 62364 92006 105975
1395 105975 127122 99278 125181 121308 99383 82794 90684 151359 150111 118809 81521 93830
1383 93830 112625 100084 88684 92671 92757 97425 106907 101303 100275 99117 107938 135411 110578 106585
1369 106585 78831 91728 73754 60468 76947 88051 82161 88054 117962 86638 79000 109174
1357 109174 129702 100926 79786 71870 80948 92152 100724 99547 89600 69608 58449 80893 85633
1344 85633 109341 94150 100949 101958 97236 98663 102909 114681 115377 90671 125156 146381 99616
1331 99616 93438 94451 73975 86122 88492 51947 76072 85921 100638 87227 60011 52243 52668
1318 52668 95204 113561 60561 61584 65318 86966 107729 97300 68650 56708 43098 47556
1306 47556 81641 77633 86151 88988 116998 97478 87986 70219 79350 72617 77462 76159 65358
1293 65358 74725 100207 80148 122230 116926 99945 119723 114007 86640 76299 94933 114527
1281 114527 142193 102636 89496 120497 125840 125458 107257 91712 90010 89728 106990 114399 104574
1268 104574 102661 117650 64925 83336 55445 85587 87131 113936 104157 84072 67385 54460
1256 54460 87633 86911 50768 59744 42699 35287 61703 47391 45021 46051 59581 76628 60265
1243 60265 59771 56250 79766 64624 67844 101636 103659 57695 49560 49629 39723 73543 91072 101177
1229 101177 77959 80983 84601 63219 85688 77838 56494 95407 84846 71458 40934 8148
1217 8148 27830 38405 31121 50669 59470 57859 88981 76362 40236 64005 65991 52138 65691
1204 65691 65256 46337 103606 98361 80494 64224 46451 71270 85932 40124 53238 65033
1192 65033 55417 20995 10179 16756 55505 92827 99979 90401 65781 68992 92042 125479 123842
1179 123842 94796 79766 56487 43352 65081 53501 45632 64097 58660 62929 57887 54402 47319
1166 47319 87467 64854 70988 63831 27097 15985 42101 50647 41955 37278 32154 13108 15343
1153 15343 81769 68905 45673 41198 70829 54761 64732 53019 23972 28826 61867 78337
1141 78337 69019 42057 59005 78757 43095 40787 78054 67818 54965 30200 54601 66589
1129 66589 50907 43318 33430 21994 14504 48314 1989 53290 69523 42118 68661 51136
1117 51136 64376 50246 49042 45481 78242 39981 42012 53835 46665 47492 58858 67447 42818
1104 42818 31965 12978 35599 56391 76928 94058 74449 45696 39725 44265 57862 47533
1092 47533 40185 68369 75989 90398 76231 65447 65572 59893 61242 49586 38388 36256 44546
1079 44546 25075 31400 36387 34303 48541 55012 38963 61364 50273 11165 740 17127 18936
1066 18936 13138 17702 23115 -3875 24807 57748 63119 57490 9783 10047 13615 8464 25788 48450
1052 48450 72646 42225 13902 33908 49739 53554 41181 52674 87648 101663 47342 25468
1040 25468 36496 36747 67404 78128 32251 20411 44544 58907 55726 43697 33816 25050 5720
1027 5720 13893 13517 37005 35385 3982 10709 14196 24337 33858 53723 40195 26937 13999
1014 13999 36224 64754 43505 58107 56351 33481 12151 22183 21531 4130 16215 45517
1002 45517 25841 12054 923 20017 50094 48114 17608 15327 45629 21490 13085 16687 30310
989 30310 15258 26211 8331 -20512 -17277 -10429 7040 63916 59555 39415 17187 14052 35675
976 35675 32718 23380 16492 1925 38371 29164 7181 33773 34974 23960 -784 29448 41500
963 41500 38399 -2544 -15494 7564 32423 49285 7054 16401 22160 -9831 -15309 -14686 8261
950 8261 46499 55285 -2768 -86 18401 8823 18263 60901 43690 18338 15514 6311 31340
937 31340 23763 34636 20539 2225 33504 30983 24257 30834 43903 20397 4883 -5343 -18422
924 -18422 -25311 -7117 16265 49381 52636 43860 37251 22266 43722 19751 24424 -5390 -43896
911 -43896 -18067 -8314 -13261 1109 18903 27322 3904 9790 20495 28995 13985 826 16762
898 16762 30399 35768 -73 11394 31343 17786 12882 30099 48466 41731 21300 20444 28682
885 28682 34315 29835 26049 5594 -33560 -19263 -9468 35101 24781 32465 20553 478 -12964
872 -12964 21872 28963 38372 17058 124 -3532 -6632 16307 -6842 8495 25797 26111 9787
859 9787 11969 12767 33398 22086 7624 4297 27076 -4193 -9371 39617 57550 39952 15172
846 15172 -25814 -14971 1197 -2397 14666 15726 -25808 -42047 -1832 -9251 -19093 -11568 22422
833 22422 23368 -10641 4031 -1784 -20707 -2864 2532 -23354 -22220 -13237 -17400 -9171 -1570 9987
819 9987 32384 50910 42751 7860 3657 -17572 486 -2729 6110 -29693 -45546 -11960 2643
806 2643 8582 13563 21763 4050 6475 18729 8499 6635 23482 27846 24822 19112 13650 6538
792 6538 -6317 -5475 -16355 -16022 -12003 -22220 -26055 1219 39475 1987 -20483 11146 36948
779 36948 20963 7527 23023 7179 -31877 -26653 -4221 -601 -18491 -33610 -24144 -11848 -14092
766 -14092 -3901 10088 21685 2798 22943 25151 -2976 -31084 -82616 -51295 -29214 -54905
754 -54905 -68642 -49608 -14804 8363 22419 -301 -25406 -31794 -38161 -42584 -25592 -7665 -5971
741 -5971 -12537 -15175 5352 -7759 -39278 -55981 -16283 11132 -12990 971 -24403 -1701 11193
728 11193 17986 39689 17769 -255 7393 17889 -1432 -8810 -19758 -3693 2052 16030 11296
715 11296 -11904 -25375 -33615 -29437 -38042 -30056 -36843 -28192 -4762 2339 -4510 -13384 -31109 -46404
701 -46404 -30706 1968 9428 15626 17725 -4905 -16422 -15219 -37987 -31423 -43916 -31635 -18588
688 -18588 -14079 496 372 18766 32458 -2103 20580 3200 -16633 8060 8433 -1438 -942 20056
674 20056 19944 9707 -36186 -40110 -17369 -71051 -25173 4121 -27417 -29139 -35876 2164 -2101
661 -2101 -9742 -13205 -21631 -22444 8419 5619 24277 32181 -2985 -16733 5868 15821 -11738 -21278
647 -21278 -17090 -44380 -28300 14597 30839 15956 -34469 -33972 -12261 21784 12464 12566 37783
634 37783 -5651 -41928 -31608 -36181 -13879 -5736 -17557 12497 24077 -723 1167 -8255 3938
621 3938 -8867 -34170 -48115 -50086 -28523 -22712 -1983 -20994 -39409 -56054 -47613 -37255 -39816
608 -39816 -49365 -35467 -42336 -19104 -17402 -28017 -360 3611 -18921 -38746 -37394 -49481 -48205
595 -48205 -52288 -41800 -33210 -45399 1051 -5104 -4332 1937 5182 3727 -6293 12287 -1684 -46831
581 -46831 -4382 -4617 -19871 -7885 4646 -27316 -28430 -56216 -58011 -25246 -7823 3505 33746
568 33746 37634 -4689 -16823 -27546 -57467 -43876 -5209 -3487 4101 7189 1672 -24668 -28154
555 -28154 -31575 -19891 -32438 -15681 -5803 5786 -21621 -17326 -12086 -35591 -24423 -18329 -21631
542 -21631 -18872 -27663 -16938 1191 2411 923 -50292 -62638 -45362 -34385 -17560 -24948 -17538
529 -17538 -626 -36642 -42234 -51997 -68365 -64746 -75303 -58141 -10512 -14656 -20259 -11982 -70355
516 -70355 -68110 -42814 -36930 -21286 -3628 -43216 -53929 -57533 -63411 -41132 -34153 -87098 -61933
503 -61933 -17081 -30331 -31080 -49106 -41881 -17787 10842 11190 -1898 -3847 -403 -15066 -23939 -3189
489 -3189 -4048 17049 16296 -18602 -28733 -12986 -34342 -33210 -40159 -24780 -44402 -19820 -18293 -2152
475 -2152 -8582 -27397 -39402 -56326 -36207 -36714 -45193 -42245 -40901 -44193 -32893 -7848 9119 1609
461 1609 -8860 -36508 -59355 -39209 -19686 -42487 -70371 -43911 -43128 -35141 -66944 -99660 -97353
448 -97353 -74174 -51785 -30635 -43106 -41106 -38728 -61148 -57622 -40456 -2959 -46170 -52348 -62364
435 -62364 -49028 -11774 -35211 -40995 -63068 -63311 -55269 -64782 -29000 -31394 -54809 -48623 -15598
422 -15598 -44112 -58197 -34128 -46474 -56893 -41309 -78144 -58296 -47024 -21191 -11263 -11153 -56116
409 -56116 -61015 -51256 -28003 -51720 -18725 -9199 -4073 8873 1535 924 5107 -16652 -31989 -72216
395 -72216 -60786 -29805 -31947 -34225 -78138 -75866 -29911 -20240 -20484 -34601 -21763 -25900 -21249 -20943
381 -20943 -9063 -18681 -33165 -38588 -10019 -10796 -14097 -35798 -57257 -58308 -74097 -41384 -28656
368 -28656 -38328 -30081 -19034 -35356 8311 2239 -7453 -12548 760 -22777 -71659 -100232 -45897
355 -45897 -36060 -41248 -62742 -88185 -36926 -49735 -71770 -24807 -21344 -60736 -46649 -30437 -52708
342 -52708 -45957 -45412 -66186 -85534 -37549 -30929 -4445 -8503 -28096 -40210 -37661 -40582 8054
329 8054 8460 -54965 -32553 -23001 -53939 -56180 -76558 -66692 -79692 -48517 -46053 -49365 -52601 -49840
315 -49840 -30378 -6656 -25170 -45817 -26202 -6168 -3215 -18988 -33222 -39043 -39452 -35925 -36749
302 -36749 -40278 -42037 -21250 -46678 -49030 -39308 -38812 -33170 -49815 -53997 -70470 -36050 -40418 -7762
288 -7762 2446 -35233 -27896 -22112 -9280 -39874 -66575 -56747 -72914 -42610 -3783 -14988 -49961
275 -49961 -34985 -23533 -58939 -63440 -43787 -41635 -39683 -14609 -21959 -32197 -28214 -58706 -46887
262 -46887 -65853 -73539 -69216 -39939 -41447 -72253 -83405 -58438 -21555 -33676 -56276 -79228 -40053
249 -40053 -37129 -14835 1097 -38928 -41523 -39257 -28323 -20981 -19287 -62074 -74634 -49634 -62121
236 -62121 -84873 -71597 -52516 -28561 -39091 -470 -15024 -44616 -57990 -68757 -91653 -20971
224 -20971 -9516 -35344 -63195 -56411 -78502 -77127 -86579 -68105 -37525 -42967 -22021 -53914 -23358
211 -23358 -34643 -23498 -50576 -103112 -71713 -46821 -47284 -40799 -45809 -28046 -49817 -69178 -36802
198 -36802 -41302 -65972 -93914 -95624 -58698 -60134 -74800 -61667 -40632 -73134 -74042 -49396 -38001
185 -38001 -44867 -61416 -50461 -51834 -39422 93 -42394 -38453 -14536 -50964 -43629 -41916 -60416
172 -60416 -75500 -93876 -92061 -58050 -38684 -49320 -54390 -47586 -34396 -47261 -45873 -38052 -36967
159 -36967 -82197 -71996 -69702 -62592 -31937 -48916 -93953 -69587 -34634 -48558 -62731 -59649 -72739
146 -72739 -68780 -50164 -69127 -65962 -71478 -65966 -56840 -58151 -37013 -66156 -92817 -66974 -38674
133 -38674 -54536 -27175 -17226 -29422 -36479 -39141 -40172 -55450 -28463 -33215 -57859 -30351 -43161
120 -43161 -81695 -78497 -79911 -67570 -73369 -67957 -77768 -43506 -37302 -56044 -86847 -92062 -88707 -80474
106 -80474 -52882 -70555 -86709 -68612 -61696 -61323 -56561 -54807 -89247 -73702 -56082 -70639 -61250
93 -61250 -49909 -53680 -67326 -44054 -40283 -47558 -43800 -16978 -26902 -57873 -95127 -98378 -112064
80 -112064 -106531 -84832 -63219 -57769 -77369 -90978 -78590 -66891 -62971 -66547 -102514 -94438 -65108
67 -65108 -54619 -79995 -78455 -93019 -75716 -62336 -54004 -65754 -30681 -26166 -56041 -60422 -81705
54 -81705 -81193 -55103 -33322 -14847 -36268 -41604 -53300 -74909 -54469 -60371 -18362 -15003 -57715
41 -57715 -78951 -61200 -82809 -78621 -54622 -62691 -75003 -75756 -63511 -74046 -74308 -72441 -72335 -84226
27 -84226 -79159 -86743 -81768 -71110 -64035 -68824 -69271 -69611 -60470 -62241 -68343 -80670 -86837 -51514 -85532
12 -85532 -65543 -75014 -91886 -82322 -76236 -83393 -77005 -78295 -59659 -55607 -75674 -72670
0 -72670
$$ Imaginary data points
##PAGE= N=2
##DATA TABLE= (X++(I..I)), XYDATA
16383 -1590070 -1567220 -1537684 -1523882 -1487135 -1464757 -1452003 -1438829 -1441444 -1419489 -1369814 -1327760
16372 -1327760 -1301320 -1279742 -1273484 -1255522 -1238273 -1209500 -1188840 -1174338 -1157362 -1137622 -1117404
16361 -1117404 -1094173 -1039094 -1005859 -1015679 -1003758 -966594 -921608 -894809 -891553 -864475 -846825 -839794
16349 -839794 -840601 -807687 -752303 -723063 -723644 -708863 -700109 -669440 -643129 -616749 -588381 -577894
16337 -577894 -558240 -541896 -521244 -497364 -454831 -419773 -418859 -430532 -393291 -373150 -340225 -334179
16325 -334179 -325498 -294230 -268318 -251482 -243275 -225786 -196394 -174501 -144170 -112655 -77610 -44902
16313 -44902 -16451 -16863 -7660 18672 49869 52953 78496 99529 81263 129653 141610 182216
16301 182216 189523 207348 209620 245686 270425 289866 296769 305414 317467 325704 338915 326416
16289 326416 355332 403268 423086 449158 460889 476647 490992 482912 498849 531063 554415 568397
16277 568397 591861 603638 593909 618711 643630 644052 680376 705965 730059 718755 722186 734590
16265 734590 755439 781996 802478 801326 826471 827505 842478 876304 870534 884080 904677 921687
16253 921687 956351 953295 964805 959194 975622 1013167 1044870 1043731 1040597 1044748 1059569 1080464
16241 1080464 1099064 1132656 1127553 1138582 1122182 1120963 1115301 1142504 1157040 1174777 1183364 1173476
16229 1173476 1198488 1210146 1250301 1291140 1279105 1276866 1290560 1297451 1322672 1322984 1343676 1375193
16217 1375193 1382326 1376232 1369419 1377804 1359496 1381984 1402587 1428493 1443934 1433769 1433147 1417818
16205 1417818 1459298 1491033 1500111 1518455 1512667 1523374 1508261 1510800 1554031 1536566 1537385 1543663
16193 1543663 1538719 1543370 1542663 1558987 1601808 1590445 1584930 1610896 1602394 1611923 1614107 1640105 1642480
16180 1642480 1638306 1647295 1670921 1678870 1668501 1690817 1704384 1706818 1675316 1684196 1676846 1702535
16168 1702535 1739433 1713726 1712646 1749879 1768120 1753602 1743374 1752104 1772697 1749987 1719728 1755964
16156 1755964 1775352 1733374 1775481 1811205 1812401 1821761 1812071 1818617 1806141 1788024 1781921 1784420
16144 1784420 1809783 1812985 1805187 1831790 1855136 1840321 1821564 1857478 1884112 1895172 1896237 1879342
16132 1879342 1863832 1844550 1847652 1891483 1899394 1897584 1900285 1892983 1917499 1907923 1893389 1907101
16120 1907101 1886475 1904085 1923218 1916157 1910320 1911433 1923259 1930733 1928260 1936972 1935917 1964258 1960119
16107 1960119 1924661 1905745 1912318 1914290 1960666 1955900 1942999 1955884 1960812 1988557 2001523 1983097
16095 1983097 2006570 1989355 1953454 1973975 1954539 1954095 1939079 1936205 1925747 1969439 1971550 1956249
16083 1956249 1930218 1933644 1943845 1926682 1929248 1946862 1973127 1965706 1961852 1969753 1969507 2016778 2013664
16070 2013664 2039350 2007253 2004020 1983927 1970116 1982239 1967127 1973178 2000144 1996112 2037174 2060340
16058 2060340 2013657 2004856 1987944 1971962 1985603 1985274 2009935 1992926 1979893 1994067 2017743 1998156
16046 1998156 2002517 2015146 2012241 2045909 2010927 2004174 2023599 2042563 2051481 2064530 2063579 2027936
16034 2027936 2036586 2029956 2024869 2034344 1983592 1984485 1970297 1998904 1992752 2014216 2023173 2000911 2005692
16021 2005692 2014292 2040154 2035742 2071503 2037426 2005081 1983434 2002704 2023323 2015591 2038081 2025813
16009 2025813 2004596 2020217 2064405 2045877 2034834 2031444 2018520 2024519 2036352 2026876 2016823 2018716
15997 2018716 2025240 2006842 2028309 2021974 2013339 1998441 2011951 2025900 1997755 2018230 2034508 2004461
15985 2004461 2008979 2015784 1973406 1994728 2032087 2001576 2023897 1992614 2021041 2062854 2061709 2032925
15973 2032925 2047080 2029762 2042253 2067046 2051897 2038165 2052690 2056895 2082251 2059030 2038469
15962 2038469 2061607 2083183 2070426 2040284 2022577 2012955 2050607 2074610 2055711 2056097 2050641 2040118
15950 2040118 2011706 2031126 2054495 2039688 2049013 2038990 2046778 2066693 2066463 2036218 2053434 2044024
15938 2044024 2054826 2031116 1999700 2009870 2003384 2007907 2039888 2038235 2035910 2046506 2053656 2075476
15926 2075476 2077974 2045539 2027336 2034010 2030807 2010924 2016066 2026333 2029447 2026477 2033857 2035634 2061984
15913 2061984 2057065 2034845 2034007 2058903 2051959 2047841 2035063 2012308 2049488 2125181 2113928 2062359
15901 2062359 2060608 2085949 2059681 2058436 2047268 2064704 2058561 2065573 2065496 2075073 2079746 2104500 2111649
15888 2111649 2058745 2046646 2077515 2089065 2053310 2056393 2072568 2068725 2056471 2051963 2100382 2124250
15876 2124250 2093439 2060925 2071440 2065500 2070871 2078564 2077953 2045934 2063215 2047101 2041656 2072375
15864 2072375 2090693 2082975 2097019 2082667 2069575 2062022 2054131 2104559 2110576 2106709 2079483 2066233
15852 2066233 2061828 2062359 2070766 2068226 2087594 2068801 2068863 2070871 2082847 2045524 2045896 2047222 2037020 2047326
15838 2047326 2042810 2061115 2043648 2043653 2047332 2063590 2037799 2057033 2095050 2086568 2066171 2085741 2108395
15825 2108395 2109350 2102124 2078511 2021971 2058885 2069775 2069964 2069895 2077404 2053234 2057646 2040483 2019673
15812 2019673 1992140 2026497 2039984 2059598 2044122 2065208 2052492 2029595 2051588 2077521 2085353
15801 2085353 2075574 2101538 2094286 2063957 2078315 2086246 2060837 2047533 2045987 2052137 2059512 2056189 2052058
15788 2052058 2060153 2048883 2069682 2102225 2071161 2050131 2063219 2081701 2082051 2040577 2003535 2030582
15776 2030582 2053212 2050216 2060144 2059615 2046249 2093603 2074281 2046518 2064891 2055598 2063130 2082072
15764 2082072 2083496 2070878 2081012 2091959 2082347 2065752 2051874 2067331 2080153 2101348 2086195 2075779
15752 2075779 2077907 2059769 2062295 2064465 2099238 2097248 2072962 2103395 2115228 2095449 2107766 2123005
15740 2123005 2104229 2055871 2058709 2086211 2092626 2084978 2059421 2091367 2085526 2055477 2048539 2084713
15728 2084713 2074780 2062961 2106556 2119953 2132785 2097519 2088367 2103543 2120938 2088833 2094047 2104272
15716 2104272 2115475 2111846 2079324 2095670 2121281 2058589 2109198 2114219 2083783 2070767 2104180 2081563
15704 2081563 2086846 2105179 2107064 2107321 2124294 2111607 2116696 2114429 2122679 2117539 2099962 2092997 2104411
15691 2104411 2093282 2099442 2081195 2065183 2059435 2072227 2107453 2122791 2116748 2099502 2086049 2102285
15679 2102285 2115442 2143631 2147874 2111467 2096562 2120426 2136350 2118459 2114841 2106010 2114764 2125371
15667 2125371 2114967 2133040 2097646 2116037 2101409 2055532 2077556 2074979 2101646 2128704 2142067
15656 2142067 2084216 2068528 2074200 2088689 2100396 2110103 2079733 2097384 2109475 2110567 2129611 2141091
15644 2141091 2145186 2152249 2136606 2133498 2061990 2088390 2102487 2117867 2101386 2103226 2088102 2104826
15632 2104826 2109664 2116162 2123861 2118237 2106411 2087872 2089744 2119001 2096182 2080455 2073034 2096921
15620 2096921 2117048 2130345 2146818 2121904 2105909 2135135 2136865 2127786 2161634 2133237 2136670 2127292
15608 2127292 2109329 2133445 2144640 2116760 2078139 2097879 2105317 2086164 2051828 2053517 2128610 2133388
15596 2133388 2121627 2142456 2149210 2141689 2095451 2071983 2115743 2128698 2158193 2149748 2168718 2133086
15584 2133086 2125020 2115946 2112578 2106108 2117900 2154586 2139852 2135216 2116367 2137561 2136683 2121277 2131376
15571 2131376 2123425 2144484 2136342 2098300 2116882 2118424 2120699 2110571 2110764 2122285 2090682 2117802
15559 2117802 2133804 2128003 2129476 2167149 2169356 2144238 2152259 2126919 2121395 2115163 2087947 2093529 2136156
15546 2136156 2116536 2116844 2132552 2121270 2113992 2111081 2128250 2112326 2119809 2150520 2118573 2098716
15534 2098716 2087853 2112193 2127897 2118022 2126684 2151685 2121217 2138768 2160393 2141494 2158944 2154146
15522 2154146 2154108 2135225 2097838 2075365 2121232 2153405 2158019 2126721 2126739 2102196 2121655 2159600 2166830
15509 2166830 2135850 2116205 2126877 2126109 2135553 2111962 2096477 2130132 2149004 2174105 2158674 2129093
15497 2129093 2135163 2152390 2139172 2154429 2144178 2150726 2134111 2118914 2117610 2145371 2168096 2155811
15485 2155811 2154192 2151390 2160014 2176515 2175682 2165414 2150147 2143628 2149714 2123981 2170503 2174838 2160378
15472 2160378 2124593 2126638 2130656 2132961 2124185 2134635 2137551 2120580 2146219 2177131 2161226 2157038
15460 2157038 2166595 2164696 2148638 2137400 2131495 2147161 2166431 2146800 2104460 2158906 2220364 2211652
15448 2211652 2207852 2198661 2177082 2178017 2169546 2162280 2140004 2149195 2174431 2165514 2169001 2123216 2116731
15435 2116731 2108847 2146047 2160461 2172711 2152868 2163367 2166081 2140730 2189963 2204991 2176356 2181014
15423 2181014 2141675 2150907 2167395 2145556 2150702 2154599 2146892 2116280 2134816 2128204 2131797 2169749
15411 2169749 2184662 2169807 2147272 2166954 2193502 2137725 2123838 2135735 2150615 2149646 2176812 2169635
15399 2169635 2168932 2178345 2140353 2170552 2192572 2155961 2162850 2120121 2161806 2169112 2178383 2230873
15387 2230873 2210394 2155180 2143190 2142114 2084691 2104439 2135347 2163160 2166036 2191274 2187969 2177472
15375 2177472 2190654 2186410 2152718 2151058 2163108 2162680 2210240 2217966 2185059 2156774 2166394 2212771
15363 2212771 2231703 2211040 2190685 2180183 2173626 2161124 2146431 2120108 2143014 2164474 2148359
15352 2148359 2169229 2167226 2189955 2176421 2171709 2172736 2163784 2159687 2167834 2187797 2244915 2207733
15340 2207733 2157009 2157695 2138351 2126475 2138747 2134611 2150966 2147421 2149198 2198910 2210408 2203217
15328 2203217 2177324 2185305 2166677 2179798 2199754 2169258 2171485 2176605 2180368 2158339 2145390 2161605
15316 2161605 2150756 2168488 2207318 2198250 2187428 2199934 2173899 2177506 2143531 2133930 2184654 2197666
15304 2197666 2179902 2170914 2163495 2166715 2164356 2186536 2169222 2148186 2182848 2176851 2174824 2177664 2187965
15291 2187965 2191245 2180026 2160201 2209519 2210795 2176384 2191726 2170719 2164054 2188086 2206808 2199862
15279 2199862 2201403 2167947 2198003 2190076 2164451 2187507 2202881 2196030 2185662 2236668 2223712 2180173
15267 2180173 2144072 2169940 2196596 2194040 2199166 2193140 2152774 2194090 2201801 2197583 2194201 2202287 2204294
15254 2204294 2211803 2227777 2169884 2147734 2132718 2174208 2212778 2207568 2189926 2193775 2194766 2203060
15242 2203060 2187445 2190649 2193232 2223604 2232738 2196139 2188339 2228879 2219637 2195389 2187817 2174674
15230 2174674 2217551 2239383 2231179 2233319 2205346 2228695 2202495 2194998 2198487 2194453 2196315 2192632 2190443
15217 2190443 2197101 2204011 2204318 2187349 2175117 2211884 2220325 2192125 2189606 2239739 2230067 2207669 2202621
15204 2202621 2238455 2218326 2198838 2215636 2255182 2238223 2236112 2249845 2222034 2225727 2217150 2235148
15192 2235148 2208034 2157959 2202060 2212820 2213944 2241178 2216265 2227380 2249676 2231417 2241126 2242943
15180 2242943 2238164 2215872 2249403 2246934 2211904 2210351 2215284 2245033 2220910 2201485 2235347 2204594
15168 2204594 2188520 2200255 2185466 2172307 2224801 2231473 2221660 2208526 2182241 2195826 2184338 2201349
15156 2201349 2214024 2203777 2213636 2201396 2211732 2231316 2223882 2206377 2235051 2233246 2197374 2168295
15144 2168295 2192949 2205843 2212440 2233158 2230095 2229696 2223958 2232119 2243029 2234797 2215890 2208298 2244080
15131 2244080 2250088 2234757 2213370 2215274 2232084 2210389 2201444 2221079 2252010 2213429 2222020 2220560
15119 2220560 2220658 2219022 2222107 2232026 2229017 2232451 2210322 2214056 2175210 2178270 2208903 2187796 2228514
15106 2228514 2227181 2225271 2227700 2210353 2210775 2250448 2248634 2239999 2233286 2255893 2251521 2246993 2251381
15093 2251381 2229003 2214220 2243931 2223728 2209758 2205157 2207699 2240620 2250989 2237063 2268185 2239722
15081 2239722 2248817 2263561 2236968 2239691 2272788 2275114 2239519 2238819 2251238 2228211 2228048 2231461 2229207
15068 2229207 2236786 2225996 2213758 2224007 2239408 2257491 2280022 2256741 2248703 2236867 2244763 2230445
15056 2230445 2223773 2235502 2251139 2238737 2228459 2238698 2241825 2215915 2198457 2210682 2238055 2230999
15044 2230999 2229687 2223908 2214711 2217057 2246743 2300492 2291368 2279225 2278581 2235861 2259468 2243774 2225010
15031 2225010 2237775 2245874 2269726 2232346 2225232 2237380 2251752 2278726 2261363 2233859 2259163 2289095
15019 2289095 2263431 2242531 2242853 2262539 2256456 2284809 2251213 2261104 2275879 2234162 2261830 2281250
15007 2281250 2296244 2283671 2294632 2306457 2274137 2277977 2264351 2231972 2250555 2247600 2238837 2242718
14995 2242718 2245716 2252603 2263959 2267717 2250011 2276177 2261098 2277665 2264516 2273192 2265385 2268712
14983 2268712 2236631 2240989 2254653 2247921 2258600 2232980 2264129 2285799 2242256 2232526 2267651 2308223
14971 2308223 2287794 2273198 2249208 2251286 2265043 2300553 2321811 2329586 2328208 2301455 2293288 2277718
14959 2277718 2278168 2269459 2294253 2296941 2318297 2298106 2294599 2288313 2315634 2294769 2300604 2279800 2276086
14946 2276086 2286841 2277661 2273609 2295272 2280273 2292537 2293216 2262869 2275778 2266696 2279147 2260546
14934 2260546 2239022 2253321 2249531 2242820 2245685 2251452 2267704 2265915 2265704 2250833 2246726 2276518 2309867
14921 2309867 2329231 2284001 2272252 2289784 2285546 2311728 2305560 2294019 2285593 2284797 2292752 2242179
14909 2242179 2250948 2296404 2285431 2294462 2299301 2292373 2289143 2269234 2261891 2245597 2259319 2295915
14897 2295915 2282801 2250144 2271639 2288043 2275664 2269256 2284503 2271213 2293610 2311813 2320673 2301914
14885 2301914 2286960 2284236 2313123 2336441 2322422 2316487 2292919 2286924 2293156 2281912 2303155 2327652
14873 2327652 2302858 2311587 2305776 2311142 2303536 2311880 2301475 2283435 2290345 2292986 2274330 2288231 2293584
14860 2293584 2265579 2281692 2286578 2288642 2298615 2323860 2323757 2286395 2293679 2284492 2276258 2277237 2309761
14847 2309761 2291375 2314842 2315769 2283030 2262406 2261705 2293879 2271431 2293234 2269147 2307789 2270592
14835 2270592 2262517 2292732 2304145 2371303 2384257 2389168 2345544 2295040 2290228 2298617 2296285 2306736
14823 2306736 2308687 2318617 2343692 2319397 2302887 2315211 2290594 2282473 2298265 2297876 2310879 2322560
14811 2322560 2312551 2317471 2299008 2309581 2293751 2303041 2327644 2308393 2287388 2304733 2308915 2313192
14799 2313192 2307083 2307898 2300778 2287212 2292865 2321718 2311919 2298452 2313603 2363556 2378974 2326956
14787 2326956 2335633 2339721 2352388 2321425 2343658 2348337 2331402 2330653 2322691 2313148 2314928 2335537 2316061
14774 2316061 2323370 2324142 2325010 2332257 2366513 2366005 2362480 2346953 2316329 2299537 2306974 2334157 2358194
14761 2358194 2320071 2307574 2336807 2347667 2338705 2315726 2336911 2317064 2314789 2320969 2316668 2332411
14749 2332411 2339204 2325804 2336713 2345723 2358988 2347203 2335788 2348122 2345439 2341777 2326139 2351415
14737 2351415 2356786 2331170 2307119 2309052 2350931 2351338 2341680 2322776 2313931 2346293 2333865 2323363
14725 2323363 2329256 2334057 2375517 2329542 2328963 2312870 2272481 2292600 2306218 2326942 2344150 2340895
14713 2340895 2336925 2360727 2352182 2352626 2332488 2313839 2319811 2314175 2346618 2331535 2313980 2364360
14701 2364360 2366262 2333870 2330939 2338336 2356749 2362357 2365556 2361308 2354950 2377350 2350408 2333909 2327564
14688 2327564 2329495 2334408 2344894 2375567 2359812 2327834 2350485 2349472 2320037 2325504 2359305 2394279
14676 2394279 2381441 2340454 2357236 2387057 2374580 2403126 2367247 2330681 2339194 2374118 2378063 2358976
14664 2358976 2351550 2338123 2360506 2382766 2372611 2368470 2373291 2359630 2382930 2353557 2346961 2350058
14652 2350058 2357616 2376606 2365649 2327486 2305483 2344048 2340453 2352693 2324413 2340799 2342238 2327699
14640 2327699 2326782 2343492 2362563 2369662 2367921 2362525 2353990 2341867 2370435 2356644 2353404 2401633 2378202
14627 2378202 2362318 2384720 2382751 2356066 2348441 2358778 2358955 2375574 2357644 2344674 2330057 2362259
14615 2362259 2372258 2375308 2357111 2361996 2358676 2345579 2353696 2368729 2376663 2363405 2373559 2383984
14603 2383984 2386231 2390448 2395226 2379487 2379629 2378686 2387845 2387097 2403841 2408428 2386049 2354889 2346327 2358449
14589 2358449 2365963 2358932 2371439 2383052 2374925 2385023 2382817 2364853 2374884 2370273 2359387 2358619 2358835
14576 2358835 2369816 2384316 2369629 2358258 2383552 2384795 2380614 2377317 2384681 2374589 2381863 2396646
14564 2396646 2411173 2391043 2366939 2352022 2361467 2323173 2353922 2360026 2330245 2352016 2368503 2381242
14552 2381242 2407471 2376973 2371730 2362954 2328579 2368015 2361940 2374655 2390900 2391881 2380856 2411831
14540 2411831 2391307 2397710 2376363 2370725 2377463 2379926 2390829 2395228 2419512 2375770 2368452 2378668
14528 2378668 2415428 2372255 2364715 2391659 2384116 2369923 2367508 2397969 2425495 2419771 2392053 2397036
14516 2397036 2414688 2410614 2423597 2399027 2418315 2427177 2423145 2404252 2401522 2419517 2394108 2398502
14504 2398502 2421406 2402601 2402766 2448688 2416074 2444367 2406738 2382387 2410003 2413624 2395927 2367732
14492 2367732 2359312 2399193 2399812 2373205 2356063 2335657 2364331 2381128 2386944 2385307 2378219 2387235 2415604
14479 2415604 2406675 2388305 2437642 2440300 2403789 2399691 2428592 2392257 2398317 2428686 2435418 2420728
14467 2420728 2411826 2428326 2416720 2427041 2414119 2420317 2428522 2441066 2440834 2384810 2376030 2418494
14455 2418494 2424303 2427716 2441704 2437302 2405409 2393905 2407614 2421533 2429941 2422093 2446411 2442817
14443 2442817 2396188 2415127 2455545 2460444 2460701 2441167 2379873 2379367 2406319 2425631 2457267 2445928
14431 2445928 2443722 2445767 2437898 2434050 2451119 2454116 2423123 2399203 2352285 2398157 2446325 2445366 2427804
14418 2427804 2408291 2406392 2386615 2374423 2400614 2421910 2418004 2440009 2394124 2410514 2436813 2467845
14406 2467845 2478506 2465846 2482423 2483530 2479975 2475196 2468037 2472645 2468274 2457708 2425324 2426729 2396854
14393 2396854 2415042 2433883 2421314 2456995 2443905 2434449 2414493 2405598 2441125 2456071 2442137 2445700
14381 2445700 2373136 2377582 2411187 2415282 2424306 2406760 2385800 2399755 2424590 2445737 2426048 2422465
14369 2422465 2444575 2464654 2464388 2459039 2439585 2461909 2452907 2471976 2482326 2446444 2440840 2450272
14357 2450272 2438427 2431243 2466700 2466786 2437193 2439569 2443995 2431499 2459141 2491767 2464179 2441914
14345 2441914 2433212 2433953 2452938 2482061 2500602 2484648 2427734 2412625 2449114 2444933 2434756 2429862
14333 2429862 2445707 2433860 2461337 2468844 2468661 2415670 2423564 2444807 2434367 2434912 2444534 2444402 2482754
14320 2482754 2474674 2485852 2474708 2442883 2451575 2460486 2438690 2449916 2441643 2445331 2493024 2471607
14308 2471607 2444351 2456456 2477597 2475748 2484154 2474084 2474780 2460825 2456033 2439381 2430556 2410769
14296 2410769 2420273 2449921 2455126 2444770 2445268 2458061 2442344 2450965 2435632 2414849 2450406 2454758
14284 2454758 2495683 2504049 2505872 2512413 2482198 2469597 2452351 2440326 2464669 2439644 2437158 2467185
14272 2467185 2473179 2469890 2440183 2445626 2467599 2435453 2459473 2456776 2498972 2469024 2463513 2483115
14260 2483115 2497358 2518505 2510019 2495949 2454524 2444099 2461993 2464247 2468043 2442749 2443421 2440311
14248 2440311 2454411 2487721 2485980 2491052 2448184 2439144 2477938 2458994 2459815 2484853 2436945 2454762
14236 2454762 2514878 2528481 2454576 2454586 2459391 2447809 2451785 2457872 2468180 2494682 2485683 2471065 2483925
14223 2483925 2489189 2486467 2483209 2482977 2469808 2477489 2481447 2461855 2460369 2482822 2486243 2498973 2499648
14210 2499648 2469204 2460989 2509988 2520553 2460854 2438612 2456259 2509744 2480264 2482079 2494489 2485564
14198 2485564 2452158 2477347 2515937 2484408 2472291 2531313 2530765 2532703 2514467 2527848 2523927 2484691
14186 2484691 2449353 2454590 2492502 2471761 2482344 2477786 2489734 2488496 2478307 2504222 2507112 2487178
14174 2487178 2488309 2471817 2466279 2472657 2469018 2470696 2475264 2483923 2522986 2474956 2485407 2522112 2506158
14161 2506158 2513823 2531394 2508375 2487779 2480571 2462023 2495541 2489150 2496289 2484545 2523665 2523264
14149 2523264 2536816 2503369 2484201 2522389 2511211 2532654 2511662 2508238 2486676 2457509 2479968
14138 2479968 2465624 2447022 2491382 2507765 2506217 2535621 2535077 2520745 2504360 2497497 2495795 2494384
14126 2494384 2515258 2543142 2542230 2539482 2531322 2500460 2496399 2502465 2465065 2496414 2533820 2549724
14114 2549724 2548118 2544821 2546358 2509079 2499984 2497680 2520281 2515896 2504884 2465037 2511329 2505433 2532752
14101 2532752 2527047 2536838 2531019 2523709 2510208 2498649 2507057 2492455 2469760 2511339 2512318 2511820 2534131
14088 2534131 2570896 2547750 2549085 2524167 2512554 2513006 2542104 2539255 2509714 2540414 2539215 2543496
14076 2543496 2511579 2503965 2537451 2540793 2563038 2558639 2534195 2533274 2523754 2513899 2503951 2531340 2526023
14063 2526023 2523712 2522010 2501599 2527206 2542653 2509214 2534961 2518242 2542292 2522861 2499482 2532128
14051 2532128 2544518 2541043 2571810 2551916 2552136 2557018 2565430 2550726 2533879 2560578 2575912 2550873
14039 2550873 2532144 2504033 2509376 2526644 2518905 2527470 2552879 2531523 2506783 2527259 2522827 2528094
14027 2528094 2570306 2565288 2549907 2565701 2564792 2543119 2511882 2547125 2569361 2565043 2577934 2593324
14015 2593324 2607917 2567229 2594792 2575583 2525229 2522126 2553629 2547160 2520984 2527727 2542557 2554314
14003 2554314 2557592 2570464 2583459 2556387 2521305 2527942 2511767 2530802 2583009 2578000 2587828 2549828
13991 2549828 2566516 2534010 2498568 2524442 2560451 2577194 2559612 2544139 2527639 2521908 2541635
13980 2541635 2563590 2567729 2558095 2596668 2580916 2526016 2549565 2560565 2559713 2512205 2497583 2515820
13968 2515820 2567450 2593092 2555762 2521316 2544127 2525668 2518928 2538156 2570646 2562720 2546993 2533461
13956 2533461 2527540 2528488 2549412 2547072 2545852 2569070 2589469 2597526 2578705 2598375 2612141 2581059
13944 2581059 2549280 2542101 2529304 2529048 2562242 2544326 2575865 2573804 2569914 2567204 2554806 2575531
13932 2575531 2560075 2564951 2540786 2543344 2587722 2577584 2578996 2570061 2574158 2565317 2551148 2562417
13920 2562417 2580116 2583214 2566048 2579831 2594255 2571233 2564026 2580963 2565548 2594497 2575680 2577105
13908 2577105 2599369 2586103 2577100 2553163 2608512 2633255 2622519 2582453 2557172 2579006 2582595 2585737
13896 2585737 2577990 2589978 2576548 2566790 2596750 2598094 2555218 2580794 2599619 2552999 2554978 2565202
13884 2565202 2594259 2608090 2613787 2623799 2614122 2606739 2607684 2608454 2623608 2632220 2627104 2571642 2534418
13871 2534418 2584022 2605165 2602537 2611968 2590645 2591743 2612110 2636040 2594109 2573975 2591200 2601205
13859 2601205 2583660 2615078 2594710 2614028 2632942 2590799 2599329 2618448 2639367 2612099 2624831
13848 2624831 2560373 2572559 2570994 2576785 2562290 2555571 2591443 2609656 2608307 2591640 2585145 2605350
13836 2605350 2608320 2599055 2569317 2573234 2585537 2563168 2572367 2570977 2587031 2587284 2613969 2609545 2608833
13823 2608833 2587055 2593357 2593124 2588278 2579024 2575596 2602618 2597151 2601257 2619234 2626252 2626464 2651513
13810 2651513 2628178 2605508 2609764 2600278 2615112 2603531 2645893 2635551 2604385 2626876 2630706 2638831
13798 2638831 2635673 2633932 2618931 2631122 2635924 2604697 2564198 2582094 2591460 2610631 2585093 2587144
13786 2587144 2604346 2610280 2612989 2637261 2655161 2652826 2643643 2624216 2559206 2564783 2587317 2580943
13774 2580943 2586858 2594804 2623539 2649278 2656156 2633793 2614419 2625899 2604928 2602857 2633522 2638731
13762 2638731 2611058 2577216 2547108 2533602 2574342 2611752 2605277 2607464 2628748 2617268 2631898 2637607
13750 2637607 2605440 2606436 2628061 2634159 2624775 2640383 2628164 2617894 2621008 2641904 2600759 2600250 2619937
13737 2619937 2617456 2629249 2588602 2606565 2622913 2591986 2618202 2622428 2645176 2673254 2603474 2591604
$$ [...]
##END NTUPLES=NMR SPECTRUM
##END=
