##TITLE=1H_DE-80H_X3
 200.13MHz, d2o
 8 sc
 
 19ns.26.2.2025
##JCAMPDX= 6.0         $$ Bruker NMR JCAMP-DX V2.0
##DATA TYPE= NMR SPECTRUM
##DATA CLASS= NTUPLES
##ORIGIN= UXNMR, Bruker Analytische Messtechnik GmbH
##OWNER= pz
$$ XWIN-NMR		Version 3.5
$$ Tue Dec  9 10:52:10 2025 Russian Standard Time (UT+4h)  Yarkov@DPX200
##.OBSERVE FREQUENCY= 200.1313
##.OBSERVE NUCLEUS= ^1H
##.ACQUISITION MODE= SIMULTANEOUS
##.ACQUISITION SCHEME= undefined
##.AVERAGES= 8
##.DIGITISER RES= 18
##SPECTROMETER/DATA SYSTEM= spect
##.PULSE SEQUENCE= zg30
##.SOLVENT NAME= CDCl3
##.SHIFT REFERENCE= (INTERNAL, CDCl3, 0, 15.4902)
##AUDIT TRAIL= $$ (NUMBER, WHEN, WHO, WHERE, WHAT)
$$ ##TITLE= Audit trail, XWIN-NMR		Version 3.5
$$ ##JCAMPDX= 5.01
$$ ##ORIGIN= Bruker BioSpin GmbH
$$ ##OWNER= Yarkov
$$ C:/Bruker/XWIN-NMR/data/yarkov2/nmr/H-C/1/pdata/1/auditp.txt
$$ ##AUDIT TRAIL=  $$ (NUMBER, WHEN, WHO, WHERE, WHAT)
(   1,<2025-12-09 10:50:50.45 +0400>,<Yarkov>,<DPX200>,
      <created by zg, POWCHK disabled, PULCHK disabled
       configuration hash MD5:
       00 E9 B6 7A A2 85 ED C7 34 08 36 98 17 FE 4E 26
       data hash MD5: 16K
       98 06 80 F5 F4 1D 62 F9 B8 C0 5B F9 C5 5A 2D AA>)
(   2,<2025-12-09 10:50:53.90 +0400>,<Yarkov>,<DPX200>,
      <Start of raw data processing
       efp BC_mod = 2 LB = 0.25 FT_mod = 6 PKNL = 1 PHC0 = -5294.812 PHC1 = -5.578082 SI = 16K 
       data hash MD5: 16K
       60 38 33 13 8B 1F 8A E2 CA F9 38 90 3F 26 A5 09>)
(   3,<2025-12-09 10:50:57.96 +0400>,<Yarkov>,<DPX200>,
      <abs ABSG = 5 
       data hash MD5: 16K
       14 B3 41 6A 97 89 22 86 9F C5 80 74 24 24 39 7A>)
(   4,<2025-12-09 10:51:23.14 +0400>,<Yarkov>,<DPX200>,
      <pk PHC0 = -15.23819 PHC1 = 30.40001 
       data hash MD5: 16K
       1E 28 C2 65 A7 0A A8 12 49 7C 8A F4 7B 14 80 A9>)
(   5,<2025-12-09 10:51:25.59 +0400>,<Yarkov>,<DPX200>,
      <abs ABSG = 5 
       data hash MD5: 16K
       5F BE 80 CB 20 85 2E 2E 21 03 8D 39 F7 23 11 E3>)
(   6,<2025-12-09 10:51:39.84 +0400>,<Yarkov>,<DPX200>,
      <pk PHC0 = 3.966687 PHC1 = -6.999999 
       data hash MD5: 16K
       F6 7A 63 81 42 1D F6 71 35 ED C1 1F 09 22 9D 63>)
$$ ##END=
$$ 
$$ hash MD5
$$ 6F 4B D0 DC 2A F7 22 83 69 E6 74 8D 29 67 46 9A
##$RELAX= 
##$RELAX= 
##$RELAX= 
##$RELAX= 
##$RELAX= 
##$RELAX= 
$$ Bruker specific parameters
$$ --------------------------
##$DU= <C:/Bruker/XWIN-NMR>
##$EXPNO= 1
##$NAME= <H-C>
##$PROCNO= 1
##$TYPE= <nmr>
##$USER= <yarkov2>
##$AMP= (0..31)
100 100 100 100 100 100 100 100 100 100 100 100 100 100 100 100 100 100 
100 100 100 100 100 100 100 100 100 100 100 100 100 100 
##$AQSEQ= 0
##$AQ_mod= 1
##$AUNM= <au_zg>
##$AUTOPOS= <>
##$BF1= 200.13
##$BF2= 200.13
##$BF3= 200.13
##$BF4= 200.13
##$BF5= 200.13
##$BF6= 200.13
##$BF7= 200.13
##$BF8= 200.13
##$BYTORDA= 1
##$CFDGTYP= 0
##$CFRGTYP= 5
##$CHEMSTR= <none>
##$CNST= (0..31)
1 1 145 1 1 1 1 1 1 1 1 1 1 1 1 1 1 1 1 1 1 1 1 1 1 1 1 1 1 1 1 1 
##$CPDPRG= <>
##$CPDPRG1= <>
##$CPDPRG2= <>
##$CPDPRG3= <>
##$CPDPRG4= <mlev>
$$ [...]
##$SUBNAM3= <"">
##$SUBNAM4= <"">
##$SUBNAM5= <"">
##$SUBNAM6= <"">
##$SUBNAM7= <"">
##$SUBNAM8= <"">
##$SUBNAM9= <"">
##$SW= 18.0517328524113
##$SWIBOX= (0..15)
0 0 2 0 0 0 0 0 0 0 0 0 0 0 0 0 
##$SW_h= 3612.71676300578
##$TD= 16384
##$TD0= 1
##$TE= 0
##$TE2= 300
##$TE3= 300
##$TEG= 300
##$TL= (0..7)
0 120 120 120 120 120 120 120 
##$TP= (0..7)
150 150 150 150 150 150 150 150 
##$TP07= 0
##$TPNAME0= <>
##$TPNAME1= <>
##$TPNAME2= <>
##$TPNAME3= <>
##$TPNAME4= <>
##$TPNAME5= <>
##$TPNAME6= <>
##$TPNAME7= <>
##$TPOAL= (0..7)
0.5 0.5 0.5 0.5 0.5 0.5 0.5 0.5 
##$TPOFFS= (0..7)
0 0 0 0 0 0 0 0 
##$TUNHIN= 0
##$TUNHOUT= 0
##$TUNXOUT= 0
##$USERA1= <user>
##$USERA2= <user>
##$USERA3= <user>
##$USERA4= <user>
##$USERA5= <user>
##$V9= 5
##$VALIST= <valist>
##$VCLIST= <CCCCCCCCCCCCCCC>
##$VD= 0
##$VDLIST= <DDDDDDDDDDDDDDD>
##$VPLIST= <PPPPPPPPPPPPPPP>
##$VTLIST= <TTTTTTTTTTTTTTT>
##$WBST= 1024
##$WBSW= 4
##$XGAIN= (0..3)
0 0 0 0 
##$XL= 0
##$YL= 0
##$YMAX_a= 259173
##$YMIN_a= -187052
##$ZGOPTNS= <>
##$ZL1= 120
##$ZL2= 120
##$ZL3= 120
##$ZL4= 120
##$ABSF1= 15.51882
##$ABSF2= -2.53303
##$ABSG= 5
##$ABSL= 3
##$ALPHA= 0
##$AQORDER= 0
##$ASSFAC= 0
##$ASSFACI= 0
##$ASSFACX= 0
##$ASSWID= 0
##$AUNMP= <proc_1d>
##$AZFE= 0.1
##$AZFW= 0.1
##$BCFW= 0
##$BC_mod= 2
##$BYTORDP= 0
##$COROFFS= 0
##$CY= -3
##$DATMOD= 1
##$DC= 0
##$DFILT= <>
##$DTYPP= 0
##$F1P= 0
##$F2P= 0
##$FCOR= 1
##$FTSIZE= 16384
##$FT_mod= 6
##$GAMMA= 0
##$GB= 0
##$INTBC= 1
##$INTSCL= 3.241238e-09
##$ISEN= 128
##$LB= 0.25
##$LEV0= 0
##$LPBIN= 0
##$MAXI= 10000
##$MC2= 0
##$MEAN= 0
##$ME_mod= 0
##$MI= 1.114404
##$NCOEF= 0
##$NC_proc= -7
##$NLEV= 6
##$NOISF1= 3.799351
##$NOISF2= 2.8
##$NSP= 0
##$NTH_PI= 0
##$NZP= 0
##$OFFSET= 15.49017
##$PC= 1
##$PHC0= -5306.083
##$PHC1= 17.82193
##$PH_mod= 1
##$PKNL= yes
##$PPARMOD= 0
##$PSCAL= 0
##$PSIGN= 0
##$REVERSE= no
##$SF= 200.130006310073
##$SI= 16384
##$SIGF1= 3
##$SIGF2= 2
##$SINO= 0.751879
##$SIOLD= 32768
##$SREGLST= <19F.Aceton>
##$SSB= 0
##$STSI= 16384
##$STSR= 0
##$SW_p= 3612.71676300578
##$SYMM= 0
##$S_DEV= 0
##$TDeff= 16384
##$TDoff= 0
##$TI= <>
##$TILT= no
##$TM1= 0
##$TM2= 0
##$TOPLEV= 0
##$USERP1= <user>
##$USERP2= <user>
##$USERP3= <user>
##$USERP4= <user>
##$USERP5= <user>
##$WDW= 1
##$XDIM= 16384
##$YMAX_p= 444134967
##$YMIN_p= -813717
$$ End of Bruker specific parameters
$$ ---------------------------------
##NTUPLES= NMR SPECTRUM
##VAR_NAME=  FREQUENCY,     SPECTRUM/REAL,   SPECTRUM/IMAG
##SYMBOL=    X,             R,               I
##VAR_TYPE=  INDEPENDENT,   DEPENDENT,       DEPENDENT
##VAR_FORM=  AFFN,          ASDF,            ASDF
##VAR_DIM=   16384,         16384,           16384
##UNITS=     HZ,            ARBITRARY UNITS, ARBITRARY UNITS
##FACTOR=    0.220516191357247, 1,           1
##FIRST=     3100.04772481167, 0,            0
##LAST=      -512.669038194114, 0,           0
##MIN=       -512.669038194114, -813717,     0
##MAX=       3100.04772481167, 444134967,    0
$$ Real data points
##PAGE= N=1
##DATA TABLE= (X++(R..R)), XYDATA
$$ [...]
7176C414662J7972K0892J5933o7017M214j13522J3549n767n0152q5281j37558
7165C027925j15305j3823J66068j7675j3709L0707j83046j7305k2825P839L938
7154B852789j28788j10026p1963R4245o5627m3318r2738n3442J7591n1143J14816
7143B462396n9021q9130k1865l5686k7593P2274J1247Q7382p8939J118j02284
7132B219899j976j07939j6226J13970l6769n5396m6100R7726m2652J1731j24559
7121B011709j53900J58375L2181j95901l6257K0494r930R5842j600p3206k2901
7110A824906m4866M1605l6947K7904j03909o0379j3786l9579J17197O4396j4895
7099A761647j24016j36610l5764O6844P940J3430K8787q1908l3278k21540P8159
$$ plain form
7176 3414662 3432634 3453526 3469459 3402442 3406656 3293134 3306683 3300916 3250764 3165483 3027925
7165 3027925 2912620 2898797 3064865 3047190 3033481 3064188 2881142 2863837 2841012 2848851 2852789
7154 2852789 2724001 2613975 2542012 2636257 2570630 2527312 2434574 2381132 2398723 2347580 2462396
7143 2462396 2403375 2314245 2292380 2256694 2229101 2301375 2312622 2400004 2321065 2322183 2219899
7132 2219899 2217923 2109984 2093758 2207728 2170959 2115563 2069463 2167189 2124537 2136268 2011709
7121 2011709 1857809 2016184 2048365 1852464 1816207 1836701 1826771 1922613 1921013 1847807 1824906
7110 1824906 1780040 1821645 1784698 1812602 1708693 1648314 1634528 1594949 1712146 1776542 1761647
7099 1761647 1637631 1501021 1465257 1532101 1540041 1553471 1582258 1500350 1467072 1245532 1323691
7088A323691J88242O132j78309q2014M0926J39830L8888j07599n5162O5404j45421
7077A234608M4433M8145m8910m4827J64959n5877r5744j41965J04905j671o3779
7066A144277n4885l0864l3592K6306k6009K4243P2481J91475P7663j47782l0050
7055A213263j48235o4309O7393Q2966j07813j37551O8285J07038l8290q6215m3248
7044I13284N0382q8346p9192Q4549J24008m6989o2167J85838P5870j90375j08864
7033H57998n6062P5579P1857j05622O9886J75149k05350r7410j16079L0366L72
7022G00684rQ4420O9077j08692j2440j715k2477m5358L0315q8116r853n6024J81229
7009G21041J526q8872j40805m4313N514R7816J1041n30O0504J4248j23544j29567
$$ plain form
7088 1323691 1511933 1518065 1339756 1257742 1298668 1438498 1477386 1369787 1314625 1380029 1234608
7077 1234608 1279041 1327186 1278276 1233449 1398408 1342531 1246787 1104822 1209727 1208056 1144277
7066 1144277 1089392 1058528 1024936 1051242 1025233 1049476 1121957 1313432 1391095 1243313 1213263
7055 1213263 1065028 1000719 1068112 1151078 1043265 905714 973999 1081037 1042747 956532 913284
7044 913284 963666 875320 796128 880677 1004685 957696 895529 1081367 1157237 966862 857998
7033 857998 801936 877515 949372 843750 913636 1088785 883435 786025 669946 700312 700684
7022 700684 700675 785095 854172 745480 733040 731325 708848 663490 693805 605689 595836 539812 721041
7009 721041 722567 633695 492890 448577 454091 551907 562948 562418 622922 637170 513626 384059
6997C84059J14856J08398j4287r6439P751k02O210r5589k3632n1417J65894j6523
6985D89079m9813m3817j2541J2154q8135J78675R124j15550j1331P7211n8116
6974C86940O713o211J5294j6642k4095n1040J8778O0750r273L2173k1190j08995
6962B83202L4029L2588O1894K4567n1449q1798o7207L255j624P3016j04259K9002
6950B35216O8635P674J1558j32760O6908N3351j56895K4083m7234K0681o525N0681
6938A95373p541n0348j1983K2068o0275N0665Q9020M3695q6872O3105j1024j69176
6926F6707q2221O0041J34221l3859j16437J61008J28437j13065q3059J16028O667
6915B44468j09129l8369M285R199J53768M6106o9377r4856n3582N3484J3726q0373
$$ plain form
6997 384059 498915 607313 593026 496587 504338 504136 510346 414757 391125 339708 505602 489079
6985 489079 439266 395449 382908 395062 306927 485602 494726 379176 367845 445056 386940
6974 386940 393653 387442 402736 386094 361999 310959 329737 390487 381214 413387 392197 283202
6962 283202 317231 349819 411713 436280 384831 303033 235826 239081 237457 310473 206214 235216
6950 235216 303851 311525 323083 190323 257231 310582 153687 177770 130536 151217 144692 195373
6938 195373 187832 137484 125501 147569 87294 137959 226979 270674 183802 246907 235883 66707
6926 66707 -15514 44527 178748 144889 28452 189460 317897 204832 121773 237801 244468
6915 244468 135339 96970 101255 110454 264222 310328 240951 146095 92513 145997 159723 79350
6903G9350n228m449O1368K7880O212J5767j0711k6523j50863l855J29200O0278
6891A78426j51016K3803j3373L1286k3285Q662N9928M7264L0412n8879M42J2880
6879A46550p1998P113R9621o0272n6717l2722O0305p616o9947L5272K05724m0811
6867B14502j10047M1462K3733m023J9014R0567J5107J12896r5258q3370L9710
6856B64293M0806m8906o5548M2189j42987m2642J09209m1086n680k9092O8709
6845A49265M7309J867p1261j24848O3815o2574J8041k3879L7829R0496j18487
6834G573k2235R2892q8317N9935l3883k2549J76988j1393r2649m1327L2771j02080
6822d4274O3018J19251P9908p9051j17815k8079M9892Q4383O5736r2552M7627
$$ plain form
6903 79350 74122 69673 131041 158921 165133 180900 170189 143666 -7197 -11052 118148 178426
6891 178426 27410 51213 37840 69126 45841 54503 114431 161695 192107 133228 133670 146550
6879 146550 74552 81665 181286 121014 64297 31575 91880 84264 14317 49589 255313 214502
6867 214502 104455 145917 169650 165627 184641 275208 290315 403211 307953 224583 264293
6856 264293 305099 256193 190645 232834 89847 47205 156414 115328 109648 80556 149265
6845 149265 196574 198441 127180 2332 66147 3573 21614 -2265 35564 126060 7573
6834 7573 -14662 78230 -10087 49848 15965 -6584 170404 159011 66362 25035 57806 -44274
6822 -44274 18744 137995 217903 138852 21037 -7042 42850 127233 192969 100417 148044
6811A48044q1703m4003m1882M6402j3460n9892p6123J2859J39277l3900Q6110
6800H1729j17142o2406p0405M9394O4100J03133j81159n6656m6473p7781O3631
6789b50035R1936j34J79216l2351l02959Q8707l1993J13175m3911J02013M7872
6778c8464j08254k2775O1313q1699P6944P2442j08260R254N129J6956R7232k604
6766b2786k3733j64498r4947R0653O5311M3261m7420Q9497q9628J5247l7959l0968
6754b07970Q6419N1339J4592j02199k7355m5119N991O968Q664k2526m1964J42169
6742a30991O777p098n0345J30597j43386m2063J20181l1122l5461O690L8562j2963
6730a50622j02858o745P4406K6779O8127q7479n4220J87196J12395n8123K9371
$$ plain form
6811 148044 66341 22338 -19544 26858 13398 -46494 -122617 -109758 29519 -4381 81729
6800 81729 -35413 -97819 -168224 -118830 -54730 48403 -132756 -189412 -235885 -313666 -250035
6789 -250035 -158099 -158233 20983 -11368 -314327 -225620 -257613 -144438 -188349 -86336 -38464
6778 -38464 -146718 -169493 -108180 -189879 -112935 -40493 -148753 -139499 -134370 -117414 -20182 -22786
6766 -22786 -46519 -211017 -305964 -215311 -150000 -106739 -154159 -64662 -154290 -139043 -177002 -207970
6754 -207970 -121551 -70212 -55620 -157819 -185174 -230293 -224302 -217334 -208670 -231196 -273160 -130991
6742 -130991 -124214 -131312 -181657 -51060 -194446 -236509 -116328 -147450 -182911 -176221 -137659 -150622
6730 -150622 -253480 -260225 -185819 -159040 -90913 -178392 -232612 -45416 66979 8856 38227
6719C8227l7023p8931q6624r0159N5421n0659k3805J97794p3956O4800K0169r634
6707g4380j74515M5627Q1739q5489J35710M1306j65511m0581q0229J05273K23326
6696A2276j58756N0293n5097j3818K12733k8104j32395j60141J39791K02970m737
6685F5015j01254J1888j7141m524J54781n0735J7647J35352r6446p1115j8503
6674B4965p0051Q6241R1125J7748J4914l2391j8125M079o715J9977j9713o3521
6662D8533O7624L4717N0873J642j012j4630J16135K1547L675M390l4661j60004
6650A38829j2565L11491q6489J41255j92222P0745L1011j36873J26298o9204Q2209
6639D04485p7884q3219K2335J59271J1574P060K1413k29421P0586M4049j2628
$$ plain form
6719 38227 1204 -77727 -164351 -254510 -199089 -249748 -273553 -75759 -149715 -84915 -64746 -74380
6707 -74380 -248895 -203268 -121529 -207018 -71308 -30002 -195513 -236094 -316323 -211050 12276
6696 12276 -146480 -96187 -151284 -165102 47631 19527 -112868 -273009 -133218 69752 65015
6685 65015 -36239 -24351 -41492 -46016 108765 58030 75677 211029 114583 43468 24965
6674 24965 -45086 41155 132280 150028 164942 132551 114426 118505 111790 131767 112054 48533
6662 48533 116157 150874 201747 203389 202377 187747 303882 325429 329104 333494 298833 138829
6650 138829 126264 437755 351266 492521 300299 371044 402055 265182 391480 322276 404485
6639 404485 326601 243382 265717 424988 436562 443622 465035 235614 306200 350249 337621
6628C37621q0035j32430N5029J46800j6539n1857P4161Q7858R370Q5771R2106
6617F07855n5563j23628L0029O1396J14992L0626L5542J9975k3939n242L9230
6606G31273L2952q6705o9356R6835m0538o7187M3117J1517J54649J50280j70674
6595G86163M6769N1910J07145M6838o6982p4130m3321O3491J5990J14999O6688
6584A115560q4689m0194J11004J63961J33667o9393j0745J61595J35089L2698
6574A648553q5632k521J70030K49093l7751O8137O5107N197L27320J29500K69540
6563B806573O5525L10848L54742K61660J07522J32375O7173P9250k82212k49826
6553C653630r0449R7290M8990Q8307N1122J54559P6279j01519J32348K55326M4513
$$ plain form
6628 337621 257586 125156 180185 326985 310446 258589 332750 420608 429978 515749 607855
6617 607855 552292 428664 458693 520089 635081 665707 701249 721224 697285 692043 731273
6606 731273 764225 677520 608164 704999 664461 597274 640391 651908 806557 956837 786163
6595 786163 832932 884842 991987 1038825 971843 897713 854392 917883 933873 1048872 1115560
6584 1115560 1030871 990677 1101681 1265642 1399309 1329916 1319171 1480766 1615855 1648553
6574 1648553 1562921 1560400 1730430 1979523 1941772 2009909 2075016 2080213 2407533 2537033 2806573
6563 2806573 2872098 3182946 3537688 3799348 3906870 4039245 4106418 4185668 3903456 3653630
6553 3653630 3563181 3660471 3709461 3797768 3848890 4003449 4079728 3978209 4110557 4365883 4410396
6542D410396J65425J01240p302J54942J32321K00280J43800J57824J72766L60412
6532E992104K87680M62924K90516L32073L49158M08210L66980J83612M10770K76632
6522I360659M20401K60411L01079K99050K416N6415k01341m60034j50839k77399
6512I610818l46301k49743m70597l02813l43006k09254n47257l09966k33820j95861
6502F402200k74856k55603k87255j99665Q6006M5012k33355j29065j64669l1952
6492D956798O0963O776j6140j66393J06316J00333Q5886Q817K6279J26986M8296
6481E344917R8280N6383J35506J25802J01760p1634j09423k60138j97853J21655
6471E345255q098n7779j21297j35127k21613j20892j06276k00096j18369m1000
$$ plain form
6542 4410396 4575821 4677061 4669759 4824701 4957022 5157302 5301102 5458926 5631692 5992104
6532 5992104 6279784 6742708 7033224 7365297 7714455 8122665 8489645 8673257 9084027 9360659
6522 9360659 9781060 10041471 10342550 10641600 10644016 10700431 10499090 10039056 9888217 9610818
6512 9610818 9264517 9014774 8544177 8241364 7898358 7689104 7141847 6831881 6598061 6402200
6502 6402200 6127344 5871741 5584486 5384821 5470827 5515839 5282484 5153419 4988750 4956798
6492 4956798 5017761 5024537 5008397 4842004 4948320 5048653 5134539 5143356 5169635 5296621 5344917
6481 5344917 5443197 5499580 5635086 5760888 5862648 5791014 5681591 5421453 5223600 5345255
6471 5345255 5337157 5279378 5158081 5022954 4801341 4680449 4574173 4374077 4255708 4214708
6461D214708l58207k4053j48410k25976N931Q950J5630M8424k9506o1767j79882
6450C265842J34307m7092j46661M0338q1522j19744k4327o5383L4677K20180J27329
6439C337944m0773l08014K1042m3430j9025Q6853N5824K2169j23081M6543P5830
6428C111882k8039P2214p6169p5988Q9372O7641M8420l2367O11J06937P592m3244
6416C248862K9066N9893m9381L0306P5765L2565r3978M1041R0429K514k9560N9987
6404C497509J83181p9269q7029o1017J80233R8145j71030L7980p1989J01153J86771
6393C814638k9744J44571K4210m8460K81527J17700N6990K45724N9980K31235
6383D898371L56726K04985J31003K00714J61982n4985K28114P0963R1675k4963
$$ plain form
6461 4214708 3856501 3832448 3684038 3458062 3463993 3472943 3488573 3536997 3507491 3445724 3265842
6450 3265842 3400149 3353057 3206396 3246734 3165212 3045468 3021141 2955758 2990435 3210615 3337944
6439 3337944 3297171 2989157 3010199 2966769 2947744 3034597 3090421 3112590 2989509 3036052 3111882
6428 3111882 3083843 3156057 3079888 3003900 3093272 3160913 3209333 3176966 3177577 3284514 3292106 3248862
6416 3248862 3277928 3337821 3288440 3318746 3394511 3427076 3333098 3374139 3464568 3467082 3437522 3497509
6404 3497509 3680690 3601421 3514392 3453375 3633608 3731753 3560723 3598703 3526714 3627867 3814638
6393 3814638 3784894 3929465 3953675 3905215 4186742 4304442 4361432 4607156 4667136 4898371
6383 4898371 5255097 5460082 5591085 5791799 5953781 5898796 6126910 6197873 6289548 6264585
6373F264585n5065j9971Q6105j32261K1637K64947K4087N0766L4789Q5453J91602
6362F816674J81875K39635L86097M66269M40916M97173N32291P77940P68882M60024
6352A1567776M22130L08929J18370J5951k10114l09922l66292l32193k63132l81007
6342A0570496k57217k47848k00547m4599L5382M273J56181J24864L39142K39971
6332A0720098M08477O12429N29850P82674J005147Q14015R32717Q98220O48389
6323A7352016M32218k1159k23884n11082p63512q07575r95996q98923q12787q31662
6313A1917654m59760m36423m35907l65522l36340j63682l8724J910Q2383K54859
6303A0020448J98174L63408L31292M00166M74398N95100M84480M93672K96301
$$ plain form
6373 6264585 6209520 6189549 6275654 6143393 6165030 6429977 6454064 6504830 6539619 6625072 6816674
6362 6816674 6998549 7238184 7624281 8090550 8531466 9028639 9560930 10338870 11107752 11567776
6352 11567776 11989906 12298835 12417205 12433156 12223042 11913120 11546828 11214635 10951503 10570496
6342 10570496 10313279 10065431 9864884 9820285 9855667 9859940 10016121 10140985 10480127 10720098
6332 10720098 11128575 11741004 12270854 13053528 14058675 14872690 15805407 16703627 17352016
6323 17352016 17784234 17763075 17539191 17028109 16264597 15457022 14461026 13562103 12749316 11917654
6313 11917654 11457894 11021471 10585564 10220042 9883702 9720020 9681296 9683206 9765589 10020448
6303 10020448 10218622 10582030 10913322 11313488 11787886 12382986 12867466 13361138 13657439
6294A3657439J01053k18210m17097m91767o27189p99145q04392p54514o16046
6285I030132m85360n41522l68018l89722l87287j08403j43803l94239j54325o0324
6275E997129q908J98622O0232q7887l9094n8052J81879J21967j04920Q1552R2524
6264F435044k21369j25957j49276j89304l48949j58630j04911j92866k51953l11861
6254D379968j7390j01147q0726o5766j00186r6583K5364j26961j03576q5351k1757
6243C605889J1490Q4958p7971r3261Q7087Q6724P0304K2871J68209j4797r888
6232C941615n1135l4701r7288o4344K3746j6291n8246k9246n5320L6877K3698
6221C619365k23115p3345L5157P1330J01699k3074L9870L6954J23143j26094m349
$$ plain form
6294 13657439 13758492 13540282 13123185 12631418 12004229 11205084 10400692 9646178 9030132
6285 9030132 8544772 8003250 7635232 7245510 6858223 6749820 6606017 6211778 6057453 5997129
6275 5997129 5988221 6186843 6247075 6159188 6120094 6062042 6243921 6365888 6260968 6342520 6435044
6264 6435044 6213675 6087718 5938442 5749138 5400189 5241559 5136648 4943782 4691829 4379968
6254 4379968 4362578 4261431 4180705 4114939 4014753 3918170 3943534 3816573 3712997 3627646 3605889
6243 3605889 3617379 3702337 3624366 3531105 3618192 3704916 3775220 3798091 3966300 3951503 3941615
6232 3941615 3890480 3855779 3758491 3694147 3717893 3701602 3643356 3614110 3558790 3595667 3619365
6221 3619365 3396250 3322905 3358062 3429392 3531091 3508017 3547887 3584841 3707984 3581890 3577541
6210C577541J12750L2301j7187q891j20855J43171O6037R6003m1489L3074P6773
6199C949228m3092J66417j1144O8500p2479j35980k1521J44528J96623j53530
6189D087550J61240K7156j37338J06866O5498J73777k2804k2485M7005k03J76862
6178D663124P8561p6603k38259L3507K45667r7735n5971J25708o7773J5589L831
6167D629646q9075R593O493j05375l7059l5756K8579O3220p198j34138k4823K28571
6155D532678L4469j00306m4735r3043J0779R6654m2937J27084m4939l5128P2199
6144D512775L1322J13225J6812j49791R9699m19J21294Q7908K1420l2982j8204
6133D803059P2175R9581m9559L2127J46884J81866n6451J0965l4525J56046N8744
$$ plain form
6210 3577541 3690291 3722592 3705405 3696514 3575659 3718830 3784867 3880870 3839381 3872455 3949228
6199 3949228 3906136 4072553 4061409 4129909 4057430 3921450 3899929 4044457 4241080 4087550
6189 4087550 4248790 4275946 4138608 4245474 4310972 4484749 4461945 4439460 4486465 4486262 4663124
6178 4663124 4741685 4665082 4426823 4460330 4705997 4608262 4552291 4677999 4610226 4625815 4629646
6167 4629646 4540571 4550164 4556657 4451282 4414223 4378467 4407046 4470266 4463068 4328930 4304107 4532678
6155 4532678 4567147 4466841 4422106 4329063 4339842 4436496 4393559 4520643 4475704 4440576 4512775
6144 4512775 4544097 4657322 4674134 4524343 4624042 4623623 4744917 4832825 4854245 4821263 4803059
6133 4803059 4875234 4974815 4925256 4957383 5104267 5286133 5229682 5240647 5206122 5362168 5420912
6122E420912O8785J51266R3579M1045J1584R2916K22123N4908j02420r6359j0665
6111E947674J22402J15529m5593o4140p7726N9132J37175n1398j38300J30856
6101F135611J04612r7364N5589O9047J6648j99658R4814r0520K6493J30936j17228
6090F128980P43K1938j23470N9397n4819J35734K2626L5097J4560j12215M4770
6079F173341r8048R8526J23774O3106J3935N0184k4202N6000k5588L0861K02971
6068F664860L6901N2979J77411J8963J44839J63954N5278m7514o2973P2011J31214
6057G407923J90902K05972K83232M3270P2817J30773K46516K55479K99735L21501
6047I458120L94967L61943L62570L72672M47005K97291J94213L19124J85484N6663
$$ plain form
6122 5420912 5489697 5640963 5734542 5775587 5787171 5880087 6102210 6157118 6054698 5958339 5947674
6111 5947674 6070076 6185605 6140012 6075872 5998146 6057278 6194453 6143055 6004755 6135611
6101 6135611 6240223 6142859 6198448 6267495 6284143 6084485 6179299 6088779 6115272 6246208 6128980
6090 6128980 6129723 6151661 6028191 6087588 6032769 6168503 6191129 6226226 6240786 6128571 6173341
6079 6173341 6075293 6173819 6297593 6360699 6374634 6424818 6400616 6456616 6431028 6461889 6664860
6068 6664860 6701761 6754740 6932151 6951114 7095953 7259907 7315185 7267671 7204698 7276709 7407923
6057 7407923 7598825 7804797 8088029 8131299 8204116 8334889 8581405 8836884 9136619 9458120
6047 9458120 9853087 10215030 10577600 10950272 11397277 11694568 11888781 12207905 12393389 12450052
6037A2450052L23031J79223L34781L42033L11867K42518K45174J87388J47651
6028A4763718J49295M4468J26058K1954j9378j49456p3379j7272m9413l20643
6018A4475952m90861l50669j69886k02226l11247m08520l54382l54639l58299
6009A1475223r4835j80482k37052j09256j03135n7942k6604j14286j81499k3106
5999A0347026K9645j6636p9063N9468J60534J12601j59892l3991N0970j10278
5989A0360384j12889j24272j68885k30295j99482q2913k20830k86454j26842k89868
5979H517654j24025j44065j19310k76669R8883j8379k30539j07926q5161j53747
5969G356716q4159Q2970j24253m5187K7516l46j86690j15522n0638l7980m7412
$$ plain form
6037 12450052 12773083 12952306 13287087 13629120 13940987 14183505 14428679 14616067 14763718
6028 14763718 14913013 14957481 15083539 15105493 15086115 14936659 14863280 14846008 14796595 14475952
6018 14475952 13985091 13634422 13464536 13262310 12951063 12542543 12188161 11833522 11475223
6009 11475223 11380388 11199906 10962854 10853598 10750463 10692521 10665917 10551631 10370132 10347026
5999 10347026 10376671 10360035 10280972 10340440 10500974 10613575 10453683 10419692 10470662 10360384
5989 10360384 10247495 10123223 9954338 9724043 9524561 9441648 9220818 8934364 8807522 8517654
5979 8517654 8393629 8249564 8130254 7853585 7952468 7934089 7703550 7595624 7510463 7356716
5969 7356716 7272557 7355527 7231274 7186087 7213603 7213257 7026567 6911045 6860407 6822427 6775015
5958F775015o991k02926j05478q342j97078j79675J2768q8866j08373k27376j86605
5947E476073m6678j45028n8381K8352k49942q0222k8317j49946j03781k28500
5937D413630K6233j54845L3042n9353j21463j93868j22424J22045j5270M6459
5927C974186j37224q5534l2976n4532j30439m7739j6521m3314j37918m765l5737
5916C247487j9609n4787r888q1866o3053r6406Q9142L3955q1542j06275j9200
5905B837958M5992O6424L5433r4026L2235j26803q7000O6599M6092j23292j47788
5894B551824K5931N0122p6793R615K28088k8216m503J9941q0077O3628R2758q4770
5882B767548R4275J3874k1649J06425L2042O5131J68086K08751Q3973q6275K401
$$ plain form
5958 6775015 6768024 6565098 6459620 6451278 6254200 6074525 6087293 5998427 5890054 5662678 5476073
5947 5476073 5429395 5284367 5225986 5254338 5004396 4924174 4895857 4745911 4642130 4413630
5937 4413630 4439863 4285018 4318060 4258707 4137244 3943376 3820952 3942997 3927727 3974186
5927 3974186 3836962 3751428 3718452 3663920 3533481 3485742 3469221 3425907 3287989 3283224 3247487
5916 3247487 3227878 3173091 3163203 3081337 3018284 2921878 3011020 3044975 2963433 2857158 2837958
5905 2837958 2883950 2950374 2985807 2891781 2924016 2797213 2710213 2776812 2822904 2699612 2551824
5894 2551824 2577755 2627877 2551084 2560699 2788787 2760571 2756068 2776009 2695932 2759560 2852318 2767548
5882 2767548 2861823 2875697 2854048 2960473 2992515 3057646 3225732 3434483 3518456 3432181 3434582
5871C434582k3743o1842q5396j8523P5875k41785q2156m1611P4700p3370n2838
5860B903893J12711k0379L4661K7373k34215N325N8267r7731P3459J41382q9421
5849B915325N3128n9599j79599J46094Q3877r6413R0281K73330l5201o9019r1071
5838C031133Q3143J43899p178L591N5520Q4176l8180O4515J20256J22980M3858
5827C707713J30640p1849m303q4424P7176J91839q6103j7370k984J17227K59298
5816D216860o1084J60121j1725L1643J09676K06141L39917n3008L2425J98658
5806E169624m1133r9551K24923K43620N0684J18284K44931K28882R6994J93926
5796F431184K56651K23330J56178L17038K05858K12381J26759M35130N29959L98760
$$ plain form
5871 3434582 3410839 3348997 3263601 3245078 3320953 3079168 2997012 2955401 3030101 2956731 2903893
5860 2903893 3016604 2996225 3030886 3058259 2824044 2829369 2887636 2789905 2863364 3004746 2915325
5849 2915325 2968453 2908854 2729255 2875349 2959226 2862813 2953094 3226424 3191223 3122204 3031133
5838 3031133 3114276 3258175 3250997 3254588 3310108 3394284 3356104 3420619 3540875 3663855 3707713
5827 3707713 3838353 3766504 3762201 3677777 3754953 3946792 3860689 3843319 3840335 3957562 4216860
5816 4216860 4155776 4315897 4304172 4335815 4445491 4651632 4991549 4938541 4970966 5169624
5806 5169624 5128491 5028940 5253863 5497483 5548167 5666451 5911382 6140264 6237258 6431184
5796 6431184 6687835 6911165 7067343 7384381 7590239 7802620 7929379 8364509 8894468 9293228
5786I293228N30053M58992N26240O29961Q50222R08967J024180J128302J076930
5777A6427075J282780J339972J065822P54351O45818L77974r3527l5030m5391
5768B1719844n0533j12270k03221l00661k07162l30368l43080n91937l82321j96624
5758A9001667j88770j9351M8941J54692K71993M04109N53890Q35999J226065J158458
5748B3447693J348480J508513J380224J318292J196121Q49168P80744M72832M47858
5739C2749925L09717L33467L49186K52792J98553K73959L2789P9958n9281k56366
5729C4264699k41043m29006p61810j083793j344783j466048j278700j338539q84532
5720B5436445r43162q59764m59382l69279k06528J52206K22659K38683N24874
$$ plain form
5786 9293228 9823281 10282273 10808513 11438474 12288696 13197663 14221843 15350145 16427075
5777 16427075 17709855 19049827 20115649 20870000 21515818 21893792 21800265 21765235 21719844
5768 21719844 21669311 21557041 21353820 21053159 20845997 20515629 20172549 19580612 19198291 19001667
5758 19001667 18812897 18793546 18842487 18997179 19269172 19673281 20227171 21063170 22289235 23447693
5748 23447693 24796173 26304686 27684910 29003202 30199323 31048491 31829235 32302067 32749925
5739 32749925 33059642 33393109 33742295 33995087 34193640 34467599 34500388 34580346 34521065 34264699
5729 34264699 34023656 33594650 32832840 31749047 30404264 28938216 27659516 26320977 25436445
5720 25436445 24493283 23633519 23174137 22804858 22598330 22750536 22973195 23211878 23736752
5711B3736752N07627O06508N34498M34786L97511M99816M14535K48854M94858
5702B7875745M56361N35339J65640j63009j38108o27125q57767r50480j117599
5693B5178997r22732o32283p51887p19558n40222l15639k21056l9782m6409m9269
5683B0940160K28102L72417N47969N04026P61541R24832J037667J057335J011222
5674B7385271J209955J196050J468967K001070K244119K523729K971352L262561
5666D4263074L653659M198989M628782N243422N794835O164990O387836O446073
5658H6781660O434443O107292N051576L883802K152892J91850j970418l729264
5650A04903833n011749n693436o205683o353227o188571o180988n972176n856511
$$ plain form
5711 23736752 24244379 24850887 25385385 25820171 26217682 26717498 27132033 27380887 27875745
5702 27875745 28332106 28867445 29033085 28870076 28731968 28104843 27247076 26296596 25178997
5693 25178997 24256265 23623982 22872095 22152537 21612315 21296676 21075620 21035838 20989429 20940160
5683 20940160 21168262 21540679 22088648 22592674 23354215 24279047 25316714 26374049 27385271
5674 27385271 28595226 29791276 31260243 33261313 35505432 38029161 41000513 44263074
5666 44263074 47916733 52115722 56744504 61987926 67782761 73947751 80335587 86781660
5658 86781660 93216103 99323395 104374971 108258773 110411665 110603515 108633097 104903833
5650 104903833 99892084 94198648 87992965 81639738 75451167 69270179 63298003 57441492
5642E7441492n312745m734514m224299l635656l139720k718114k488611k087093
5634B9100740j794683j451642j231267q99424p81513q88278q56023r63522j035163
5625A9199225r61550p80583o00793o42907m87986o09824m92448m02680l24361
5616A3896093j99146l54076l09029k16185l81900j74485k41971j77700q8732o8524
5606A1684345k32056N8976k08546l50954k73023m80590l42762k52719k8345m17191
5596I157135j72903k15855k93783j06972o3354j59614j89174k14975j01342l3598
5586G605565j30697k3167J4971j27516K081l4842m223J41522k03246j51701O846
5575G095593n6660q6224j01167N8080j09035j57093j37197L6441J11077J70735
$$ plain form
5642 57441492 52128747 47394233 43169934 39534278 36394558 33676444 31187833 29100740
5634 29100740 27306057 25854415 24623148 23723724 22942211 22053933 21197910 20234388 19199225
5625 19199225 18237675 17457092 16856299 16213392 15725406 15115582 14623134 14220454 13896093
5616 13896093 13696947 13342871 13033842 12817657 12435757 12261272 12019301 11841601 11752869 11684345
5606 11684345 11452289 11511265 11302719 10951765 10678742 10198152 9855390 9602671 9574326 9157135
5596 9157135 8984232 8768377 8474594 8367622 8304268 8144654 7955480 7740505 7639163 7605565
5586 7605565 7474868 7451701 7466672 7339156 7341237 7306395 7302172 7443694 7240448 7088747 7095593
5575 7095593 7038933 6952709 6851542 6909622 6800587 6643494 6506297 6542738 6653815 6824550
5565F824550r1554l5433m9744k2975n9734m2779M2972r8140j02519j00030O4421
5554F329035n927j57241l1562p9478K939O5833m8944j4202M4821k4531p2643j29031
5542E879069l3028M1740j81083L166m9819J04572P8692J1647n9429j52397Q0279
5531E723409J9883R8160j2357k28349j12732K06013P1886k7039l8222j5365k039
5520E683248J27251p6845Q0034l6058M2930O1683M2423K8862j6530K59584R4881
5509F291463j7408p25j84265l4081K08867Q1767j59296k24707l0345J82883R4675
5498F208828o6336k9971l2138J928m5666n219P0888Q1635r8456K8343L9264M4786
5486F197886K9573L5033N3444j79309o1707O898j6925j24597R011j5799k1431
$$ plain form
5565 6824550 6732996 6697563 6647819 6624844 6565110 6522331 6565303 6467163 6364644 6264614 6329035
5554 6329035 6323108 6165867 6134305 6054827 6057766 6123599 6074655 6060453 6105274 6080743 6008100 5879069
5542 5879069 5846041 5887781 5706698 5709864 5660045 5764617 5843309 5854956 5795527 5643130 5723409
5531 5723409 5743292 5841452 5829095 5600746 5488014 5694027 5765913 5738874 5700652 5685287 5683248
5520 5683248 5810499 5733654 5813688 5777630 5820560 5882243 5924666 5953528 5936998 6196582 6291463
5509 6291463 6274055 6273330 6089065 6054984 6263851 6345618 6186322 5961615 5931270 6114153 6208828
5498 6208828 6142492 6112521 6080383 6082311 6036645 6031426 6102314 6183949 6085493 6113836 6153100 6197886
5486 6197886 6227459 6262492 6315936 6136627 6074920 6081818 6064893 5940296 5949307 5933508 5912077
5475E912077M9867L7410P0012j37981m0652j16850n9340J16161j7596K3451O0963
5464E897522j45596M2622J80880Q791j21838N9829j2868m7625j5221K8618j68720
5453E706394m0218q8295r677K3325J44827L1379j38181j15300l9715Q707l3335
5442E449911J20675K2644r779k7055J2727J53765n4751j57428R1216J85131J65431
5431E952487M3982n3420o1145J47617R8616K6518M9397M9805Q1896M2075j73115
5420F204713n4939J11205j5016J2132k78538j02828n0800p3326o8392Q9309p9592
5409E693928m8587K8061M1185J8912N3373j08076L645N5596Q1466J14536q384
5398E925655K1194M54m8884k6705L7301j9368l1987j79609J10256J25706J26296
$$ plain form
5475 5912077 5961944 5999354 6069366 5931385 5890733 5773883 5714543 5830704 5813108 5836559 5897522
5464 5897522 5751926 5794548 5975428 5984219 5862381 5922210 5909342 5861717 5846496 5875114 5706394
5453 5706394 5666176 5577881 5568204 5591529 5736356 5767735 5629554 5514254 5474539 5483246 5449911
5442 5449911 5570586 5593230 5583451 5556396 5569123 5722888 5668137 5510709 5601925 5787056 5952487
5431 5952487 5996469 5943049 5881904 6029521 6128137 6154655 6204052 6253857 6335753 6377828 6204713
5420 6204713 6149774 6260979 6245963 6258095 5979557 5876729 5825929 5752603 5684211 5773520 5693928
5409 5693928 5645341 5673402 5714587 5733499 5786872 5678796 5682441 5738037 5819503 5934039 5925655
5398 5925655 5946849 5947303 5898419 5871714 5909015 5889647 5857660 5678051 5788307 5914013 6040309
5387F040309k31562n7840o685o0887O7979P3309J60512j98640o4380K01594J1614
5376E935323j12935r9485P0841q7647l50J12764R1498o9120p036O239O6755M1389
5364E948236j16425o3989R271P0026N3978P5486J30559M2201L708j6020K8910
5353F165941k08487Q8165J15788J2454J40171J30399j6792k00006K8088k188k00248
5342F053285j8780N202M4284j8062j65839K0512Q688n1681l3102j1561J3394K443
5330E848783M8285O7246J58727J0589M8298L7500j99851j0139P3377m5491k5887
5319F011437P0344M6699n3406K1403o1014l1640K37131j7274o1036J2549k1956
5308F153237M5675J40970j09959j81561J14192l3686j20746J12849j00486Q6362
$$ plain form
5387 6040309 5808747 5750907 5744222 5683335 5751314 5824623 5985135 5786495 5722115 5923709 5935323
5376 5935323 5822388 5722903 5793744 5706097 5705747 5818511 5910009 5840889 5833853 5840092 5906847 5948236
5364 5948236 5831811 5767822 5777093 5847119 5901097 5976583 6107142 6149343 6153051 6137031 6165941
5353 6165941 5957454 6045619 6161407 6173861 6314032 6444431 6427639 6227633 6255721 6253533 6053285
5342 6053285 6034505 6039707 6083991 6065929 5900090 5920602 5929290 5877609 5844507 5832946 5846340 5848783
5330 5848783 5897068 5964314 6123041 6133630 6181928 6219428 6019577 6009438 6082815 6037324 6011437
5319 6011437 6081781 6128480 6075074 6096477 6035463 6003823 6240954 6223680 6162644 6175193 6153237
5308 6153237 6198912 6339882 6229923 6048362 6162554 6128868 6008122 6120971 6020485 6106847
5298F106847N2584R659Q2237j6791Q759J14227J6163K5821k9972R1710l7360l3705
5286F390179k645J12037J08887j06228J1009k6641R2139J66727J05017j9350k0151
5275F810980K4515J63671O2687J93087k5676J18158J60528J2921J15495L47736
5265G984102Q6684K7635J38571J68309K61071K07630L30333K53597L79205M55497
5255A0292634L55598N51581N72000N12153O31210Q22178Q48892R28469J439937
5246A6954652J481107J368036J307562J281301J186533P96699M16936J25554j22160
5237B4796220k74161l14365m92428m54190j75571l11753l76244l28772l79901
5228B1688835l84717k09831k39679n4393K22061K21896L97962O16259O74481Q82250
$$ plain form
5298 6106847 6159431 6169090 6251327 6234536 6243295 6357522 6373685 6399506 6369534 6461244 6423884 6390179
5286 6390179 6387534 6499571 6608458 6502230 6513239 6486598 6578737 6745464 6850481 6831131 6810980
5275 6810980 6835495 6999166 7061853 7254940 7229264 7347422 7507950 7520871 7636366 7984102
5265 7984102 8070786 8098421 8236992 8405301 8666372 8874002 9204335 9457932 9837137 10292634
5255 10292634 10648232 11199813 11771813 12283966 12915176 13737354 14586246 15514715 16954652
5246 16954652 18435759 19803795 21111357 22392658 23579191 24375890 24792826 24918380 24796220
5237 24796220 24522059 24207694 23715266 23261076 23085505 22773752 22397508 22068736 21688835
5228 21688835 21304118 21094287 20854608 20800215 21022276 21244172 21642134 22258393 22932874 23815124
5218B3815124J291794J334128J330295J273271J130508R18210M54375K73057K52177
5209C2072939J5046r6260J00539p2641O3452j64752k40142k13481k11327j08034
5199C1145339j18820j92823l41624l70515o48370r64397j035236j235564j207119
5190B5030871j123261j018963r45641p89362k27377k70285l49772j08216N4343
5181B0252337J41848J33032K45335L61418L25649M36017M02753K50173L87262
5172B2935824M56563M20919J30792R0114l07970o95369r55623j144666j353086
5163A9577498j346452r94748j056675q68715r00529n48006p16466n43630o41512
5154A1960765n52880k71922k44641j99929j85176j48239j64850k22997k02020
$$ plain form
5218 23815124 25106918 26441046 27771341 29044612 30175120 31093330 31547705 31820762 32072939
5209 32072939 32087985 31991725 32092264 32019623 32083075 31918323 31678181 31464700 31253373 31145339
5199 31145339 31026519 30833696 30492072 30121557 29473187 28508790 27473554 26237990 25030871
5190 25030871 23907610 22888647 21943006 21153644 20926267 20655982 20306210 20197994 20252337
5181 20252337 20394185 20527217 20772552 21133970 21459619 21895636 22298389 22548562 22935824
5172 22935824 23392387 23813306 23944098 24034212 23726242 23030873 22075250 20930584 19577498
5163 19577498 18231046 17236298 16179623 15310908 14410379 13862373 13145907 12602277 11960765
5154 11960765 11407885 11135963 10891322 10691393 10506217 10357978 10193128 9970131 9768111
5145I768111j32068k04722j36893r7908j71290r9821L0767r2945j22615o8641
5135H671975j73680j31712p530l2003P691j7169l0260o2767l5307j1483k872p1907
5123H102976m0449M0034J13860M0814j8261O9955r4786j00294R8341q6391J54428
5112H280227M1087J00662j0518n2225J18866m3513Q9903Q753L5194O7934R6471
5101H732841o5207M4202p066N79j4743p3571L0037J13897J44279L2563k8071j35609
5089H774131J29161J72462o447l9874J04813O4463O0359J25138O7755n7072N8636
5078I453525J15930J72213M2025Q58J02949J31422J81427K33183K25314K13542
5068A0872388O7831Q6449j8648n586k2604O0570Q8275p9212K46762L09002P317
$$ plain form
5145 9768111 9636043 9431321 9294428 9196520 9025230 8925409 8956176 8863231 8740616 8671975
5135 8671975 8498295 8366583 8359053 8327050 8334741 8317572 8287312 8224545 8189238 8177755 8174883 8102976
5123 8102976 8062527 8102561 8216421 8257235 8238974 8308929 8214143 8113849 8212190 8125799 8280227
5112 8280227 8321314 8421976 8411458 8359233 8478099 8434586 8524489 8533242 8568436 8636370 8732841
5101 8732841 8667634 8711836 8704770 8705349 8690606 8617035 8647072 8760969 8905248 8937811 8909740 8774131
5089 8774131 8903292 9075754 9069307 9029433 9134246 9198709 9259068 9384206 9451961 9394889 9453525
5078 9453525 9569455 9741668 9783693 9784551 9887500 10018922 10200349 10433532 10658846 10872388
5068 10872388 10940219 11026668 11008020 11002434 10979830 11040400 11128675 11049463 11296225 11605227 11612544
5057A1612544K8993k27986L4064Q324j22290R9028j06380K95045J07202L8302
5047A1766846P8585J63351N899J39556j6332l5467N6664K88995J70682O557r6762
5036A2528574J26279N2660O9151K37619J46501J65969M4577J09073N2241Q6808
5026A3619452J03041L4037M1193o508J1731N9079J61989k6066L60445J61416j81051
5015A4338758N2269J35658J50342R9089J24187o3806J64651J76070J55029n596
5005A5326651J92277K82753P905L19813J08887J85886K45008J6815J15838J53655
4995A6955488J75781J21384K43713J71735J62782J86180O3451p4597J67688p511
4985A8166094R5958J97306O3792J66392J12693K6692J56412N8303K00200K23695
$$ plain form
5057 11612544 11641537 11413551 11447615 11455939 11333649 11432677 11326297 11621342 11728544 11766846
5047 11766846 11845431 12008782 12014681 12154237 12137905 12102438 12159102 12448097 12618779 12625336 12528574
5036 12528574 12654853 12707513 12776664 13014283 13160784 13326753 13371330 13480403 13532644 13619452
5026 13619452 13722493 13756530 13797723 13791215 13802946 13862025 14024014 13997948 14358393 14519809 14338758
5015 14338758 14391027 14526685 14677027 14776116 14900303 14836497 15001148 15177218 15332247 15326651
5005 15326651 15518928 15801681 15809586 16129399 16238286 16424172 16669180 16685995 16801833 16955488
4995 16955488 17131269 17252653 17496366 17668101 17830883 18017063 18080514 18005917 18173605 18166094
4985 18166094 18262052 18459358 18523150 18689542 18802235 18828927 18985339 19043642 19243842 19467537
4975A9467537Q8874J07451K62163J55526M2970J71687M20734J85222K39473J30876
4965B1272513R8191K26505J45723K88412K25131K79885J10099J06169J46754J19001
4955B3018383L09133K93847K58601K16910K49484L45316L16798L19569L07456
4946B5635497L48370L27282L23068M43919N47096N37685N05511L09868M83356
4937B9461652N72605K26589M47388N83549N20545N34117O90313L79975M48206
4928C3864939M01347L61582L06718K90129M03002L79944N26228P22810P17172
4919C7973871Q57532O43483P58459P76108P27621R63923R02762R65484P63920
4910D5333163P50450Q47049P43759P23632Q48710P42830R06936R68864R27305
$$ plain form
4975 19467537 19556411 19663862 19926025 20081551 20124521 20296208 20716942 20902164 21141637 21272513
4965 21272513 21370704 21597209 21742932 22031344 22256475 22536360 22646459 22752628 22899382 23018383
4955 23018383 23327516 23621363 23879964 24096874 24346358 24691674 25008472 25328041 25635497
4946 25635497 25983867 26311149 26634217 27078136 27625232 28162917 28668428 28978296 29461652
4937 29461652 30034257 30260846 30708234 31291783 31812328 32346445 33036758 33416733 33864939
4928 33864939 34266286 34627868 34934586 35224715 35627717 36007661 36533889 37256699 37973871
4919 37973871 38831403 39474886 40233345 41009453 41737074 42700997 43603759 44569243 45333163
4910 45333163 46083613 46930662 47674421 48398053 49246763 49989593 50896529 51865393 52792698
4901E2792698J062890J375194J453857J601256J844895J982171K103362K329511
4893F6545834K659376K923391L137198L372398L622256M180181M399418M826837
4885I5666889N274623N873611O440551P174284Q253427Q942349R696259J0534945
4877A57856938J1091743J1290169J1052902J0411052R059653O918386M034280
4870B21715123J002359k091040m956158p406188r552761j1315524j2407512j3070780
4862A61917519j2810857j2309032j1274304r937864q712952p695346o791895n823708
4854H6561561n124583m442852l891065l534142l003470k876778k443918j899570
4846E9345183j970119j971526j576541j495511j504479j421375j307932j248284
$$ plain form
4901 52792698 53855588 55230782 56684639 58285895 60130790 62112961 64216323 66545834
4893 66545834 69205210 72128601 75265799 78638197 82260453 86440634 90840052 95666889
4885 95666889 100941512 106815123 113255674 120429958 128683385 137625734 147321993 157856938
4877 157856938 168948681 180238850 191291752 201702804 210762457 217680843 221715123
4870 221715123 222717482 220626442 215670284 208264096 198711335 187395811 174988299 161917519
4862 161917519 149106662 136797630 125523326 115585462 106872510 99177164 92385269 86561561
4854 86561561 81436978 76994126 73103061 69568919 66565449 63688671 61244753 59345183
4846 59345183 57375064 55403538 53826997 52331486 50827007 49405632 48097700 46849416
4838D6849416j258700j120465j209267j062360j061148r63318r40586q78877p63128
4829C7591567o83868o11760n90699o69070m32093n20983n20308n95130n39813
4820C2427843l03640m48232l26380l96779l68128k68996m52468o12470l51034
4811B8899716m26039l04661k69466l39910l08499l25201j79573k52185l32471
4802B6161711j98281l35783l09373k22062k91319l69088m15045k55977k40135
4793B3524648j87823k28311j34143k03841j03831l49128l09808j1076j47893k80209
4783B1568585k65098j27506j36783k04006r8910l3501l41679k88919J9174L5690
4773B0127047j92096r6447r4360j06310j61456k2832K0289k84606o548P2045m5972
$$ plain form
4838 46849416 45590716 44470251 43260984 42198624 41137476 40174158 39233572 38354695 37591567
4829 37591567 36907699 36295939 35705240 35036170 34604077 34083094 33562786 32967656 32427843
4820 32427843 32124203 31675971 31349591 30952812 30584684 30315688 29863220 29250750 28899716
4811 28899716 28473677 28169016 27899550 27559640 27251141 26925940 26746367 26494182 26161711
4802 26161711 25963430 25627647 25318274 25096212 24804893 24435805 24020760 23764783 23524648
4793 23524648 23336825 23108514 22974371 22770530 22666699 22317571 22007763 21996687 21848794 21568585
4783 21568585 21303487 21175981 21039198 20835192 20736282 20702781 20361102 20072183 20091357 20127047
4773 20127047 19934951 19838504 19744144 19637834 19476378 19453546 19473835 19189229 19182681 19254726 19208754
4762A9208754j70023l6767L577R697q9998j27335Q2335R6586j56644j53983r4829
4751A8571370j4198m9211n4219l0378K1972k8139P3906R9670K32890j76761j61005
4740A8485897j01685m3059J28331J289j00435j171J5422R7432J76925l779q8884
4729A8566283k5384Q5340N4171O4668j6601j7349J53397J03838q5654M3877K4770
4718A8951356J35609J56327k0611J38517O5964L3494K66064K47982J90961K74485
4708B0440148K58095K38447J53215N0105L2487l859K560l3216j06197n0065k3350
4697B0958370J17776K26736k0540J07919J64035P9976J05657K46433K09949K3194
4687B2219505K10317L21198K26909J73226P7323J91953L16706L55029L95196L73463
$$ plain form
4762 19208754 19038731 19001964 19005541 19015238 18925240 18797905 18880240 18976826 18820182 18666199 18571370
4751 18571370 18557172 18507961 18453742 18423364 18445336 18417197 18491103 18590773 18823663 18646902 18485897
4740 18485897 18384212 18341153 18469484 18470773 18370338 18369167 18384589 18482021 18658946 18655167 18566283
4729 18566283 18540899 18626239 18680410 18745078 18728477 18711128 18864525 18968363 18882709 18926586 18951356
4718 18951356 19086965 19243292 19222681 19361198 19427162 19460656 19726720 19974702 20165663 20440148
4708 20440148 20698243 20936690 21089905 21140010 21172497 21168638 21171198 21137982 21031785 20981720 20958370
4697 20958370 21076146 21302882 21282342 21390261 21554296 21634272 21739929 21986362 22196311 22219505
4687 22219505 22429822 22751020 22977929 23151155 23228478 23420431 23737137 24092166 24487362 24860825
4677B4860825L37167L05195K44219L01938K94439M08910K78906L25698M09164
4668B7766461N48248M32301M77602L78398M90793P45064N81479N71690Q54237
4659C2846273P07941P11940R98361R56944R80266J035950J190170J498594J664968
4650D2591407J695863J866561K274955K367317K764328L210898L620470M179670
4642F4571469M566657N351668O207104P374768Q892820J0669504J2652909J5110693
4634A35397592J8547917K2350661K5512320K5103213J8585356O306827p957383
4627B43846503j8845302k4010799k3892713k1444466j8310177j5410699j2488134
4620A09444213j0109608q227990o876650n642972m517776l512253k810722k280563
$$ plain form
4677 24860825 25197992 25503187 25747406 26049344 26343783 26752693 27031599 27357297 27766461
4668 27766461 28314709 28747010 29224612 29603010 30093803 30838867 31420346 31992036 32846273
4659 32846273 33554214 34266154 35264515 36221459 37201725 38237675 39427845 40926439 42591407
4650 42591407 44287270 46153831 48428786 50796103 53560431 56771329 60391799 64571469
4642 64571469 69138126 74489794 80696898 88071666 96964486 107633990 120286899 135397592
4634 135397592 153945509 176296170 201808490 226911703 245497059 251803886 243846503
4627 243846503 225001201 200990402 177097689 155653223 137343046 121932347 109444213
4620 109444213 99334605 91106615 84229965 78586993 74069217 70556964 67746242 65465679
4612F5465679j901848j919476j716361j588622j340728r57047o78224p99386m16453
4603E4147534l80323k33959q4466j0135j02805J32560L33338M28444N57174L22523
4593E5109885J01668M7263k42442n18679n52258n42713m95403m81851l21592k34401
4583E1869477k85428j95699j46220k93401m36519o84884q05295r51956j029022
4574D7041053j094140j194054j133569j203378j187669r96327q35790p27648p72708
4565C7895770o02366m06704k19712p794r9518J49305L48995Q50731P02635N60199
4555C9171541O39698J88143k52475p60249q83858j011229j248013j270959q47500
4546C3725099q35222q87607p38429n00325k86074m22354k97268k24822k03383
$$ plain form
4612 65465679 63563831 61644355 59927994 58339372 56998644 56041597 55363373 54563987 54147534
4603 54147534 53767211 53533252 53448786 53438651 53335846 53468406 53801744 54230188 54787362 55109885
4593 55109885 55211553 55258816 55016374 54497695 53945437 53402724 52907321 52425470 52103878 51869477
4583 51869477 51584049 51388350 51242130 50948729 50512210 49827326 49022031 48070075 47041053
4574 47041053 45946913 44752859 43619290 42415912 41228243 40231916 39396126 38668478 37895770
4565 37895770 37293404 36886700 36666988 36659194 36559676 36708981 37057976 37908707 38611342 39171541
4555 39171541 39811239 39999382 39746907 38986658 38102800 37091571 35843558 34572599 33725099
4546 33725099 32889877 32002270 31263841 30763516 30477442 30055088 29757820 29532998 29329615
4537B9329615j84660l38008l29416l215l3819j54362j8899k16382p1098L9800
4527B8019556p1903j84822j11721L2620J32820q572j6448o8906J517k696l618
4516B7717827o7869Q280J8833k9341L2008M5733r6447K4224O5658m8734J64779
4505B7834951o78k9683J49395j35606R6518j24072j50724K1610L0171j18448p103
4494B7566331j42692j05680J96789l5525J0563j07131m2416R792o6037N6726R081
4483B7349801K5331j58237Q5687N532R7369n8732q2422O14j25220p0683M7672
4472B7116712L635j51657o9502L6492J0908l6828M5564J07606N0297q2100m5030
4461B6986097L0258P9516j18290j29475p7399M6276J43465O9384L1606J65816
$$ plain form
4537 29329615 29144955 28806947 28477531 28474316 28440497 28286135 28267236 28050854 27979756 28019556
4527 28019556 27947653 27762831 27651110 27683730 27816550 27807978 27791530 27722624 27724141 27721445 27717827
4516 27717827 27649958 27658238 27677071 27647730 27679738 27725471 27629024 27653248 27718906 27670172 27834951
4505 27834951 27834273 27804590 27953985 27818379 27914897 27790825 27640101 27661711 27691882 27573434 27566331
4494 27566331 27423639 27317959 27514748 27479223 27489786 27382655 27340239 27350031 27283994 27340720 27349801
4483 27349801 27375132 27216895 27302582 27308114 27405483 27346751 27264329 27264943 27139723 27069040 27116712
4472 27116712 27120347 26968690 26899188 26935680 26946588 26909760 26955324 27062930 27113227 27031127 26986097
4461 26986097 27016355 27095871 26977581 26848106 26770707 26816983 26960448 27029832 27061438 27227254
4451B7227254K02883J00371J17127K5598K9036P4761j2998K5758j49086j23135
4441B7517569q0034J7545J9957L0641j03526J7780q9864k8527p5518N9119q511
4430B7276631L9203R679N9835p0246o0095K19513J6063K36072J91346J281j5554
4419B7903728Q1203O1540J78687o771n7873N7829Q3801Q5795j6633m5385J35202
4408B8461123O0783R3802L4291j16225O1095M4031q8220K797K7521q2709N9781
4397B8558070r3964J64561L3525Q4738l5339j224j4723j970k15386j54795L4356
4386B8357849J7410o6629j65387j83119j31150j56346Q4148J00929K09683j3602
4376B8053786p9029j13735m30032k78527j88595j56693m0099r8992J59628n7713
$$ plain form
4451 27227254 27430137 27530508 27647635 27673233 27702269 27777030 27764032 27789790 27640704 27517569
4441 27517569 27437535 27455080 27475037 27505678 27402152 27419932 27330068 27301541 27226023 27285142 27276631
4430 27276631 27315834 27325513 27385348 27315102 27255007 27474520 27490583 27726655 27918001 27919282 27903728
4419 27903728 27984931 28046471 28225158 28218387 28160514 28218343 28302144 28387939 28371306 28325921 28461123
4408 28461123 28521906 28615708 28649999 28533774 28594869 28638900 28550680 28553477 28580998 28498289 28558070
4397 28558070 28464106 28628667 28662192 28746930 28711591 28710367 28695644 28693674 28478288 28323493 28357849
4386 28357849 28375259 28308630 28143243 27960124 27828974 27672628 27756776 27857705 28067388 28053786
4376 28053786 27974757 27861022 27430990 27152463 26963868 26807175 26767076 26668084 26827712 26769999
4366B6769999R6619n9741K5542J51272P2493R9703N2524J00043K66839J40778
4356B7716071L37070J77181K61996N4520J37738N7976K6237J28420K38782q768
4346B9127223L4741J69927J35501N2123J3121O3152M3342R6764J15731J67543
4336C0019168O8918J93409J42434Q8084K73600L07883J54696L81545L75828P12510
4326C2718075O73096Q91845Q02596O77704M03926O88603O62992M45447J14565
4317C8078849J40275L87070N51450P71029R32123J090113J118725J448756K075144
4308D6593534K698521L230920L443877L572230K935399K877455K871632M262847
4300G2486415O141141J0249593J3727943J9732365K8570447M7474281P9151036
$$ plain form
4366 26769999 26866618 26806877 26832419 26983691 27056184 27155887 27208411 27308454 27575293 27716071
4356 27716071 28053141 28230322 28492318 28546838 28684576 28742552 28768789 28897209 29135991 29127223
4346 29127223 29161964 29331891 29467392 29519515 29532636 29595788 29639130 29735894 29851625 30019168
4336 30019168 30088086 30281495 30423929 30512013 30785613 31093496 31248192 31629737 32005565 32718075
4326 32718075 33391171 34283016 35085612 35763316 36167242 36855845 37518837 37964284 38078849
4317 38078849 38219124 38606194 39157644 39928673 40860796 41950909 43069634 44518390 46593534
4308 46593534 49292055 52522975 55966852 59539082 62474481 65351936 68223568 72486415
4300 72486415 78627556 88877149 102605092 122337457 150907904 198382185 277533221
4293B77533221R9284768O3281020M035958o2964073r0403687o5608825m5042219
4286A80116163l1723886k5392213j8571203j3849228j0474642r157720p008188
4279F3939083n889562m570871l908737l328860k994384k335350k290556j595721
4271C7025042j594544j234885j101074p84367r00450r36330j042760o14483o23232
4262B8192917o25855r09568q72782o74350m48171o08957m02982m99942m26685
4253B2723625n30958m80051o91749n46684p57947k69238l37854m12093k99791
4244A8397260l02967j40681J5847l27663l09074j83082k16199j32759j32699k81449
4234A6386534n6976k17829k16517k0700j62707r8568K7491j76842m4075M9099
$$ plain form
4293 277533221 376817989 440099009 444134967 381170894 290767207 225158382 180116163
4286 180116163 148392277 123000064 104428861 90579633 80104991 70947271 63939083
4279 63939083 58049521 53478650 49569913 46241053 43246669 40911319 38620763 37025042
4271 37025042 35430498 34195613 33094539 32310172 31409722 30473392 29430632 28816149 28192917
4262 28192917 27567062 26657494 25784712 25110362 24662191 24053234 23650252 23150310 22723625
4253 22723625 22192667 21712616 21020867 20474183 19716236 19446998 19109144 18697051 18397260
4244 18397260 18094293 17953612 17969459 17641796 17332722 17149640 16933441 16800682 16667983 16386534
4234 16386534 16329558 16111729 15895212 15874512 15711805 15613237 15640728 15463886 15419811 15468910
4224A5468910m0906k4101P7489N1421P0642L6681N2691J84740K46838N0203o2859
4213A6111749m6091l3742l61687m10879n01290l50745k56091k24095m8493k98776
4203A3579860o9799k30737l69705l26182j91454m5547J133k0328l7253k57874
4193A2032114k81840j85365q6842j15560r1773r1815M6747j59105M2785K0273
4183A1129619k733j58668j95577j55627j7737j40315k4270N008K54O8995J1313
4172A0520262n6865k63154j40672p2237j28686j9667n4560M9350o4179n2084k55934
4161I461574J33560p9545j0715M0130O057q0090r3475J00011K0163j17758L2680
4150I412592j9153r8114M095J21010m363j61972N7512J28369L4424J79049L0360
$$ plain form
4224 15468910 15428004 15403903 15481392 15532813 15603455 15640136 15692827 15877567 16124405 16174608 16111749
4213 16111749 16065658 16031916 15670229 15259350 14758060 14407315 14151224 13927129 13878636 13579860
4203 13579860 13510061 13279324 12909619 12583437 12391983 12346436 12347569 12327241 12289988 12032114
4193 12032114 11750274 11564909 11478067 11362507 11270734 11178919 11225666 11066561 11109346 11129619
4183 11129619 11126886 10968218 10772641 10617014 10599277 10458962 10434692 10439700 10439954 10508949 10520262
4172 10520262 10463397 10200243 10059571 9987334 9858648 9838981 9784421 9833771 9769592 9717508 9461574
4161 9461574 9595134 9515589 9504874 9545004 9551061 9470971 9377496 9477507 9497670 9379912 9412592
4150 9412592 9393439 9295325 9299420 9420430 9416067 9254095 9311607 9439976 9474400 9653449 9683809
4139I683809j6423j45563P051K3091q9041m7478o1686p1111o3866l1227j98341
4128H989215P1121J8877l970o3694k9400O9947l03118j76021j93454n0466J5348
4117H344385n7108J57764L5776J04703J65079J60857L14729J70378l4195j86827
4107I175541l04714j24042j17433j34794l9673j59845k0429l2972q2543L5297
4097H194393o8923o9737j59015M9245L9415M2203L296L0682L7595j31608j5886
4086G951660l2559l9828J0875M5304j19577l1148J3035M2150j5685r1870J24094
4075G856451j14427p7708K7157r4488j49030R1561K6249L518j54483L3411O7379
4064G515590j22319q565q225k0682j5248Q3207l1773o7559N2154q0248o863P9770
$$ plain form
4139 9683809 9667386 9521823 9528874 9551965 9462924 9415446 9353760 9282649 9218783 9187556 8989215
4128 8989215 9060336 9079213 9075243 9011549 8982149 9052096 8748978 8572957 8379503 8329037 8344385
4117 8344385 8287277 8445041 8480817 8585520 8750599 8911456 9226185 9396563 9362368 9175541
4107 9175541 8870827 8746785 8629352 8494558 8454885 8295040 8274611 8241639 8159096 8194393
4097 8194393 8125470 8055733 7896718 7945963 7985378 8027581 8030877 8061559 8099154 7967546 7951660
4086 7951660 7919101 7879273 7890148 7935452 7815875 7784727 7797762 7839912 7824227 7732357 7856451
4075 7856451 7742024 7664316 7691473 7596985 7447955 7539516 7565765 7569283 7414800 7448211 7515590
4064 7515590 7393271 7384706 7376481 7355799 7340551 7423758 7391985 7324426 7376580 7296332 7289469 7369239
4052G369239N0241N2063L6152J44727n1002m4961k5376Q4449J37975J9845j7507
4041G755845O5353K3926R6333J55982m3130N5257k9071n1822L1355K7479J14837
4030H202344L1569J19811k9178R6203J18150J28563J97175Q29J1672J40631P6663
4019I094432P5402K32061J10167n333R6607L41719J61175J23304J36192J88779
4009A0554505Q1035L02960L38474L94851K57501L50725L65087K68267k0590L3724
3999A2926539J272j73637J8587l8156L4518J20023J30217J87033Q2375K26952
3989A3515723K95034L04462J67553J37726J21348K93089L96756K76567L98356
3980A5906614L05069K56737J45838K71881M45096L26529L33000J16063L21288
$$ plain form
4052 7369239 7419480 7471543 7507695 7652422 7601420 7556459 7531083 7615532 7753507 7773352 7755845
4041 7755845 7821198 7845124 7941457 8097439 8054309 8109566 8080495 8028673 8060028 8087507 8202344
4030 8202344 8233913 8353724 8324546 8420749 8538899 8667462 8864637 8865466 8877138 9017769 9094432
4019 9094432 9169834 9401895 9512062 9506729 9603336 9945055 10106230 10229534 10365726 10554505
4009 10554505 10635540 10938500 11276974 11671825 11929326 12280051 12645138 12913405 12892815 12926539
3999 12926539 12927811 12754174 12772761 12734605 12769123 12889146 13019363 13206396 13288771 13515723
3989 13515723 13810757 14115219 14282772 14420498 14541846 14834935 15231691 15508258 15906614
3980 15906614 16211683 16468420 16614258 16886139 17331235 17657764 17990764 18106827 18428115
3971A8428115M17925L46466L82111L79793K45960L62075J81588L95182O01251
3962B1740466L24397L44103L76293M27763M12703M24817L38548M34743L52740
3953B5176573M43290M74922M94162L92066N44643N10473K65496M34805M17603
3944B9154033M47396M65030N02864M23997M43272N69851N34758M75914N60038
3935C3577153N10774M07131O95502L78237N80675N35282N91455M47577M80766
3926C8204552O36455N15952M95938N75118O45272O44355M30278L93430L85376
3917D2926726N50835O82748O18419O00615L76913N22502M93351N05777N72763
3908D7850649N88330N18068N26126O40372O58347P79652P10110P23745P87905
$$ plain form
3971 18428115 18846040 19192506 19574617 19954410 20200370 20562445 20744033 21139215 21740466
3962 21740466 22064863 22408966 22785259 23213022 23625725 24050542 24389090 24823833 25176573
3953 25176573 25619863 26094785 26588947 26981013 27525656 28036129 28301625 28736430 29154033
3944 29154033 29601429 30066459 30569323 30993320 31436592 32006443 32541201 33017115 33577153
3935 33577153 34087927 34495058 35190560 35568797 36149472 36684754 37276209 37723786 38204552
3926 38204552 38841007 39356959 39852897 40428015 41073287 41717642 42147920 42541350 42926726
3917 42926726 43477561 44160309 44778728 45379343 45756256 46278758 46772109 47277886 47850649
3908 47850649 48438979 48957047 49483173 50123545 50781892 51561544 52271654 52995399 53783304
3899E3783304O89985Q84322R56564R86228Q59504P47820J107480R54376Q32148
3890F1801731R42658Q60299Q56423Q96035Q07371P65678Q23221Q04282Q34238
3881F9391936P01983M91257O83293O00315N19177L91222L09486K67601K88524
3872G3644794J80981K69172K25476k161J18339J55202o3198j93602m49874k87144
3862G3597985m12008l88586l68313m45850m18424o82202n37023n15664n20998
3853F9308917n05831n29709n80260p60319o26700o31000n30077q28001p83740
3844F3533280o33733p75414p95067o42943o61228q50472o88143o33210o17159
3835E7235911n87595m64865m57935n60034m90918n05369m27099l44110m35053
$$ plain form
3899 53783304 54473289 55357611 56314175 57300403 58159907 58907727 60015207 60969583 61801731
3890 61801731 62744389 63604688 64461111 65357146 66164517 66930195 67753416 68557698 69391936
3881 69391936 70093919 70585176 71268469 71868784 72387961 72779183 73088669 73356270 73644794
3872 73644794 73825775 74094947 74320423 74318262 74436601 74591803 74528605 74335003 73885129 73597985
3862 73597985 73185977 72797391 72429078 71983228 71564804 70882602 70345579 69829915 69308917
3853 69308917 68803086 68273377 67693117 66932798 66306098 65675098 65145021 64317020 63533280
3844 63533280 62899547 62124133 61329066 60686123 60024895 59174423 58486280 57853070 57235911
3835 57235911 56648316 56183451 55725516 55165482 54674564 54169195 53742096 53397986 52962933
3826E2962933l90302n86055l91374l00745l11866n90970o01402m95955n11844
3817D8782420m05140l24477k82390m63188m17371m86484m94774k30107l67131
3808D5311358l86908m39494l11467l48621l50769l20330k52947m49267l70947
3799D2080608k67744k60961k47973l48766l31989l88205k89219k05921k27414
3790C9512416r1546q9973k68230j12721N9736k18074Q630o09J08840j54756O4589
3779C8818302J66986J24550j12491J20620K2679P2470J5199J48531J9588j2916
3769C9383518Q6744j1745l9303J5785j7391j85430k03524j85198n1808k11159
3759C8580489k26301j90861j46416k81634l74958n14129k31783l31098l24969
$$ plain form
3826 52962933 52572631 51986576 51595202 51294457 50982591 50391621 49790219 49294264 48782420
3817 48782420 48377280 48052803 47770413 47307225 46889854 46403370 45908596 45678489 45311358
3808 45311358 44924450 44484956 44173489 43824868 43474099 43153769 42900822 42451555 42080608
3799 42080608 41812864 41551903 41303930 40955164 40623175 40234970 39945751 39739830 39512416
3790 39512416 39420870 39330897 39062667 38949946 39009682 38791608 38800238 38799629 38908469 38753713 38818302
3779 38818302 38985288 39109838 38997347 39117967 39140646 39213116 39228315 39376846 39396434 39383518
3769 39383518 39470262 39458517 39419214 39434999 39417608 39232178 39028654 38843456 38791648 38580489
3759 38580489 38354188 38163327 38016911 37735277 37360319 36846190 36614407 36283309 35958340
3750C5958340l38251k93383m26381o16650l76018l06973l92620l80160m50949
3741C2376955k60015m27557m32637m56290l89356m12289m84777n87087l39620
3732B8587327m32813m15283m86723m01552m01504n48733m82122m33821l67181
3723B4617595l39003m12803n44484m75754l10688m10929l30430l46541l71634
3714B1075329m18043l19688l80314m00342l04076l15689k85037k34892k35298
3705A8181950l86087k94304k88152l74257l41637j87793k34704k09424l49878
3696A5515714m11737l11795j52457p9691l84343p9448j76244k48091k64628l24169
3686A3083111k2437j25598k14552k14991r9460J5986j78206k28247l9657l9736
$$ plain form
3750 35958340 35620089 35326706 34900325 34283675 33907657 33600684 33208064 32827904 32376955
3741 32376955 32116940 31689383 31256746 30800456 30411100 29998811 29514034 28926947 28587327
3732 28587327 28154514 27739231 27252508 26850956 26449452 25900719 25418597 24984776 24617595
3723 24617595 24278592 23865789 23321305 22845551 22534863 22123934 21793504 21446963 21075329
3714 21075329 20657286 20337598 19957284 19556942 19252866 18937177 18652140 18417248 18181950
3705 18181950 17795863 17501559 17213407 16839150 16497513 16309720 16075016 15865592 15515714
3696 15515714 15103977 14792182 14639725 14560034 14175691 14096243 13919999 13671908 13407280 13083111
3686 13083111 13060674 12935076 12720524 12505533 12406073 12422059 12243853 12015606 11975949 11936213
3676A1936213j09458j84864j68548p0988j95622j45861j13562M667o7210m9223
3666A0835544j02818j69607j85017M9r5541j62948Q6071j43073k1103r2499j01408
3655I847650l0695l8716j37478L9467l484j86160r7965j6039l3464n0736k0391
3644I271989m4016p0748j3390l2785j01740Q9021k1016j80821j458N3354j40032
3633H808358q7005O9192R5547q3063j77319N7435j02646o0871O4139p7130K2481
3622H529118N3239R147l7328j19363K045O4586J48456m449n8553M5755l5647m1152
3610H555854P9499J33075n222j05856o6374k4613R2781m1816r88M4313L3132J17123
3598H810908Q4257l3920k8604n8441j57158N9194R4983j03690j30766o5716P0600
$$ plain form
3676 11936213 11826755 11641891 11473343 11402355 11206733 11060872 10947310 10951977 10884767 10835544
3666 10835544 10732726 10563119 10378102 10378151 10282610 10119662 10205733 10062660 10041557 9949058 9847650
3655 9847650 9816955 9778239 9640761 9680228 9676744 9490584 9392619 9376580 9343116 9292380 9271989
3644 9271989 9227973 9157225 9143835 9111050 9009310 9098331 9077315 8896494 8895036 8948390 8808358
3633 8808358 8721353 8790545 8886092 8803029 8625710 8683145 8580499 8519628 8583767 8506637 8529118
3622 8529118 8582357 8591504 8554176 8434813 8436858 8501444 8649900 8645451 8586898 8632653 8597006 8555854
3610 8555854 8635353 8768428 8763206 8657350 8590976 8566363 8659144 8617328 8616340 8660653 8693785 8810908
3598 8810908 8895165 8861245 8832641 8774200 8617042 8676236 8771219 8667529 8536763 8471047 8541647
3587H541647O6483r4804p664j9863P638L9049o7552J6123O9542P5654p4092o4550
3575H487611j5681L9225r3779K8049j08543J18925P7712K93J41527m7886O1171
3564H688624L3130k6041l8303Q2909M3177k9342Q0562K13291m4771O460R7526
3553I107222j0107O3015O5296o567l6076K30427m792M7861R4283r7098L1167K22255
3541I706886J15153O6852J42171p9571J21359J04115k7281k8725O8091P2612J21073
3530A0382735K04893J53853R7810J08230J01186J79597J13997J6829J32736P7937
3520A1569803J07959K32163J67764J52904K7224J52005K47198J86198Q4841J46902
3510A3074961J26617K23252J29858J98676J98339J9178K21691J47896J22073K25901
$$ plain form
3587 8541647 8608130 8513326 8505662 8485799 8493437 8532486 8464934 8481057 8550599 8626253 8552161 8487611
3575 8487611 8471930 8511155 8417376 8445425 8336882 8455807 8533519 8533812 8675339 8627453 8688624
3564 8688624 8721754 8695713 8657410 8740319 8783496 8754154 8834716 9048007 9003236 9009696 9107222
3553 9107222 9097115 9160130 9225426 9218859 9182783 9413210 9408418 9456279 9550562 9453464 9484631 9706886
3541 9706886 9822039 9888891 10031062 9951491 10072850 10176965 10149684 10120959 10189050 10261662 10382735
3530 10382735 10587628 10741481 10839291 10947521 11048707 11228304 11342301 11359130 11491866 11569803
3520 11569803 11677762 11909925 12077689 12230593 12257817 12409822 12657020 12843218 12928059 13074961
3510 13074961 13201578 13424830 13554688 13753364 13951703 13970881 14192572 14340468 14462541 14688442
3500A4688442P2411K11662J59352J60841J83368K10037K57407J13661K65991M1506
3490A6364678K44323J96237P5279L27403M25484J94367J02802L65190K01350L57293
3480A8854406M31336K93447M82967M76589O43370L68090O50734P70337N36869
3471B3508145P66597R01834Q89798J021040J302177J235494J552080J743749J632013
3462C4552927J305444N21682k85306r36547j218113r99074p55730n84875k77097
3453C1323311k58290l62843m25724k41254k58162l10069k02999q854q6304j26770
3443B9042042J2616N8639Q6331R05J00492K7810N3285P3643J14260K47043J54216
3432B9971282N2325J99374L52426L54629K69996M26031L07845N83126O41527P22272
$$ plain form
3500 14688442 14760853 14972515 15131867 15292708 15476076 15686113 15943520 16057181 16323172 16364678
3490 16364678 16609001 16805238 16880517 17207920 17633404 17827771 17930573 18295763 18497113 18854406
3480 18854406 19285742 19579189 20062156 20538745 21182115 21550205 22200939 22971276 23508145
3471 23508145 24274742 25176576 26066374 27087414 28389591 29625085 31177165 32920914 34552927
3462 34552927 35858371 36380053 36094747 35158200 33940087 32941013 32185283 31600408 31323311
3453 31323311 31065021 30702178 30276454 30035200 29777038 29466969 29263970 29255116 29168812 29042042
3443 29042042 29054658 29113297 29199628 29200533 29301025 29328835 29382120 29455763 29570023 29817066 29971282
3432 29971282 30023607 30222981 30575407 30930036 31200032 31626063 31933908 32517034 33158561 33880833
3422C3880833P87768P72137M46479J00874J12043J57624J29302j5929M9307L58591
3412C6779029K84159L78610K06352L50743K44168L78501N52454K34780K99605
3403C9708401L96030N25147K31479K07433K75312M17052L82275L76189L17605
3394D2836923L45151L38325M48948P29006M95061K92818j21053k59561k2661K24919
3384D5307876J78737J45961J92681K25678L66956L03229M30760L50009L70333
3375D7872220N75343O65018O13983P56423O72000O97464O75708P29246Q73412
3366E4130817J021720R37771J073660J275854J323309J231251J381095J552975
3358F3928452J533497J452724J529728J503132J169271J198808J085500R35877
$$ plain form
3422 33880833 34668601 35440738 35887217 35988091 36100134 36257758 36387060 36371131 36420438 36779029
3412 36779029 37063188 37441798 37648150 37998893 38243061 38621562 39174016 39408796 39708401
3403 39708401 40104431 40629578 40861057 41068490 41343802 41760854 42143129 42519318 42836923
3394 42836923 43182074 43520399 43969347 44698353 45193414 45486232 45365179 45105618 45082957 45307876
3384 45307876 45486613 45632574 45825255 46050933 46417889 46721118 47151878 47501887 47872220
3375 47872220 48447563 49112581 49726564 50482987 51154987 51852451 52528159 53257405 54130817
3366 54130817 55152537 56090308 57163968 58439822 59763131 60994382 62375477 63928452
3358 63928452 65461949 66914673 68444401 69947533 71116804 72315612 73401112 74336989
3350G4336989O75688N13389L20471J91020L03384L5120N7435J11404M9381m9125
3340G6545156J99222Q5660J25505J42209J99116P0704J10960L53176L38564M22320
3330G8592592L03473N06561O44231P26817Q41651O75669P69633Q50937R47293
3321H4858857R18484P95777M58491J72932Q0236k58890l77821p70159j032040
3312H4845867j360266j633465j610121j895677k069908k041813k115140k096712
3304G0022765k210748k048345j963730j840160j829046j579440j336615j405791
3296E5808890j308381j170985r72311j049809q08082o68219p05640n67855o11930
3287D7945678n84800m91894m75594n59998n77876m50296n44756n14529n43029
$$ plain form
3350 74336989 75012677 75526066 75846537 76037557 76340941 76376061 76433496 76544900 76594281 76545156
3340 76545156 76744378 76830038 76955543 77097752 77296868 77367572 77478532 77831708 78170272 78592592
3330 78592592 78896065 79402626 80046857 80773674 81615325 82290994 83060627 83911564 84858857
3321 84858857 85777341 86573118 87031609 87204541 87284777 87025887 86648066 85877907 84845867
3312 84845867 83485601 81852136 80242015 78346338 76276430 74234617 72119477 70022765
3304 70022765 67812017 65763672 63799942 61959782 60130736 58551296 57214681 55808890
3296 55808890 54500509 53329524 52357213 51307404 50499322 49831103 49125463 48557608 47945678
3287 47945678 47360878 46868984 46393390 45833392 45255516 44805220 44260464 43745935 43202906
3278D3202906o05949m77572o36271o81828m35059m22899n24916o91336n21135
3269C8205941l82967n70602n96043o66024m83567n45858m51028m59750n95850
3260C3454252o00942n37253n18712n20784m52344l35681m80360o21769m86209
3251B8900198m61617l48554m01270l93611k90353m53282l48169l19597k53068
3242B5630677k63306k21893l75401l58398l33049k00963k06920l26189j98953
3233B3145605k78678k52858k2018k36182l68947k00211j56683k24195j23841j90949
3223B1091043j01928j83200j19647j64590j93293k08605k00975k19369j72070
3214A9527366k53538l03612k77813k19419j18647k88327j89443l71958k72937
$$ plain form
3278 43202906 42596957 42119385 41483114 40801286 40366227 39943328 39418412 38727076 38205941
3269 38205941 37822974 37252372 36656329 35990305 35506738 34960880 34509852 34050102 33454252
3260 33454252 32853310 32316057 31797345 31276561 30824217 30488536 30008176 29386407 28900198
3251 28900198 28438581 28090027 27688757 27295146 27004793 26551511 26203342 25883745 25630677
3242 25630677 25367371 25145478 24770077 24411679 24078630 23877667 23670747 23344558 23145605
3233 23145605 22866927 22614069 22592051 22355869 21986922 21786711 21630028 21405833 21281992 21091043
3223 21091043 20989115 20805915 20686268 20521678 20328385 20119780 19918805 19699436 19527366
3214 19527366 19273828 18970216 18692403 18472984 18354337 18066010 17876567 17504609 17231672
3205A7231672k06323j22869k67017j65139k84991j89395l13691j66601j84726
3196A5330920k67673j80844j61196k10429j91840r3443j06828j66797j56947k78221
3186A3516702K2487j76188n5565j39935k85787k01515j13872o1110k57706n6204
3176A2191307l02759k27828r2885j70401m9809j28906j91299q0159k01594j57288
3166A0588379n6207j49881j21764R6275k26580p1404j82995j55472k1549j15812
3156I582990Q3379J06410j99466j96578j04027k5383p0481j52781O4732j271N4950
3145I142474j73556k63156j48721j3234J5438l19104k7381m9268j13268R0214
3135H140438L6771J900j5972m3255q6195O0329Q6388j04413j16946k8166O9212
$$ plain form
3205 17231672 17025349 16902480 16635463 16470324 16185333 15995938 15682247 15515646 15330920
3196 15330920 15063247 14882403 14721207 14510778 14318938 14225495 14118667 13951870 13794923 13516702
3186 13516702 13539189 13363001 13307436 13167501 12881714 12680199 12566327 12505217 12247511 12191307
3176 12191307 11888548 11660720 11567835 11397434 11347625 11218719 11027420 10947261 10745667 10588379
3166 10588379 10532172 10382291 10260527 10356802 10130222 10058818 9875823 9720351 9698802 9582990
3156 9582990 9666369 9772779 9573313 9376735 9272708 9247325 9176844 9024063 9088795 9087524 9142474
3145 9142474 8968918 8705762 8557041 8543807 8559245 8240141 8212760 8163492 8050224 8140438
3135 8140438 8177209 8179109 8163137 8119882 8033687 8094016 8180404 8075991 7959045 7930879 8000091
3124H000091M3453r3o5012j21500k68824l5210j5509P742j45298l01102n0388
3113G048350p4512n1388k01461j4505r7445l0604J19001n930L4792Q0564q6765
3102F720097j9705O7617R0085J8011P7047Q6567r028M599Q8339Q8331K15084J49815
3090G576859J21536K46303R3727M57769L04477M85598M70114J55284k4092j75326
3080I712249l48645l74550n68874n57397l19186m50238l14158l09924l17076j41084
3070F011117j42095j90422j81695j94446j05498k47242j77641m2967K4212r3634
3060D659689r3877p1053j33016j30492N497J7297j47954o9329K6244j05916p8341
3049C878749r0935j16721j19997M3981M2315j21898O7727M6809o8136r039o8016
$$ plain form
3124 8000091 8043544 8043451 7978439 7856939 7588115 7552905 7537396 7545138 7399840 7098738 7048350
3113 7048350 6973838 6922450 6720989 6706484 6609039 6578435 6697436 6691506 6726298 6806862 6720097
3102 6720097 6700392 6768009 6858094 6876105 6953152 7039719 7030691 7035290 7123629 7211960 7427044 7576859
3090 7576859 7698395 7944698 8038425 8496194 8800671 9286269 9756383 9911667 9887575 9712249
3080 9712249 9363604 8989054 8420180 7862783 7543597 7093359 6779201 6469277 6152201 6011117
3070 6011117 5869022 5678600 5496905 5302459 5196961 4949719 4772078 4729111 4753323 4659689
3060 4659689 4565812 4494759 4361743 4231251 4236748 4254045 4106091 4036762 4063006 3957090 3878749
3049 3878749 3787814 3671093 3551096 3595077 3637392 3515494 3583221 3630030 3561894 3552855 3484839
3038C484839k3194N7166J63677j09233o8712j2220l6854n8474l2165k53856l23236
3027B787738J25591m0978j91856J3547p5896k2936r8691r2427j17328j44465J68053
3016B310352m2852q8963K6017q1013q7015K5633n5642N9643r624p6553n9284q7953
3004A832746N8520P422j02086m9618L8331Q9426L7826j05062j10614r7564Q0576
2993A679903j7329j23193K7123L0148J55982L2277j06224j64924K4449J13843
2983A652055N0624j06309J6578m1236j53M65j58800J2748O0261j4270P1939J6481
2971A560383n4705L2000m5655j92819r2590O210J905O9023N7695j30824o9279
2960A141344j2470J13495j49040J07440K1806p0336P2584j04018o0402L3988K0324
$$ plain form
3038 3484839 3461645 3518811 3682488 3573255 3504543 3492323 3455469 3396995 3364830 3110974 2787738
3027 2787738 2913329 2872351 2680495 2694042 2618146 2595210 2496519 2404092 2286764 2142299 2310352
3016 2310352 2267500 2178537 2204554 2123541 2036526 2062159 2006517 2066160 2056536 1979983 1920699 1832746
3004 1832746 1891266 1898688 1796602 1746984 1785315 1874741 1912567 1807505 1696891 1599327 1679903
2993 1679903 1662574 1539381 1566504 1596652 1752634 1784911 1678687 1513763 1538212 1652055
2983 1652055 1702679 1596370 1612948 1571712 1571559 1572024 1413224 1425972 1486233 1471963 1543902 1560383
2971 1560383 1505678 1537678 1492023 1299204 1206614 1212824 1214729 1283752 1341447 1210623 1141344
2960 1141344 1128874 1242369 1093329 1200769 1222575 1152239 1224823 1120805 1060403 1094391 1114715
2949A114715k4497m3418o1262O8386L916L3406j8237r9865J15889O2328p1927
2938A079434k1010j8585N9859p7081J25667O7165J0426l1235j02495j28049P7044
2927A041140Q3603r5387N1380j71376o48m7955J00246J3330j1029n7288j22414
2916G83602N3001l2433R0911j26196J8369k1705P7318j0872o7244P4702J00345
2905I39798o7399r0159r3544K68030n5628k40187m2461J3056M5452K04585J91863
2894A073406q0787k12543k4069J18176o0223J981j8759r8100Q87m2699n3067J86253
2882G90456J0176j18197L6480L5811j65450j7255P8755l3087R9114J6249p1404
2871F61648Q3669j74003K7201L1269J16981J8400k39441O6318Q4770r0343N7021
$$ plain form
2949 1114715 1090218 1046800 985538 1053924 1057840 1091246 1073009 973144 1089033 1151361 1079434
2938 1079434 1058424 1039839 1099698 1022617 1148284 1215449 1225875 1194640 1092145 964096 1041140
2927 1041140 1124743 1029356 1080736 909360 908712 860757 961003 974333 963304 906016 783602
2916 783602 836603 804170 895081 768885 787254 765549 842867 831995 764751 839453 939798
2905 939798 872399 782240 688696 956726 901098 660911 618450 631506 676958 881543 1073406
2894 1073406 992619 780076 756007 874183 813960 815941 797182 699082 699969 657270 604203 790456
2882 790456 800632 682435 718915 754726 589276 572021 650776 617689 716803 733052 661648
2871 661648 745317 571314 598515 629784 746765 765165 525724 592042 676812 586469 643490
2860F43490Q317K3103Q286j01086R1570q5556m1724l5958L9811o7150J2242P3590
2848E68935l2754j01815J76218J75419k38446n5060K02898j19344m5962J12587
2838F42676j39303k1253J38698j09819Q5031M2250O132n77q4707m0074J27700
2827F46754Q5388j43763p9283j65387J00627r872M7598j4284m9278P3517J23615
2816F15632R566j48876M6721J4768k26806Q7525J10253J92870K697o0619o9532
2805E74199k6689J68348J1602j65315j02879n1975K1208R0384L9573M1237n0093
2794E49600l601m0480K1554j455j7074M4466k7910k9834m7613K3347q5845q6854
2782B98301L7361m1218L4408j18504Q717J23156j5162N3418J03472r7374K3025
$$ plain form
2860 643490 651807 674910 683196 582110 673680 588124 546400 510442 550253 483103 495345 568935
2848 568935 536181 434366 610584 786003 547557 492497 695395 576051 530089 642676
2838 642676 503373 482120 620818 510999 596030 638280 644412 643835 559128 519054 646754
2827 646754 732142 588379 509096 343709 444336 434464 482062 467778 418500 492017 615632
2816 615632 625198 476322 523043 537811 311005 398530 508783 701653 704350 643731 574199
2805 574199 547510 715858 727460 562145 459266 407291 428499 518883 558456 599693 549600
2794 549600 545999 505519 527073 525618 508544 553010 525100 495266 447653 471000 385155 298301
2782 298301 335662 294444 328852 210348 219065 342221 327059 380477 483949 386575 409600
2771D09600o4115j58543Q7871Q8026j7739k294Q7942n1908P8248l7929J3912l5963
2759C97108r2233l5561r8827J573J52899Q4363J715o6124l0227L07P238M5884
2747C68115q8753N7574Q3366P993o1172M3946K0884j34839q732K9645j15508n3075
2735A49444J23597N4677k6543j20269J96097J07622n6471p7969r6993j40207L118
2724A16103J2379K4745P8882r3815L4768k530n5876o6140P212j9442J00026J1330
2712A47642L0435O6684k9079l8605j4970j5936p107R1085j24103m1966k4827o3290
2700b4037J20998r047o776m1639o6904O9427j5975n6547J42627p0346l0310o0923
2688d9452O4094o4158k5724O1861l280P3086N4223J4457O1029l3015j27147j4581
$$ plain form
2771 409600 345485 186942 274813 362839 345100 342806 430748 378840 457088 419159 433071 397108
2759 397108 304875 269314 170487 172060 324959 409322 411037 344913 314686 314993 322231 368115
2747 368115 279362 336936 420302 428295 367123 411069 431953 297114 288382 318027 202519 149444
2735 149444 273041 327718 301175 180906 377003 484625 428154 350185 253192 112985 116103
2724 116103 128482 153227 232109 138294 173062 170532 114656 48516 55728 36286 136312 147642
2712 147642 178077 244761 215682 177077 162107 146171 139064 230149 106046 64080 39253 -24037
2700 -24037 96961 87914 81138 39499 -27405 42022 26047 -30500 112127 41781 11471 -49452
2688 -49452 14642 -49516 -75240 -13379 -16659 56427 110650 125107 186136 153121 25974 11393
2676A1393R9065R3253r6553j20493j9887j25749L3095J0416J24614M0353K6376
2665G5883M2178r549J71617j57415n5954M288k4682p7268J39705N0792Q3475r2129
2653A50941j39875p5695n4190Q0985O8848N0658o7218l8141p624K5560L6202o3843
2641c3392O742J11269j06788n3164o005P3265Q6509n2316M2843k9737r7580L5387
2629b2967p4238J8446J396O3660L8492k4346j9605J9328r1361j1739J1187J34046
2617D2299j0036K200R4836j15638j4526j40342M1465M0872k5120J6812R1234r8029
2605g3973l9002J49884N3317L3104j34813m9553K7481J14705J15460O4688j8003
2594B43295J39885J79262J26100p4030j45748p8606k86334M8547O8439j02114
$$ plain form
2676 11393 110458 203711 107158 -13335 -33222 -158971 -125876 -115460 9154 49507 75883
2665 75883 118061 108512 280129 122714 66760 71048 46366 -30902 108803 159595 243070 150941
2653 150941 11066 -64629 -118819 -37834 31014 81672 14454 -23687 -31311 -5751 30451 -33392
2641 -33392 -26650 84619 -22169 -75333 -81338 -8073 78436 26120 68963 39226 -58354 -22967
2629 -22967 -97205 -78759 -77363 -13703 24789 443 -19162 166 -91195 -102934 -91747 42299
2617 42299 32263 34463 129299 13661 -865 -141207 -99742 -58870 -83990 -67178 24056 -73973
2605 -73973 -112975 36909 90226 123330 -11483 -61036 -33555 81150 196610 261298 243295
2594 243295 383180 562442 688542 614512 468764 390158 103824 152371 220810 118696
2584A18696O720l659o4189m4079k3573R0802r2783M3724J1313M7406k8086n1647
2572A0645j02472J0869P0599N801q8624L5306J05130L4625n2868O6540P6214p3082
2560I8683p4234n443j06526p6675J36835n2397j3500K16287k27394q4875J09135
2549h0104N9931Q7616r6760k655N4029M8448r0461k1597M8410N2408J6094k2674
2537E2685j2782Q0952n694j04197J3060J17266j61106N4643J31873k07239r0836
2526a31375o0931k5088J59491R7029j79026P3238R4221k4728m1063j32536J79734
2515H966n0859M0695l3675r4854R3884m3216l3687k0006M7807L948j2533J8930
2503g4600J6400P7530P8998o5644p435r692j42168p965m2126L713Q3591k390j14981
$$ plain form
2584 118696 125416 121757 57568 13489 -10084 80718 -12065 31659 42972 90378 62292 10645
2572 10645 -91827 -80958 -10359 -4558 -93182 -57876 47254 81879 29011 95551 171765 98683
2560 98683 24449 19006 -87520 -164195 -27360 -79757 -93257 123030 -104364 -189239 -80104
2549 -80104 -20173 67443 -29317 -31972 22057 70505 -19956 -41553 6857 59265 75359 52685
2537 52685 39903 120855 115161 10964 24024 141290 -19816 34827 166700 -40539 -131375
2526 -131375 -192306 -217394 -57903 39126 -139900 -66662 27559 2831 -38232 -170768 8966
2515 8966 -41893 -1198 -34873 -129727 -35843 -79059 -112746 -132752 -84945 -80997 -93530 -74600
2503 -74600 -58200 19330 98328 32684 25249 15557 -126611 -134576 -176702 -172989 -89398 -91788 -206769
2490b06769P4966J03286n3334j22747N9239J24706R389n9301l7960m2084n1330
2479b01939p2395Q0294K06816l2007j60976L5473M2441m4057Q8489J14683l4110
2468B2712J3441q3346Q1884j18597l9007N6367J64147p8252O952j18972j26996
2457b19667P5848o096J44752Q9949l7016k7494O7594N4662j834j77329m1198j1672
2445h9501k2687J8013J91708J45379k8432j55381P3899j193q3295L2512M4891
2434A25913m7461k765N9063k2551K4825O1917L6175k0553p5067m5956J1958N7993
2422A63491j7202N0320J27449r7615j38939J64729J15385n6729j44504k034l7999
2411A26352M9849j0284K36258j43122j32855J09235J5947J63793r054o1795m4225
$$ plain form
2490 -206769 -131803 -28517 -81851 -204598 -145359 -20653 -11264 -70565 -108525 -150609 -201939
2479 -201939 -274334 -194040 12776 -19231 -180207 -144734 -102293 -146350 -57861 56822 22712
2468 22712 36153 -47193 34691 -83906 -122913 -66546 97601 19349 26301 -92671 -219667
2457 -219667 -143819 -149915 -5163 84786 47770 20276 87870 142532 140698 -36631 -77829 -89501
2445 -89501 -112188 -94175 97533 242912 214480 59099 132998 131805 48510 81022 125913
2434 125913 78452 75687 134750 112199 137024 198941 235116 214563 139496 93540 105498 163491
2422 163491 146289 196609 324058 226443 87504 252233 367618 310889 166385 164351 126352
2411 126352 176201 165917 402175 259053 126198 235433 251380 415173 406119 344324 300099
2400C00099M5988O5644o3022K8750Q815L4242J31343l9031P9296L4843P886q6847
2388E48006Q0520N7278J02212J13839l9143j7693M1129O6651K5231J40760m7864
2377A070926Q7338Q6427L0208m4019P0618J10246R0955O556J76835J5354K11490
2366A912934N6730L6786N9442J63490J6844J70198K5626P0518K54114P8966J49639
2355B995287J94910K04045M5247J70041J35468J24407L37012L19766K38711N79704
2345E344598O64786P94797O85334J002395J459065J213829P41096L37221K37989
2336A2481110N72391Q68987J332506K373645L370590M647774O499323R405549
2328D1551875J5310313K4855295K7274707J4497908l115315k1455235k4058778
$$ plain form
2400 300099 346087 411731 348709 377459 386274 420516 551859 512828 592124 626967 634853 548006
2388 548006 628526 685804 788016 901855 862712 845019 886148 952799 978030 1118790 1070926
2377 1070926 1158264 1244691 1274899 1230880 1301498 1411744 1502699 1509255 1686090 1701444 1912934
2366 1912934 1969664 2006450 2065892 2229382 2246226 2416424 2442050 2512568 2766682 2845648 2995287
2355 2995287 3190197 3394242 3439489 3609530 3744998 3869405 4206417 4526183 4764894 5344598
2345 5344598 6009384 6804181 7489515 8491910 9950975 11164804 11905900 12243121 12481110
2336 12481110 13053501 13922488 15254994 17628639 20999229 25647003 32146326 41551875
2328 41551875 56862188 81717483 108992190 123490098 120374783 98919548 74860770
2321G4860770j6591560j1502278q566528p089857n161318l977491k904809k363355
2313A6703574j735104j182635n99691o46779p30910j091408j212519r28257o16209
2304G960062o69565m48407l67255k26729l83697k52048j28538l02495k06446j68124
2294D806758k74967k20113k20886j53075j18023r2048j92546r4977p4696p4475
2284C290952k02139j98033j44162j40563j44482j83269j9237O8436N421j49151
2274B183773j24857q6769j46663j04509M8086n0343p2261P9754j37972q014j14798
2263A465427Q7104N8596m6421p7996p2864O4491j11026p1051M080q4678R8076
2252A313738j9103j78563k31706N4442n0446j37729J78760K0991P5639K9437n6576
$$ plain form
2321 74860770 58269210 46766932 38200404 31110547 25949229 21971738 19066929 16703574
2313 16703574 14968470 13785835 13186144 12539365 11808455 10717047 9504528 8576271 7960062
2304 7960062 7290497 6842090 6474835 6248106 5864409 5612361 5483823 5181328 4974882 4806758
2294 4806758 4531791 4311678 4090792 3937717 3819694 3727646 3535100 3440123 3365427 3290952
2284 3290952 3088813 2890780 2746618 2606055 2461573 2278304 2259067 2327503 2332924 2183773
2274 2183773 2058916 1972147 1825484 1720975 1769061 1718718 1646457 1726211 1588239 1580225 1465427
2263 1465427 1552531 1611127 1564706 1486710 1413846 1478337 1367311 1296260 1300340 1215662 1313738
2252 1313738 1294635 1116072 884366 938808 888362 750633 929393 950384 1026023 1055460 998884
2241I98884j71194m3566l8785O9136K9202R6247j15288k15564J08664r7636Q4644
2230G04744k0825j7514j04551j46N1228m0684o0118Q1028q5522k0907Q4798k9353
2218E42178R5407k2135j34336p0608j87505m2761j320N1370J38184p4113m7738
2207B46623r2094L6710J48053Q102j45253K5210P7705J39882j80337n5728J6504
2196B25377J3840M5622l0999J2420j34356M2363N8937M5480K7980J8151L5454
2185C60269p6824N730r1186o7585R298K5483J14663N9293l7793m9997n7378L1893
2173B25866k4743P9194j17509N1647J5421k4855J51887j06545n7103k9825q2572
2162H0863j34676L3618J07060N8742J28579Q4328j74182k64386o370K7361L9281
$$ plain form
2241 998884 827690 784124 745339 814475 843677 939924 824636 609072 717736 620100 704744
2230 704744 683919 666405 561854 561708 612936 572252 512134 593162 507640 486733 571531 542178
2218 542178 637585 615450 481114 410506 223001 180240 178920 230290 368474 294361 246623
2207 246623 154529 191239 339292 347394 202141 227351 305056 444938 264601 208873 225377
2196 225377 239217 284839 253840 266260 131904 174267 233204 278684 306664 324815 360269
2185 360269 283445 289175 197989 130404 139702 165185 279848 339141 301348 251351 193973 225866
2173 225866 201123 280317 162808 214455 229876 205021 356908 250363 193260 163435 80863
2162 80863 -53813 -20195 86865 145607 274186 358514 184332 -80054 -86424 -59063 -19782
2151a9782p7606K7036J21252J2720N1250p0738p5870k41694m2925J14570K08951
2140G164k7874M3255j9547k31283M0946Q4468l2688J2082k8623j6501M6642L1575
2128i0384m0650j27422K8368j791Q2641N3037J49981P5952q8602j94539J7034
2117a36375p0170Q7445N4779l0737J55012j78410p4850N231K24201J2052j28151
2106g9973M0220m7097r7137o597Q2936J35254J478k10908n5648M5147q749p9533
2094b80607J99382j67928L5208R145J8796J00267j35247m8176r9887J79017l7828
2083b27858q9890l3975j23016J01352K03848Q7700M343j41155J6036k5871R1724
2072a36762J74490j6529r7957j33856J06490P228j16206k6677P2787J2998O6510
$$ plain form
2151 -19782 -97388 -70352 50900 63620 114870 44132 -31738 -273432 -316357 -201787 7164
2140 7164 -20710 22545 2998 -228285 -187339 -102871 -135559 -123477 -152100 -168601 -121959 -90384
2128 -90384 -131034 -258456 -230088 -231879 -149238 -96201 53780 129732 41130 -153409 -136375
2117 -136375 -206545 -119100 -64321 -95058 59954 -118456 -193306 -188075 36126 48178 -79973
2106 -79973 -39753 -86850 -183987 -190584 -107648 27606 29084 -181824 -237472 -192325 -201074 -280607
2094 -280607 -81225 -249153 -213945 -204800 -186004 -85737 -220984 -269160 -369047 -190030 -227858
2083 -227858 -317748 -351723 -474739 -373387 -169539 -81839 -77496 -218651 -202615 -228486 -136762
2072 -136762 37728 21199 -76758 -210614 -104124 -96896 -213102 -239779 -166992 -153994 -87484
2061h7484Q9451N0048J6204k0575M7767K01275L2466j26121r6051j03590j01654
2050i8264n3000R6568R20r7127j28740L5298o491o7103L3708P1374J8909m5271
2038b39219L2638j1993j5307N5885J1486M6724j17020K1816p8503J89081j3498
2027a17910q006K8154k33064M2503J4063R6468N8858o4772k4624J43637j95424
2016b60117l0494J24222n6065j07721J2722N8963m4725J08355j1477J17669P6337
2005a2331M014n5405j31351J05983j22479O8874m4157p4522O1369L1017o5333
1994b34321n8248J56038q0936O1983j08893q1014l4947K3278J43877L307j36295
1983c46171R9906j20055J29835Q7694N2296k3552j41213n3603M7413J2076j56043
$$ plain form
2061 -87484 1967 52015 68219 47644 95411 296686 329152 203031 106980 3390 -98264
2050 -98264 -151264 -54696 -53776 -150903 -279643 -244345 -250836 -317939 -284231 -212857 -193948 -239219
2038 -239219 -206581 -218574 -233881 -177996 -166510 -119786 -236806 -214990 -293493 -104412 -117910
2027 -117910 -125916 -97762 -330826 -288323 -274260 -177792 -118934 -183706 -208330 -64693 -260117
2016 -260117 -290611 -166389 -222454 -330175 -317453 -258490 -303215 -194860 -206337 -88668 -12331
2005 -12331 -8317 -63722 -195073 -89090 -211569 -142695 -186852 -261374 -200005 -168988 -234321
1994 -234321 -292569 -136531 -217467 -155484 -264377 -345391 -380338 -357060 -213183 -209876 -346171
1983 -346171 -246265 -366320 -236485 -148791 -96495 -120047 -261260 -314863 -267450 -255374 -411417
1972d11417j18493K5527K01475M4829O8393k4756M6243q7538j5469k344J4498
1961b59052n9952M710M2029j25803l3683L6491O6774O3121j4938M204Q4116O4864
1949a27119N7844k40964k8106J34053n1966J206R8982l8052j60483m311n046L0427
1937c33535k3910Q8734j48210Q3293o2808R6231j0584j7708m8802o3765N2716
1926c88348J12542J09062J05842j33447k04283J50314N2536J2456k0913q5218
1916b89457n3349J1554J04486j2820o9229l1821L1402L6971r0731Q9281n9341
1905c33054k3481K8207Q5920Q9820p3101r2578J6609J2551j01976N9558Q1030
1894b50495J9868m6922j1588o4695p0189N4753J19811R4643j67944k2376o463
$$ plain form
1972 -411417 -529910 -504383 -302908 -258079 -189686 -214442 -168199 -255737 -271206 -273550 -259052
1961 -259052 -319004 -314294 -272265 -398068 -431751 -395260 -328486 -265365 -280303 -276099 -191983 -127119
1949 -127119 -69275 -310239 -338345 -204292 -256258 -255052 -156070 -194122 -354605 -358916 -363962 -333535
1937 -333535 -357445 -268711 -416921 -333628 -396436 -300205 -310789 -328497 -377299 -441064 -388348
1926 -388348 -275806 -166744 -60902 -194349 -398632 -248318 -195782 -183326 -204239 -289457
1916 -289457 -342806 -331252 -226766 -239586 -308815 -340636 -309234 -272263 -362994 -273713 -333054
1905 -333054 -356535 -328328 -242408 -152588 -225689 -318267 -301658 -289107 -391083 -331525 -250495
1894 -250495 -230627 -277549 -289137 -353832 -424021 -369268 -249457 -154814 -322758 -345134 -351597
1883c51597K4654L7867J07252n7201q0102m6488j2807j1013k1188l7395O4843
1872c83175O3294R69P1412j21817k69955j4158M922J22751n9161m5797K16527
1861d14188R2250j99564j5441P9411K0523Q9644r6797M3948N895Q3155K0653j2364
1849c02875q5523m4402J19251R3249p6650j2661r2961L7405r5259J270J87551
1838b71605j30204M5538N5503j9102k05902j9757J48419q3699j9995J21227J49396
1827b30181N4344j33213n4411p6077l3275J14291l9193N2927o7710N4789j12168
1816d69877m1853l3670M7074o730j80061K561J04223o2608J42777J17898K1588
1805c58678P5388o1620L4419n0544N2381j99532j9266K4548N0466P6782q571M2205
$$ plain form
1883 -351597 -326943 -289076 -181824 -239025 -319127 -365615 -378422 -389435 -410623 -448018 -383175
1872 -383175 -319881 -318912 -247500 -369317 -639272 -653430 -648508 -525757 -584918 -630715 -414188
1861 -414188 -321938 -521502 -536943 -457532 -437009 -347365 -444162 -400214 -394319 -311164 -290511 -302875
1849 -302875 -388398 -432800 -313549 -220300 -296950 -309611 -402572 -365167 -460426 -459156 -271605
1838 -271605 -401809 -356271 -300768 -319870 -525772 -545529 -397110 -480809 -500804 -379577 -230181
1827 -230181 -175837 -309050 -363461 -439538 -472813 -358522 -397715 -344788 -412498 -357709 -469877
1816 -469877 -511730 -545400 -498326 -505056 -685117 -682556 -578333 -640941 -498164 -380266 -358678
1805 -358678 -283290 -344910 -310491 -361035 -308654 -508186 -527452 -502904 -452438 -375656 -384227 -342022
1793c42022L3347k2113P4143j29292q2257Q8295J79691j05612m8024N4088j23170
1782d22926L3135n4462q9243M3253r0022P8574K63148k4630q0157N0640J08626
1771a84064p6078k23468K5119K3246L8776n3569Q8843j6975j21809L403k52J19570
1759c77258L2963J17074j23381j25543M0783J4J14626o9934j48826J77602M3038
1748c18842m3443K1973K1932j42572O8878o1576m123O1514P3662j54985p7633
1737e55215k5885N7546K07867Q0449o677j85485j3019p6095J85732j3859k3890
1726c68531m7457J11461k580p9005j41499J04961L4407j13357L1694M0940k4396
1715d53362j1251J06744k13909m2121J04980M2374j37905m9165K1194O9227m8535
$$ plain form
1793 -342022 -308675 -330788 -256645 -385937 -468194 -379899 -200208 -305820 -353844 -299756 -422926
1782 -422926 -389791 -444253 -533496 -490243 -580265 -501691 -238543 -263173 -343330 -292690 -184064
1771 -184064 -260142 -483610 -458491 -435245 -396469 -450038 -361195 -378170 -499979 -496576 -496828 -377258
1759 -377258 -344295 -227221 -350602 -476145 -435362 -435348 -320722 -390656 -539482 -361880 -318842
1748 -318842 -362285 -340312 -318380 -460952 -392074 -453650 -457773 -396259 -322597 -477582 -555215
1737 -555215 -581100 -523554 -315687 -235238 -241915 -427400 -440419 -516514 -330782 -344641 -368531
1726 -368531 -415988 -304527 -307107 -386112 -527611 -422650 -388243 -501600 -469906 -428966 -453362
1715 -453362 -464613 -357869 -571778 -613899 -508919 -466545 -604450 -653615 -632421 -563194 -611729
1704f11729o271K9170J23460J2109J7322o3031L1436J73701j75518k2195Q2561
1693d08985j9389L8148j3316j06323r2090J15303O2837P5421R56m2886j4764n101
1681d10189l0243j9475R8467J48835k54114L0223J6113L5219R0883j02872L0307
1670c66846n7018m678l1556J85775K0935r8895P8369l3618L5587m7054J6357o8958
1658c71600o6906M2538m8750Q8551M9992k6671J0911p0475J523K07669r7790j31575
1646d12583k46875Q0055q672O9648L5606k8156N0080K7979n4337N293K66336j34487
1634c50113o4443p5215K4816J21691m0757p980m3345p9716j04762J06820J37699
1623c75305r3726M9413Q7086q8070n1693q0125J55926j16972J6526R9868n1621
$$ plain form
1704 -611729 -618000 -588830 -465370 -453261 -435939 -498970 -467534 -293833 -469351 -491546 -408985
1693 -408985 -428374 -390226 -403542 -509865 -601955 -486652 -423815 -348394 -347438 -390324 -405088 -410189
1681 -410189 -440432 -459907 -361440 -212605 -466719 -436496 -420383 -385164 -294281 -397153 -366846
1670 -366846 -423864 -428542 -460098 -274323 -253388 -352283 -273914 -307532 -271945 -318999 -302642 -371600
1658 -371600 -438506 -395968 -444718 -356167 -306175 -332846 -321935 -392410 -390887 -183218 -281008 -412583
1646 -412583 -659458 -579403 -588075 -518427 -482821 -510977 -460897 -432918 -487255 -481962 -215626 -350113
1634 -350113 -414556 -489771 -464955 -343264 -384021 -392001 -435346 -515062 -619824 -513004 -375305
1623 -375305 -469031 -419618 -332532 -420602 -472295 -552420 -396494 -513466 -496940 -397072 -448693
1612d48693L3870o1016r806J36249l7451k1861J5681k8063o7671q300L3803O0850
1600d02408J26905K5321r399j31120O1517q5136o3629N0135n3244p6561N2493
1589e05126n2377J9394J38867P8711q1178M6176K0795R338l6530n0116q7316J4527
1577d84835J33819J33117j03747r7530J17256J7644o4946K8965p058k29648J1970
1566e44993M8742j11378P5556M3266j31391L1221P8698N0842o9307k1516q5098
1555f35358K7396m9689N8934J50394r699q577l3851q2375l2290N6323L2190K2483
1543e04119m459J3350K0667K0339J0099k0274O9729o2640M4636n8809m4971P7002
1531d39450P7390L510n2953N403r8185j09648Q8004J19346o2634j6885J9053q5316
$$ plain form
1612 -448693 -414823 -475839 -485645 -349396 -386847 -408708 -393027 -421090 -488761 -497061 -463258 -402408
1600 -402408 -275503 -250182 -259581 -390701 -329184 -414320 -477949 -427814 -481058 -557619 -505126
1589 -505126 -557503 -538109 -399242 -320531 -401709 -355533 -334738 -325400 -361930 -412046 -499362 -484835
1577 -484835 -351016 -217899 -321646 -419176 -301920 -284276 -349222 -320257 -327315 -556963 -544993
1566 -544993 -496251 -607629 -532073 -488807 -620198 -588977 -510279 -459437 -528744 -550260 -635358
1555 -635358 -607962 -657651 -598717 -448323 -458022 -466599 -500450 -582825 -615115 -558792 -526602 -504119
1543 -504119 -508578 -495228 -474561 -454222 -444123 -464397 -394668 -457308 -412672 -471481 -516452 -439450
1531 -439450 -362060 -358550 -411503 -406100 -504285 -613933 -525929 -406583 -469217 -486102 -467049 -552365
1519e52365P4090m2043L5102J85079K1497m53n8945Q0062J1180l15509j10691
1508f72996O2275R1070M4944r5635L7638J41928J01504j63304L2624O068p3886
1497d87770R1899l3018j23556Q8795p6481j29198O8848J25931o5895O8396o3429
1486e35478j094M6566k3180P15Q2742P2282m9619j41547P8527Q8302L9382J349
1474c41053j91986L1604K8010Q4677l7454k8354J4907P7532j94870o8399J39365
1463d86021K6309o0370M0384J60777q7095p2015j0710j7008m0461J2819M2749
1452d90642Q2111p7632o5690J3234O3059J18644M247j38913J7043j1131J6717
1441d68953J77039j7114n13L1103o8539k8166m0826k4233n6335l1843m4077J57621
$$ plain form
1519 -552365 -478275 -520318 -485216 -300137 -278640 -279093 -338038 -257976 -246796 -562305 -672996
1508 -672996 -610721 -519651 -474707 -570342 -532704 -390776 -289272 -452576 -419952 -413884 -487770
1497 -487770 -395871 -428889 -552445 -463650 -540131 -669329 -600481 -474550 -540445 -472049 -535478
1486 -535478 -536572 -490006 -513186 -512471 -429729 -357447 -407066 -548613 -470086 -381784 -342402 -341053
1474 -341053 -533039 -501435 -473425 -388748 -426202 -454556 -439649 -362117 -556987 -625386 -486021
1463 -486021 -459712 -520082 -479698 -318921 -406016 -478031 -488741 -505749 -546210 -533391 -490642
1452 -490642 -408531 -486163 -551853 -538619 -475560 -356916 -352669 -491582 -474539 -485670 -468953
1441 -468953 -291914 -309028 -309541 -278438 -346977 -375143 -415969 -440202 -496537 -528380 -572457 -414836
1429d14836J05722j29688q3473o7461K15254J16146m2693o8588j08590p4417J6693
1418e35931J63195N0685m9409m4700L547l0047m0660j2014k7432K7226N5115o601
1406d47026m4640j9686n1214k4715J8144J18593n2185m3354j9472J1806L6054
1395e17695J1477j10194o3355J0334P5694J37115o4470q7385l1628N5216M0891
1384e44000k696J6982P1657J975j24821J98853L3075l3390j2632j4468O939j25863
1372e28389J67051L3241j55705j50298O8265P8203p2036j0354o7896J36100Q8585
1361d13233o0658j32710O1058r2032L3236k4002j7647J57220n6944l0514L0014
1350e46212J021m2181P9177j11792O0758P8184R009M272P5953o8194j10277Q0126
$$ plain form
1429 -414836 -309114 -438802 -522275 -589736 -374482 -258336 -301029 -369617 -478207 -552624 -535931
1418 -535931 -372736 -322051 -371460 -416160 -412613 -442660 -483320 -495334 -522766 -495540 -440425 -447026
1406 -447026 -491666 -511352 -562566 -587281 -569137 -450544 -502729 -546083 -565555 -553749 -517695
1395 -517695 -506218 -616412 -679767 -669433 -593739 -456624 -521094 -608479 -640107 -584891 -544000
1384 -544000 -546696 -529714 -458057 -456082 -580903 -382050 -348975 -382365 -394997 -409465 -402526 -528389
1372 -528389 -361338 -328097 -483802 -634100 -565835 -487632 -559668 -570022 -637918 -501818 -413233
1361 -413233 -473891 -606601 -545543 -637575 -604339 -628341 -645988 -488768 -545712 -576226 -546212
1350 -546212 -545191 -587372 -508195 -619987 -559229 -481045 -472036 -467764 -391811 -460005 -570282 -490156
1338d90156l3590O405j9820R0906j3952p9189q8651m8608P1499j3783M955k4931
1326f38915Q455J49624M0489K113K6863M0539j5554m2206J20035m6673p2171j02535
$$ plain form
1338 -490156 -523746 -517341 -537161 -446255 -460207 -539396 -628047 -676655 -605156 -618939 -613984 -638915
1326 -638915 -630460 -480836 -440347 -438234 -411371 -370832 -386386 -428592 -308557 -355230 -427401 -529936
$$ [...]
##END NTUPLES=NMR SPECTRUM
##END=
