##TITLE=1H_DE-80H_X3
 200.13MHz, d2o
 8 sc
 
 19ns.26.2.2025
##JCAMPDX= 6.0         $$ Bruker NMR JCAMP-DX V2.0
##DATA TYPE= NMR SPECTRUM
##DATA CLASS= NTUPLES
##ORIGIN= UXNMR, Bruker Analytische Messtechnik GmbH
##OWNER= pz
$$ XWIN-NMR		Version 3.5
$$ Mon Dec  8 11:01:38 2025 Russian Standard Time (UT+4h)  Yarkov@DPX200
##.OBSERVE FREQUENCY= 200.1313
##.OBSERVE NUCLEUS= ^1H
##.ACQUISITION MODE= SIMULTANEOUS
##.ACQUISITION SCHEME= undefined
##.AVERAGES= 8
##.DIGITISER RES= 18
##SPECTROMETER/DATA SYSTEM= spect
##.PULSE SEQUENCE= zg30
##.SOLVENT NAME= DMSO
##.SHIFT REFERENCE= (INTERNAL, DMSO, 0, 15.4957)
##AUDIT TRAIL= $$ (NUMBER, WHEN, WHO, WHERE, WHAT)
$$ ##TITLE= Audit trail, XWIN-NMR		Version 3.5
$$ ##JCAMPDX= 5.01
$$ ##ORIGIN= Bruker BioSpin GmbH
$$ ##OWNER= Yarkov
$$ C:/Bruker/XWIN-NMR/data/yarkov2/nmr/H-C/1/pdata/1/auditp.txt
$$ ##AUDIT TRAIL=  $$ (NUMBER, WHEN, WHO, WHERE, WHAT)
(   1,<2025-12-08 11:00:50.54 +0400>,<Yarkov>,<DPX200>,
      <created by zg, POWCHK disabled, PULCHK disabled
       configuration hash MD5:
       00 E9 B6 7A A2 85 ED C7 34 08 36 98 17 FE 4E 26
       data hash MD5: 16K
       C6 2F 15 AD AF 8E 7F E6 9D CE 22 38 F5 4F 7C 3D>)
(   2,<2025-12-08 11:00:54.59 +0400>,<Yarkov>,<DPX200>,
      <Start of raw data processing
       efp BC_mod = 2 LB = 0.25 FT_mod = 6 PKNL = 1 PHC0 = -5312.553 PHC1 = 20.22191 SI = 16K 
       data hash MD5: 16K
       50 5E E3 92 E5 12 4A 45 E4 40 ED A1 C3 46 69 F3>)
$$ ##END=
$$ 
$$ hash MD5
$$ 7B 42 B2 26 2A 34 93 5B E3 5C 83 C1 1D B8 E0 9C
##$RELAX= 
##$RELAX= 
##$RELAX= 
##$RELAX= 
##$RELAX= 
##$RELAX= 
$$ Bruker specific parameters
$$ --------------------------
##$DU= <C:/Bruker/XWIN-NMR>
##$EXPNO= 1
##$NAME= <H-C>
##$PROCNO= 1
##$TYPE= <nmr>
##$USER= <yarkov2>
##$AMP= (0..31)
100 100 100 100 100 100 100 100 100 100 100 100 100 100 100 100 100 100 
100 100 100 100 100 100 100 100 100 100 100 100 100 100 
##$AQSEQ= 0
##$AQ_mod= 1
##$AUNM= <au_zg>
##$AUTOPOS= <>
##$BF1= 200.13
##$BF2= 200.13
##$BF3= 200.13
##$BF4= 200.13
##$BF5= 200.13
##$BF6= 200.13
##$BF7= 200.13
##$BF8= 200.13
##$BYTORDA= 1
##$CFDGTYP= 0
##$CFRGTYP= 5
##$CHEMSTR= <none>
##$CNST= (0..31)
1 1 145 1 1 1 1 1 1 1 1 1 1 1 1 1 1 1 1 1 1 1 1 1 1 1 1 1 1 1 1 1 
##$CPDPRG= <>
##$CPDPRG1= <>
##$CPDPRG2= <>
##$CPDPRG3= <>
##$CPDPRG4= <mlev>
##$CPDPRG5= <mlev>
##$CPDPRG6= <mlev>
##$CPDPRG7= <mlev>
##$CPDPRG8= <mlev>
##$CPDPRGB= <>
##$CPDPRGT= <>
##$D= (0..31)
0 0.7 0 0 0 0 0 0 0 0 0 0.03 0 0 0 0 0 0 0 0 0 0 0 0 0 0 0 0 0 0 0 0 
##$DATE= 1765177250
##$DBL= (0..7)
120 120 120 120 120 120 120 120 
##$DBP= (0..7)
150 150 150 150 150 150 150 150 
##$DBP07= 0
##$DBPNAM0= <>
##$DBPNAM1= <>
##$DBPNAM2= <>
##$DBPNAM3= <>
##$DBPNAM4= <>
##$DBPNAM5= <>
##$DBPNAM6= <>
##$DBPNAM7= <>
##$DBPOAL= (0..7)
0.5 0.5 0.5 0.5 0.5 0.5 0.5 0.5 
##$DBPOFFS= (0..7)
0 0 0 0 0 0 0 0 
##$DE= 6
##$DECBNUC= <off>
##$DECIM= 32
##$DECNUC= <off>
##$DECSTAT= 4
##$DIGMOD= 1
##$DIGTYP= 9
##$DL= (0..7)
0 120 120 120 120 120 120 120 
##$DP= (0..7)
$$ [...]
##$SUBNAM2= <"">
##$SUBNAM3= <"">
##$SUBNAM4= <"">
##$SUBNAM5= <"">
##$SUBNAM6= <"">
##$SUBNAM7= <"">
##$SUBNAM8= <"">
##$SUBNAM9= <"">
##$SW= 18.0517328524113
##$SWIBOX= (0..15)
0 0 2 0 0 0 0 0 0 0 0 0 0 0 0 0 
##$SW_h= 3612.71676300578
##$TD= 16384
##$TD0= 1
##$TE= 0
##$TE2= 300
##$TE3= 300
##$TEG= 300
##$TL= (0..7)
0 120 120 120 120 120 120 120 
##$TP= (0..7)
150 150 150 150 150 150 150 150 
##$TP07= 0
##$TPNAME0= <>
##$TPNAME1= <>
##$TPNAME2= <>
##$TPNAME3= <>
##$TPNAME4= <>
##$TPNAME5= <>
##$TPNAME6= <>
##$TPNAME7= <>
##$TPOAL= (0..7)
0.5 0.5 0.5 0.5 0.5 0.5 0.5 0.5 
##$TPOFFS= (0..7)
0 0 0 0 0 0 0 0 
##$TUNHIN= 0
##$TUNHOUT= 0
##$TUNXOUT= 0
##$USERA1= <user>
##$USERA2= <user>
##$USERA3= <user>
##$USERA4= <user>
##$USERA5= <user>
##$V9= 5
##$VALIST= <valist>
##$VCLIST= <CCCCCCCCCCCCCCC>
##$VD= 0
##$VDLIST= <DDDDDDDDDDDDDDD>
##$VPLIST= <PPPPPPPPPPPPPPP>
##$VTLIST= <TTTTTTTTTTTTTTT>
##$WBST= 1024
##$WBSW= 4
##$XGAIN= (0..3)
0 0 0 0 
##$XL= 0
##$YL= 0
##$YMAX_a= 141907
##$YMIN_a= -170831
##$ZGOPTNS= <>
##$ZL1= 120
##$ZL2= 120
##$ZL3= 120
##$ZL4= 120
##$ABSF1= 0
##$ABSF2= 0
##$ABSG= 0
##$ABSL= 0
##$ALPHA= 0
##$AQORDER= 0
##$ASSFAC= 0
##$ASSFACI= 0
##$ASSFACX= 0
##$ASSWID= 0
##$AUNMP= <proc_1d>
##$AZFE= 0.1
##$AZFW= 0.1
##$BCFW= 0
##$BC_mod= 2
##$BYTORDP= 0
##$COROFFS= 0
##$CY= -3
##$DATMOD= 1
##$DC= 0
##$DFILT= <>
##$DTYPP= 0
##$F1P= 0
##$F2P= 0
##$FCOR= 1
##$FTSIZE= 16384
##$FT_mod= 6
##$GAMMA= 0
##$GB= 0
##$INTBC= 1
##$INTSCL= 3.241238e-09
##$ISEN= 128
##$LB= 0.25
##$LEV0= 0
##$LPBIN= 0
##$MAXI= 10000
##$MC2= 0
##$MEAN= 0
##$ME_mod= 0
##$MI= 1.114404
##$NCOEF= 0
##$NC_proc= -7
##$NLEV= 6
##$NOISF1= 3.799351
##$NOISF2= 2.8
##$NSP= 0
##$NTH_PI= 0
##$NZP= 0
##$OFFSET= 15.4957
##$PC= 1
##$PHC0= -5312.553
##$PHC1= 20.22191
##$PH_mod= 1
##$PKNL= yes
##$PPARMOD= 0
##$PSCAL= 0
##$PSIGN= 0
##$REVERSE= no
##$SF= 200.130005203012
##$SI= 16384
##$SIGF1= 3
##$SIGF2= 2
##$SINO= 0.751879
##$SIOLD= 32768
##$SREGLST= <19F.Aceton>
##$SSB= 0
##$STSI= 16384
##$STSR= 0
##$SW_p= 3612.71676300578
##$SYMM= 0
##$S_DEV= 0
##$TDeff= 16384
##$TDoff= 0
##$TI= <>
##$TILT= no
##$TM1= 0
##$TM2= 0
##$TOPLEV= 0
##$USERP1= <user>
##$USERP2= <user>
##$USERP3= <user>
##$USERP4= <user>
##$USERP5= <user>
##$WDW= 1
##$XDIM= 16384
##$YMAX_p= 520525578
##$YMIN_p= -647530
$$ End of Bruker specific parameters
$$ ---------------------------------
##NTUPLES= NMR SPECTRUM
##VAR_NAME=  FREQUENCY,     SPECTRUM/REAL,   SPECTRUM/IMAG
##SYMBOL=    X,             R,               I
##VAR_TYPE=  INDEPENDENT,   DEPENDENT,       DEPENDENT
##VAR_FORM=  AFFN,          ASDF,            ASDF
##VAR_DIM=   16384,         16384,           16384
##UNITS=     HZ,            ARBITRARY UNITS, ARBITRARY UNITS
##FACTOR=    0.220516191357247, 1,           1
##FIRST=     3101.1544981105, 0,             0
##LAST=      -511.562264895277, 0,           0
##MIN=       -511.562264895277, -647530,     0
##MAX=       3101.1544981105, 520525578,     0
$$ Real data points
##PAGE= N=1
##DATA TABLE= (X++(R..R)), XYDATA
$$ [...]
$$ plain form
7529 413116 418112 412169 248704 248337 275602 465363 399093 240353 202700 210013 122607 141357
7517 141357 326396 227998 176491 132172 200192 214684 168308 62709 170160 149003 35785
7506 35785 -31363 75700 141630 241191 121530 220831 239945 211204 110149 203456 293421
7495 293421 212009 213462 233041 99845 83772 93455 114593 54550 40218 238874 70631
7484 70631 134834 184379 218755 282720 217767 68442 168657 171544 78439 -20077 226980
7473 226980 153312 193769 138391 209890 283680 180611 152133 163874 229426 214054 372982
7462 372982 314132 157430 263888 400306 270154 322172 15306 88956 248870 192415
7452 192415 155413 191767 123868 268581 141435 228158 423869 367276 216167 323117 358331
$$ packed form
7529D13116M996n943j63465l67K7265J89761o6270j58740l7653P313q7406J8750
7517A41357J85039r8398n1507m4319O8020J4492m6376j05599J07451k1157j13218
7506C5785o7148J07063O5930R9561j19661R9301J9114k8741j01055R3307Q9965
7495B93421q1412J453J9579j33196j6073R683K1138o0043j4332J98656j68243
7484G0631O4203M9545L4376O3965o4953j49325J00215K887r3105r8516K47057
7473B26980p3668M0457n5378P1499P3790j03069k8478J1741O5552j5372J58928
7462C72982n8850j56702J06458J36418j30152N2018l06866P3650J59914n6455
7452A92415l7002L6354o7899J44713j27146Q6723J95711n6593j51109J06950L5214
$$ plain form
7441 358331 138831 166569 340066 347317 195627 223503 280504 302985 93311 118963 244648
7430 244648 316701 205561 121219 166015 125950 29755 54854 235752 206684 96439 126303
7419 126303 225207 226216 164888 450891 171318 62427 71706 224809 -33734 106008 222575
7408 222575 176861 416317 260920 348778 344692 261977 49156 255959 231368 159988 170182
7397 170182 371022 420292 346448 255250 422973 540470 359493 317132 500601 430989 295006
7386 295006 239403 167499 153933 111130 158986 262944 303637 203360 175359 173608 267597
7375 267597 280713 220370 248739 253139 195006 238598 216526 89792 33388 156944 159873 208615
7363 208615 249037 216820 140764 131357 -42433 153040 138725 145236 133513 280120 265203
$$ packed form
7441C58331k19500K7738J73497P251j51690K7876N7001K2481k09674K5652J25685
7430B44648P2053j11140q4342M4796m0065r6195K5099J80898k9068j10245K9864
7419A26303R8904J009o1328K86003k79573j08891R279J53103k58543J39742J16567
7408B22575m5714K39456j55397Q7858m086q2715k12821K06803k4591p1380J0194
7397A70182K00840M9270p3844r1198J67723J17497j80977m2361J83469o9612j35983
7386B95006n5603p1904j3566m2803M7856J03958M0693j00277k8001j751R3989
7375B67597J3116o0343K8369M400n8133M3592k2072j26734n6404J23556K929M8742
7363B08615M0422l2217p6056r407j73790J95473j4315O511j1723J46607j4917
$$ plain form
7352 265203 173946 207693 107018 221811 145171 284977 267232 289550 62436 170287 242977
7341 242977 185821 163671 235638 305154 364658 209006 211350 147194 219597 70894 213366
7330 213366 246062 191036 173965 306221 255601 205591 99913 94779 260906 71741 220752
7319 220752 380969 454004 338011 304531 152095 201025 104725 156309 351013 329074 3019
7308 3019 92791 252032 167681 67089 271805 217235 296399 269081 265061 173019 84643 45066
7296 45066 243724 271628 153964 248596 391220 213482 228651 317699 203118 316835 182932
7285 182932 177634 276067 334276 139351 145291 162943 288280 258050 336829 375572 217403
7274 217403 150071 177140 232594 178989 87350 143618 399978 199803 183922 212920 357743
$$ packed form
7352B65203r1257L3747j00675J14793p6640J39806j7745K2318k27114J07851P2690
7341B42977n7156k2150P1967O9516N9504j55652K344o4156P2403j48703J42472
7330B13366L2696n5026j7071J32256n0620n0010j05678n134J66127j89165J49011
7319B20752J60217P3035j15993l3480j52436M8930r6300N1584J94704k1939l26055
7308C019Q9772J59241q4351j00592K04716n4570P9164k7318m020r2042q8376l9577
7296D5066J98658K7904j17664R4632J42624j77738J5169Q9048j14581J13717j33903
7285A82932n298R8433N8209j94925N940J7652J25337l0230P8779L8743j58169
7274B17403o7332K7069N5454n3605r1639N6268K56360k00175j5881K8998J44823
$$ plain form
7263 357743 86585 163282 132658 203569 151658 182807 302973 173571 232693 246208 449986
7252 449986 256187 90529 117168 220694 157395 223813 157398 225198 269608 260668 370059
7241 370059 340512 340173 206581 121498 356043 412456 276240 237945 284983 283182 167804
7230 167804 235139 312129 260135 334581 492875 436592 141392 231227 195394 70949 108239
7219 108239 285485 284152 237168 183663 310836 192907 242296 213072 225934 372517 160277
7208 160277 208452 218211 272790 192237 280206 409187 410879 282900 150693 336781 336066 427993
7196 427993 317391 441541 213654 204482 208765 347708 314470 185670 244616 221436 243007
7185 243007 160163 306606 319249 215750 264090 430270 275083 131373 246988 267798
$$ packed form
7263C57743k71158P6697l0624P0911n1911L1149J20166j29402N9122J3515K03778
7252D49986j93799j65658K6639J03526o3299O6418o6415O7800M4410q940J09391
7241C70059k9547l39j33592q5083K34545N6413j36216l8295M7038j801j15378
7230A67804O7335P6990n1994P4446J58294n6283k95200Q9835l5833j24445L7290
7219A08239J77246j333m6984n3505J27173j17929M9389k9224J2862J46583k12240
7208A60277M8175R759N4579q0553Q7969J28981J692j27979j32207J86088p15R1927
7196D27993j10602J24150k27887r172M283J38943l3238j28800N8946k3180K1571
7185B43007q2844J46443J2643j03499M8340J66180j55187j43710J15615K0810
$$ plain form
7175 267798 300912 180955 134787 325249 178036 182609 158096 192102 172244 222707 214799
7164 214799 319292 345247 266019 215640 218874 165275 -23164 128610 16475 138983 289402
7153 289402 220021 150473 295793 357092 274549 241684 111803 180489 346350 135057 -58217
7142 -58217 142690 104617 162259 180039 243647 438901 489456 320041 393212 377509 190031
7131 190031 248468 349041 258538 480458 406369 344851 281098 220121 315766 418528 223103
7120 223103 200057 367509 247977 334320 282921 332217 421774 329321 300761 285519 320345
7109 320345 261436 323170 228265 259589 221088 167301 174171 292932 217245 76974 104986
7098 104986 101306 271280 456030 486940 250737 235186 249039 358430 259716 198107 262278
$$ packed form
7175B67798L3114j19957m6168J90462j47213M573k4513L4006j9858N0463p908
7164B14799J04493K5955p9228n0379L234n3599j88439J51774j12135J22508J50419
7153B89402o9381o9548J45320O1299q2543l2865j29881O8686J65861k11293j93274
7142e8217K00907l8073N7642J7780O3608J95254N0555j69415P3171j5703j87478
7131A90031N8437J00573r0503K21920p4089o1518o3753o0977R5645J02762j95425
7120B23103k3046J67452j19532Q6343n1399M9296Q9557r2453k8560j5242L4826
7109C20345n8909O1734r4905L1324l8501n3787O870J18761p5687j40271K8012
7098A04986l680J69974J84750L0910k36203j5551J3853J09391r8714o1609O4171
$$ plain form
7087 262278 435951 314221 395135 447217 362516 295372 236991 151097 267212 207838 149365
7076 149365 389252 441390 360500 366543 561571 338513 448611 307874 325982 352080 374334
7065 374334 287833 424223 305311 267345 247180 197912 225290 265168 310921 145406 162612
7054 162612 287501 268220 356052 352924 218669 303633 462411 488744 365163 356190 245956
7043 245956 457667 193062 394059 315545 251231 368572 562394 210700 270268 254842
7033 254842 162587 201490 240033 280203 191442 396793 202330 244749 160328 226871 322473
7022 322473 390008 247161 248316 334475 344127 253948 136694 75376 161211 357091 263767
7011 263767 295337 316622 356943 388211 397652 293515 372544 366459 306448 196300 329722
$$ packed form
7087B62278J73673j21730Q0914N2082q4701o7144n8381q5894J16115n9374n8473
7076A49365K39887N2138q0890O043J95028k23058J10098j40737J8108K6098K2254
7065C74334q6501J36390j18912l7966k0165m9268K7378L9878M5753j65515J7206
7054A62612J24889j9281Q7832l128j34255Q4964J58778K6333j23581q973j10234
7043B45956K11711k64605K00997p8514o4314J17341J93822l51694N9568j5426
7033B54842r2255L8903L8543M0170q8761K05351j94463M2419q4421O6543R5602
7022C22473O7535j42847J155Q6159R652r0179j17254o1318Q5835J95880r3324
7011B63767L1570K1285M0321L1268R441j04137P9029o085o0011j10148J33422
$$ plain form
7000 329722 497008 249882 191786 126203 223545 189295 215447 81532 269735 382194 336700
6989 336700 412990 456095 416282 395894 333648 84166 284750 267736 386016 269057 281549
6978 281549 197385 154839 200523 261184 364046 403923 381316 343973 328100 272880 424405
6967 424405 351740 352436 372933 349979 183591 180100 234971 323692 265383 137006 389226 516970
6955 516970 369353 276748 339857 375607 356190 186986 211452 321329 349710 259825 160864
6944 160864 147186 199995 219186 287299 293142 316425 461738 311021 393177 405588 558511
6933 558511 396418 263029 157476 280099 324350 172307 319370 383242 366731 225413
6923 225413 228851 408794 419033 344170 268823 446223 348057 291286 25286 106439 286663
$$ packed form
7000C29722J67286k47126n8096o5583R7342l4250K6152j33915J88203J12459m5494
6989C36700P6290M3105l9813k0388o2246k49482K00584j7014J18280j16959J2492
6978B81549q4164m2546M5684O0661J02862L9877k2607l7343j5873n5220J51525
6967D24405p2665O96K0497k2954j66388l491N4871Q8721n8309j28377K52220J27744
6955E16970j47617r2605O3109L5750j9417j69204K4466J09877K8381q9885r8961
6944A60864j3678N2809J9191O8113N843K3283J45313j50717Q2156J2411J52923
6933E58511j62093j33389j05553J22623M4251j52043J47063O3872j6511j41318
6923B25413L438J79943J0239p4863p5347J77400r8166n6771k66000Q1153J80224
$$ plain form
6912 286663 175402 130457 209850 183960 130071 464851 227631 230560 42605 325278 249445
6901 249445 455030 378885 545439 392997 295289 313212 328317 393977 374347 266949 -38805
6890 -38805 180686 163883 397345 429059 431510 98019 434964 116112 268286 220120 439236
6879 439236 361703 402519 203998 250226 276659 254189 322432 347788 350022 108194 312038
6868 312038 205804 524308 397777 354273 216860 376284 199543 356776 426908 406053
6858 406053 419979 565671 514907 488598 332389 234784 400766 430884 265049 281139 272721
6847 272721 141965 427742 518484 313066 145674 195711 259364 299028 310902 500695 514840
6836 514840 400280 294466 398907 445667 305506 182302 336856 578620 587683 507093
$$ packed form
6912B86663j11261m4945P9393k5890n3889L34780k37220K929j87955K82673p5833
6901B49445K05585p6145J66554j52442r7708J7923J5105O5660j9630j07398l05754
6890c8805K19491j6803K33462L1714K451l33491L36945l18852J52174m8166K19116
6879D39236p7533M0816j98521M6228K6433k2470O8243K5356K234k41828K03844
6868C12038j06234L18504j26531m3504j37413J59424j76741J57233P0132k0855
6858D06053J3926J45692n0764k6309j56209r7605J65982L0118j65835J6090q418
6847B72721j30756K85777R0742k05418j67392N0037O3653L9664J1874J89793J4145
6836E14840j14560j05814J04441M6760j40161j23204J54554K41764R063q0590
$$ plain form
6826 507093 440831 297777 343520 432503 387501 351928 511940 535592 441812 400325 328323
6815 328323 399065 462097 370960 211375 362386 380821 283225 229112 287875 407175 350178
6804 350178 195026 196232 396372 333610 463043 487929 480323 435032 439388 379575 405438 506085
6792 506085 194273 369778 391129 451760 415155 576384 376941 355329 304460 337838 427756
6781 427756 377073 389045 337581 237837 292507 639332 550157 389820 291967 308283 295355
6770 295355 432764 333175 533965 495536 421264 272598 404445 217536 230307 283191 303207
6759 303207 449490 469539 356361 139815 341258 276559 400096 370266 330727 272195 338986
6748 338986 343323 247665 323995 377800 454686 375870 300297 407086 484193 264573 173393
$$ packed form
6826E07093o6262j43054M5743Q8983m5002l5573J60012K3652r3780m1487p2002
6815C28323P0742O3032r1137j59585J51011J8435r7596n4113N8763J19300n6997
6804C50178j55152J206K00140o2762J29433K4886p606m5291M356n9813K5863J00647
6792E06085l11812J75505K1351O0631l6605J61229j99443k1612n0869L3378Q9918
6781D27756n0683J1972n1464r9744N4670L46825q9175j60337r7853J6316j2928
6770B95355J37409r9589K00790l8429p4272j48666J31847j86909J2771N2884K0016
6759C03207J46283K0049j13178k16546K01443o4699J23537k9830l9539n8532O6791
6748C38986M337r5658P6330N3805P6886p8816p5573J06789P7107k19620r1180
$$ plain form
6737 173393 228840 228865 293459 283838 367279 266350 390766 257702 510056 488188 421910 503012
6725 503012 508962 345994 427101 404376 216895 304191 267704 316280 277908 258470 398521
6714 398521 568872 329077 382876 426398 506705 448227 461929 249650 467348 462331 352977
6703 352977 275937 336522 485794 408492 362774 308733 365768 382314 333901 253407 288014
6692 288014 377646 423508 500215 544729 517859 483588 368057 262947 496925 703367 680496
6681 680496 527925 381605 545772 544838 530014 378990 404114 333827 629932 530108 570388
6670 570388 470459 665361 506590 429307 630393 573470 568370 474553 509877 403987 474699
6659 474699 444192 561022 434796 567183 428241 446293 532291 673372 455159 484717
$$ packed form
6737A73393N5447K5O4594r621Q3441j00929J24416j33064K52354k1868o6278Q1102
6725E03012N950j62968Q1107k2725j87481Q7296l6487M8576l8372j9438J40051
6714C98521J70351k39795N3799M3522Q0307n8478J3702k12279K17698n017j09354
6703C52977p7040O0585J49272p7302m5718n4041N7035J6546m8413q0494L4607
6692B88014Q9632M5862P6707M4514k6870l4271j15531j05110K33978K06442k2871
6681F80496j52571j46320J64167r34j4824j51024K5124p0287K96105r9824M0280
6670E70388r9929J94902j58771p7283K01086n6923n100r3817L5324j05890P0712
6659D74699l0507J16830j26226J32387j38942J8052Q5998J41081k18213K9558
$$ plain form
6649 484717 293827 451620 452654 359005 337284 537089 544603 447307 426819 368499 503989
6638 503989 492897 489663 399826 527689 395892 445996 403940 424982 407612 573999 439278
6627 439278 428459 495348 373196 241330 331777 523224 539020 493599 521504 405573 491135
6616 491135 428925 539455 483096 490798 472665 440844 309309 166185 313548 306166 447346
6605 447346 391023 582722 383350 464354 384892 453396 522720 589945 434599 521457 585705
6594 585705 490657 529616 349706 362484 378347 458398 371774 556642 504748 455426 425549
6583 425549 524907 458331 532215 441508 401427 497346 466811 537464 392057 271286 368108
6572 368108 535141 362947 441013 467948 546478 498033 475999 457468 445461 588762 476374
$$ packed form
6649D84717j90890J57793J034r3649k1721J99805P514r7296k0488n8320J35490
6638E03989j1092l234q9837J27863j31797N0104m2056K1042j7370J66387j34721
6627D39278j0819O6889j22152j31866R0447J91447J5796m5421K7905j15931Q5562
6616D91135o2210J10530n6359P702j8133l1821j31535j43124J47363p382J41180
6605D47346n6323J91699j99372Q1004p9462O8504O9324O7225j55346Q6858O4248
6594E85705r5048L8959j79910J2778J5863Q0051q6624J84868n1894m9322k9877
6583D25549R9358o6576P3884r0707m0081R5919l0535P0653j45407j20771R6822
6572C68108J67033j72194P8066K6935P8530m8445k2034j8531j2007J43301j12388
$$ plain form
6561 476374 576799 674934 701814 422373 578252 596063 588389 398785 477939 504313 471782
6550 471782 365572 418813 548260 448455 591230 397607 653181 777821 604834 538954
6540 538954 596841 440073 513431 622527 645066 487683 556138 600468 686791 583763 471111
6529 471111 539517 461978 338731 495178 611710 571716 587446 589690 683321 642281 446219
6518 446219 509039 599262 604319 571125 555515 762074 665834 558663 499640 544438 442933
6507 442933 509794 517607 516970 493592 632573 743703 790733 742674 806042 730926 761519 730384
6495 730384 644431 750358 599919 598884 714241 837069 783168 851184 695502 668477 755933
6484 755933 689863 726782 694262 622030 565437 633161 565481 479832 635166 659418 556482
$$ packed form
6561D76374J00425R8135K6880k79441J55879J7811p674j89604P9154K6374l2531
6550D71782j06210N3241J29447r9805J42775j93623K55574J24640j72987o5880
6540E38954N7887j56768P3358J09096K2539j57383O8455M4330Q6323j03028j12652
6529D71111O8406p7539j23247J56447J16532l9994J5730K244R3631m1040j96062
6518D46219O2820R0223N057l3194j5610K06559r6240j07171n9023M4798j01505
6507D42933O6861P813o37k3378J38981J11130M7030m8059O3368p5116L0593l1135
6495G30384q5953J05927j50439j035J15357J22828n3901O8016j55682k7025Q7456
6484G55933o6070L6919l2520p2232n6593O7724o7680q5649J55334K4252j02936
$$ plain form
6473 556482 576211 444781 347926 544156 528711 640253 546473 492668 428748 550673 437112
6462 437112 371686 407322 471117 669966 551714 454713 489668 617158 516279 708122 734994
6451 734994 747875 625458 552126 481133 639418 436213 477805 526952 594954 687101 685407
6440 685407 678304 568437 437636 426244 623542 510004 497391 629534 718512 588502 651184
6429 651184 602032 632011 601189 688253 591045 683740 562602 596268 732727 794745 635771
6418 635771 702507 672060 737977 773236 902552 840173 738752 710920 742581 859285 701791
6407 701791 792694 885314 943119 763734 756702 721747 904772 681492 604043 548894 695995
6396 695995 476936 544364 584621 665737 617801 481457 573065 632386 607755 456559 701095
$$ packed form
6473E56482J9729j31430r6855J96230j5445J11542r3780n3805o3920J21925j13561
6462D37112o5426L5636O3795J98849j18252r7001L4955J27490j00879J91843K6872
6451G34994J2881j22417p3332p0993J58285k03205M1592M9147O8002R2147j694
6440F85407p103j09867j30801j1392J97298j13538j2613J32143Q8978j30010O2682
6429F51184m9152K9979l0822Q7064r7208R2695j21138L3666J36459O2018j58974
6418F35771O6736l0447O5917L5259J29316o2379j01421k7832L1661J16704j57494
6407G01791R0903R2620N7805j79385p032l4955J83025k23280p7449n5149J47101
6396F95995k19059O7428M0257Q1116m7936j36344R1608N9321k4631j51196K44536
$$ plain form
6385 701095 681445 720226 589028 710190 594333 721221 661653 759991 683097 782233 727122
6374 727122 691931 693393 758356 780189 599388 712444 685601 733521 695214 668264 512277
6363 512277 686931 622719 520503 503818 770006 645211 652273 553261 622502 580752 590906
6352 590906 676254 695629 562049 542174 798002 747042 704017 755252 672654 684417 589663
6341 589663 621778 848628 875169 990065 776513 940531 795636 747858 772876 875013
6331 875013 762653 630009 585787 755794 746472 663916 669445 743502 761475 657027 731105
6320 731105 865036 841930 819711 849802 843282 831973 749581 833726 744968 872393 895107
6309 895107 880317 731916 797901 915181 882284 794024 692162 828092 936908 821700
$$ packed form
6385G01095j9650L8781j31198J21162j15857J26888n9568R8338p6894R9136n5111
6374G27122l5191J462O4963K1833j80801J13056k6843M7920l8307k6950j55987
6363E12277J74654o4212j02216j6685K66188j24795P062r9012O9241m1750J0154
6352E90906Q5348J9375j33580j9875K55828n0960m3025N1235q2598J1763r4754
6341E89663L2115K26850K6541J14896k13552J64018j44895m7778K5018J02137
6331H75013j12360j32644m4222J70007r322q2556N529P4057J7973j04448P4078
6320G31105J33931k3106k2219L0091o520j1309q2392Q4145q8758J27425K2714
6309H95107j4790j48401O5985J17280l2897q8260j01862J35930J08816j15208
$$ plain form
6299 821700 867182 1069070 1160062 1105305 853178 871048 1013308 937435 929974 1010511 1085495
6288 1085495 1051790 992775 944030 984664 1059377 1212045 1179911 1158776 1303578 1377417 1313293
6277 1313293 1314910 1326972 1391576 1480865 1377690 1460045 1518947 1696884 1733122 1708730 1918364
6266 1918364 1995363 1970084 2004194 2078265 2161471 2276845 2261363 2318614 2180389 2456259 2525617
6255 2525617 2477748 2336161 2289484 2353427 2204544 2260783 1988175 1949339 1894771 1690605 1627220
6244 1627220 1751718 1680202 1414515 1524215 1637487 1677170 1522201 1406661 1450826 1600651
6234 1600651 1394770 1420605 1267942 1257623 1209673 1179730 1189095 1191153 1180913 1046203 952817
6223 952817 954359 1124737 1105412 1133582 1061961 1270996 1405182 1473357 1263868 1205329 1015801
$$ packed form
6299H21700M5482K01888R0992n4757k52127J7870J42260p5873p461Q0537P4984
6288A085495l3705n9015m8745M0634P4713J52668l2134k1135J44802P3839o4124
6277A313293J617J2062O4604Q9289j03175Q2355N8902J77937L6238k4392K09634
6266A918364P6999k5279L4110P4071Q3206J15374j5482N7251j38225K75870O9358
6255B525617m7869j41587m6677O3943j48883N6239k72608l8836n4568k04166o3385
6244A627220J24498p1516k65687J09700J13272L9683j54969j15540M4165J49825
6234A600651k05881K5835j52663j0319m7950k9943R365K058j0240j34710r3386
6223I52817J542J70378j9325K8170p1621K09035J34186O8175k09489n8539j89528
$$ plain form
6212 1015801 1083953 889670 973687 1073695 1082232 922202 995670 1058903 1016501 1025913 987734
6201 987734 964941 1006630 1104941 1102417 1232069 1279444 1183980 1182054 1260603 1259190 1210749 1105604
6189 1105604 1164063 1258716 1162234 1157167 1157200 972454 1129825 1241014 1277875 1179844 1199040 1338552
6177 1338552 1498780 1303098 1372208 1374622 1330991 1268045 1332737 1314678 1414391 1407177 1371417
6166 1371417 1474994 1523133 1643649 1589387 1779693 1776380 2077549 2067627 2417795 2290004 2646669
6155 2646669 2771243 2850801 3025476 3297502 3550905 3762111 3885063 3998436 4129464 3848168
6145 3848168 3546869 3344397 3337565 3109634 2801772 2661453 2623656 2304340 2157337 2125772
6135 2125772 2074173 1875976 1968053 1888654 1707061 1536828 1566763 1478905 1493998 1404460 1547527
$$ packed form
6212A015801O8152j94283Q4017J00008Q537j60030P3468O3233m2402R412l8179
6201I87734k2793M1689R8311k524J29652M7375r5464j926P8549j413m8441j05145
6189A105604N8459R4653r6482n067L3j84746J57371J11189L6861r8031J9196J39512
6177A338552J60228j95682O9110K414m3631o2946O4692j8059R9713p214l5760
6166A371417J03577M8139J20516n4262J90306l313L01169r922L50168j27791L56665
6155B646669J24574P9558J74675K72026K53403K11206J22952J13373J31028k81296
6145C848168l01299k02472o832k27931l07862j40319l7797l19316j47003l1565
6135B125772n1599j98197R2077p9399j81593j70233K9935q7858J5093q9538J43067
$$ plain form
6124 1547527 1565414 1636896 1360979 1496149 1277722 1136594 1233613 1381728 1347781 1354802 1385000
6113 1385000 1347867 1380661 1229338 1140088 1079894 1237566 1153312 1271687 1160968 1314018
6103 1314018 1236954 1020417 961125 1113741 1112486 1303898 1217912 1103121 1133320 1240585 1294689
6092 1294689 1083119 1076821 1074512 1267213 1212890 1311073 1410664 1478159 1370206 1413617 1457748
6081 1457748 1448430 1644384 1576301 1775114 1922472 2031222 2049887 1896082 1894071 1988032 1940240
6070 1940240 1803529 1718705 1573237 1456928 1430284 1355057 1287422 1544969 1270121 1167078
6060 1167078 1140125 1350702 1143505 991684 939545 1010590 1044257 1065827 1182699 1052792
6050 1052792 1038696 928378 1123547 942971 1007604 983813 936132 900898 1007606 1085128 1137673
$$ packed form
6124A547527J7887P1482k75917J35170k18427j41128R7019J48115l3947P021L0198
6113A385000l7133L2794j51323q9250o0194J57672q4254J18375j10719J53050
6103A314018p7064k16537n9292J52616j255J91412q5986j14791L0199J07265N4104
6092A294689k11570o298k309J92701n4323R8183R9591O7495j07953M3411M4131
6081A457748r318J95954o8083J98813J47358J08750J8665j53805k011R3961m7792
6070A940240j36711q4824j45468j16309k6644p5227o7635K57547k74848j03043
6060A167078k6953K10577k07197j51821n2139P1045L3667K1570J16872j29907
6050A052792j4096j10318J95169j80576O4633k3791m7681l5234J06708P7522N2545
$$ plain form
6039 1137673 1062393 869343 997736 971141 1125625 1153186 1185990 1220620 1212061 1286445 1245572
6028 1245572 1268007 1059110 991811 1106214 1187003 1029700 1168571 1073105 1153607 1140948 1042776
6017 1042776 1017232 1092185 975770 862721 1021716 975000 1077319 1015651 1050939 877580
6007 877580 1062083 1084156 1221203 1001871 1011081 1077689 1174060 860033 936837 1252592 1110907
5996 1110907 1136275 1022846 1115523 1075515 1181186 1101777 1167165 1122391 1216178 1082327 1045319
5985 1045319 977056 1029009 1050150 1002504 896953 888848 947558 1018341 1087625 1092074 1071444 1028149
5973 1028149 1063155 1072453 1133295 1180204 956413 979832 1076457 1264046 1229537 1282777 1089079
5962 1089079 1080979 1041370 992657 1174301 1211127 1082008 941058 941205 1117049 1379617 1188974
$$ packed form
6039A137673p5280j93050J28393k6595J54484K7561L2804L4630q559P4384m0873
6028A245572K2435k08897o7299J14403Q0789j57303J38871r5466Q0502j2659r8172
6017A042776k5544P4953j16415j13049J58995m6716J02319o1668L5288j73359
6007H77580J84503K2073J37047k19332R210O6608R6371l14027P6804L15755j41685
5996A110907K5368j13429R2677m0008J05671p9409O5388m4774R3787j33851l7008
5985A045319o8263N1953K1141m7646j05551q105N8710P0783O9284M449k0630m3295
5973A028149L5006R298O0842M6909k23791K3419R6625J87589l4509N3240j93698
5962A089079q100l9609m8713J81644L6826j29119j40950J47J75844K62568j90643
$$ plain form
5951 1188974 1294775 1320337 1314372 1288727 1379434 1330862 1284736 1343897 1382455 1355110 1405723
5940 1405723 1492215 1356929 1393732 1329036 1338196 1520439 1513841 1490780 1694469 1686692 1498668
5929 1498668 1612016 1564692 1546265 1487530 1477311 1600312 1764764 1543764 1423019 1388207
5919 1388207 1419006 1523706 1505968 1542360 1460545 1504120 1529986 1386068 1367560 1464278 1498576
5908 1498576 1464586 1422254 1532119 1589836 1388890 1357058 1516902 1607364 1551926 1598795 1420780
5897 1420780 1494487 1510463 1440112 1325728 1352330 1545443 1465498 1490111 1508075 1457665 1418344
5886 1418344 1528388 1388568 1482102 1484601 1430474 1376909 1377817 1382946 1489990 1554161 1363873
5875 1363873 1460591 1571432 1551657 1509350 1586572 1359469 1548778 1556371 1433842 1375994 1488099
$$ packed form
5951A188974J05801K5562n965k5645R0707m8572m6126N9161L8558k7345N0613
5940A405723Q6492j35286L6803o4696R160J82243o598k3061K03689p777j88024
5929A498668J13348m7324j8427n8735j0219J23001J64452k21000j20745l4812
5919A388207L0799J04700j7738L6392q1815M3575K5866j43918j8508R6718L4298
5908A498576l3990m2332J09865N7717k00946l1832J59844R0462n5438M6869j78015
5897A420780P3707J5976p0351j14384K6602J93113p9945K4613J7964n0410l9321
5886A418344J10044j39820R3534K499n4127n3565R08N129J07044O4171j90288
5875A363873R6718J10841j9775m2307P7222k27103J89309P593j22529n7848J12105
$$ plain form
5864 1488099 1448439 1420832 1558181 1511065 1479239 1407256 1380978 1352643 1404241 1354421 1390459
5853 1390459 1564463 1507883 1479962 1511417 1437798 1695641 1655472 1481325 1570139 1612442 1525756
5842 1525756 1591467 1572298 1577898 1586901 1635503 1561658 1797043 1748217 1716922 1735985 1600167
5831 1600167 1667830 1792654 1741047 1688336 1813627 1823658 1980064 1909518 1826220 1743387 1759862
5820 1759862 1740933 1677740 1728522 1737398 1824911 1877867 1860604 1943598 1785186 1934796 1849688
5809 1849688 1895076 1878354 1893475 1759344 1772040 2043200 2047575 1947457 1933155 1931764 1853884
5798 1853884 1926663 1993190 2115352 1995841 2060453 1881894 1940406 2033606 2081476 2225150 2311537
5787 2311537 2172395 2170055 2126985 2328284 2312816 2326008 2533731 2368103 2302795 2429295 2535064
$$ packed form
5864A488099l9660k7607J37349m7116l1826p1983k6278k8335N1598m9820L6038
5853A390459J74004n6580k7921L1455p3619K57843m0169j74147Q8814M2303q6686
5842A525756O5711j9169N600R003M8602p3845K35385m8826l1295J9063j35818
5831A600167O7663J24824n1607n2711J25291J0031J56406p0546q3298q2833J6475
5820A759862j8929o3193N0782Q876Q7513N2956j7263Q2994j58412J49610q5108
5809A849688M5388j6722J5121j34131J2696K71160M375j00118j4302j391p7880
5798A853884P2779O6527J22162j19511O4612j78559N8512R3200M7870J43674Q6387
5787B311537j39142k340m3070K01299j5468J3192K07723j65628o5308J26500J05769
$$ plain form
5776 2535064 2356036 2340489 2427277 2493663 2443977 2450808 2505438 2819933 2701618 2637939 2792889
5765 2792889 2852508 2884724 2857456 2950699 3208978 3226375 3218633 3337264 3394093 3443958 3577118
5754 3577118 3712484 3594755 3703752 3694141 3723180 3821413 3813873 3610110 3626743 3571207 3428999
5743 3428999 3374814 3393854 3352477 3198455 3346881 3416677 3447261 3218344 3031603 3146551
5733 3146551 3216470 3256136 3185626 3299294 3276477 3180945 3206817 3274244 3380092 3316620 3147097
5722 3147097 3362776 3301987 3203773 3359972 3322667 3259866 3571185 3463159 3558959 3529972 3415886
5711 3415886 3479844 3524291 3568131 3652116 3694810 3654496 3554253 3677896 3751706 3641331 3635258
5700 3635258 3610717 3852893 3797194 3832714 3738605 3909555 3805814 3894288 3834693 4012017 3948575
$$ packed form
5776B535064j79028j5547Q6788O6386m9686O831N4630L14495j18315o3679J54950
5765B792889N9619L2216k7268R3243K58279J7397p742J18631N6829M9865J33160
5754C577118J35366j17729J08997r611K9039R8233p540k03763J6633n5536j42208
5743C428999n4185J9040m1377j54022J48426O9796L0584k28917j86741J14948
5733C146551O9919L9666p0510J13668k2817r5532K5872O7427J05848o3472j69523
5722C147097K15679o0789r8214J56199l7305o2801L11319j08026R5800k8987j14086
5711C415886O3958M4447M3840Q3985M2694m0314j00243J23643P3810j10375o073
5700C635258k4541K42176n5699L5520r4109J70950j03741Q8474n9595J77324o3442
$$ plain form
5689 3948575 3858343 3944947 4023314 4009945 4092506 4324865 4234495 4218124 4155473 4430991 4452573
5678 4452573 4489944 4303547 4474838 4501866 4575190 4695045 4807964 4664060 4810515 4977902
5668 4977902 5181750 5349104 5068775 5017206 5157590 5250397 5228844 5416922 5422606 5571422
5658 5571422 5590985 5709044 5736110 5816116 5593158 5698400 5959604 5952405 6031296 6129336 6162059
5647 6162059 6265935 6328061 6513432 6599462 6585351 6466655 6828918 6884829 6953659 6991919 7060704
5636 7060704 7106849 7157507 7571802 7670140 7760438 7733565 7810486 7917558 7939442 8049797 8236189
5625 8236189 8514515 8649872 8658915 8967332 9185665 9261213 9248091 9423092 9604771 9636023
5615 9636023 9672677 9989174 10175935 10316896 10401801 10741160 10900399 10990735 11199679 11534098
$$ packed form
5689C948575r0232Q6604P8367j3369Q2561K32359r0370j6371o2651K75518K1582
5678D452573L7371j86397J71291K7028P3324J19855J12919j43904J46455J67387
5668D977902K03848J67354k80329n1569J40384R2807k1553J88078N684J48816
5658E571422J9563J18059K7066Q0006k22958J05242K61204p199P8891R8040L2723
5647F162059J03876O2126J85371Q6030j4111j18696L62263N5911O8830L8260O8785
5636G060704M6145N0658M14295R8338R0298k6873P6921J07072K1884J10355J86392
5625H236189K78326J35357R043L08417K18333P5548j3122J75001J81679L1252
5615I636023L6654L16497J86761J40961Q4905L39359J59239R0336K08944L34419
$$ plain form
5605 11534098 11521244 11541835 11843129 12192550 12300447 12402108 12682655 13099075 13388724 13208734
5595 13208734 13471384 13632331 13960702 14189345 14496033 14751475 15022289 15044812 15363969 15536385
5585 15536385 15817702 16074194 16343807 16584849 16775764 17227408 17523218 17489836 17653110 18130315
5575 18130315 18466610 18556370 18735351 19139298 19323645 19569928 19764527 20031982 20342719 20456356
5565 20456356 20568172 20914572 21159616 21270437 21405662 21658527 21832163 21896544 21939428 22280554
5555 22280554 22425271 22493297 22363999 22411289 22438750 22538370 22570759 22834060 22772581 22657952
5545 22657952 22818337 22841330 22845337 22552428 22728438 22808150 22607129 22471068 22383872 22550563
5535 22550563 22300585 22075604 22123539 22058353 21772625 21618721 21756387 21710718 21523955 21297491
$$ packed form
5605A1534098j2854K0591L01294L49421J07897J01661K80547M16420K89649j79990
5595A3208734K62650J60947L28371K28643L06688K55442K70814K2523L19157J72416
5585A5536385K81317K56492K69613K41042J90915M51644K95810l3382J63274M77205
5575A8130315L36295Q9760J78981M03947J84347K46283J94599K67455L10737J13637
5565B0456356J11816L46400K45044J10821J35225K52865J73636O4381M2884L41126
5555B2280554J44717O8026j29298M7290K7461R9620L2389K63301o1479j14629
5545B2657952J60385K2993M007k92909J76010P9712k01021j36061q7196J66691
5535B2550563k49978k24981M7935o5186k85728j53904J37666m5669j86763k26464
$$ plain form
5525 21297491 21090608 20909594 20850673 20899623 20795515 20775531 20675163 20585177 20577368 20420237
5515 20420237 20417008 20503187 20634775 20458920 20583166 20613173 20557829 20546422 20511247 20704459 20806197
5504 20806197 20853896 20818591 21232909 21322699 21557612 21700104 22296315 22645893 22912516 23062622
5494 23062622 23619246 24177658 24517202 24705701 25231146 25488368 26076957 26932540 27507578
5485 27507578 28200954 29015209 30012155 30976738 32118925 33141239 34675651 36182758 37930875
5476 37930875 39614424 42003530 44222132 46814992 49885602 53560182 57687539 62267441
5468 62267441 67189911 73309703 80469139 88375066 97728822 108842332 120861166 134327804
5460 134327804 148828549 163891846 179457604 195202391 210698824 225876030 240054427
$$ packed form
5525B1297491k06883j81014n8921M8950j04108j9984j00368q9986p809j57131
5515B0420237l229Q6179J31588j75855J24246L0007n5344j1407l5175J93212J01738
5504B0806197M7699l5305M14318Q9790K34913J42492N96211L49578K66623J50106
5494B3062622N56624N58412L39544J88499N25445K57222N88589Q55583N75038
5485B7507578O93376Q14255R96946R64583J142187J022314J534412J507107J748117
5476C7930875J683549K389106K218602K592860L070610L674580M127357M579902
5468F2267441M922470O119792P159436P905927R353756J1113510J2018834J3466638
5460A34327804J4500745J5063297J5565758J5744787J5496433J5177206J4178397
$$ plain form
5453 240054427 251880198 260591518 264722417 263687861 257837328 248095083 235354156 220832473
5445 220832473 205490708 189794739 173966931 158433164 143500460 129401366 116180137
5438 116180137 104145840 93396748 84067893 75985104 68935538 62683523 57613978 53292711
5430 53292711 49370449 45933974 42754098 39875962 37275683 35042773 33005436 31296818
5422 31296818 29501582 27931618 26688475 25388089 24300031 23411137 22483104 21290367
5414 21290367 20498422 19942433 19293970 18527333 17912311 17486617 16829930 16266060 15897833
5405 15897833 15592144 15145125 14678168 14383713 14137488 13739682 13608428 13075639 12805439
5396 12805439 12562087 12228573 11944154 11540112 11075686 10879204 10709768 10355082 10014344
$$ packed form
5453B40054427J1825771Q711320M130899j034556n850533r742245j2740927j4521683
5445B20832473j5341765j5695969j5827808j5533767j4932704j4099094j3221229
5438A16180137j2034297j0749092r328855q082789p049566o252015n069545m321267
5430E3292711l922262l436475l179876k878136k600279k232910k037337j708618
5422C1296818j795236j569964j243143j300386j088058q88894r28033j192737
5414B1290367p91945n55989o48463p66637o15022m25694o56687n63870l68227
5405A5897833l05689m47019m66957k94455k46225l97806j31254n32789k70200
5396A2805439k43352l33514k84419m04042m64426j96482j69436l54686l40738
$$ plain form
5387 10014344 9770167 9876687 9476923 9142956 8822600 8930361 8657182 8278711 8139746
5378 8139746 8083096 7797689 7603846 7489556 7317838 7049742 6851560 6704461 6743943 6578369
5368 6578369 6299842 6247631 6212443 6009751 5919567 5711427 5539816 5580006 5236333 5222582
5358 5222582 5156499 5008438 4905908 5089397 4818727 4695141 4580139 4505283 4299664 4267983
5348 4267983 4216476 4440835 4179960 3898607 3982886 4171063 3989436 3835963 3899409 3756773
5338 3756773 3799674 3590332 3597451 3620222 3596261 3314847 3349697 3230695 3406351 3212246 3204160
5327 3204160 3203871 3079977 3052318 3206035 3142022 3003652 3119274 3169395 3124702 2979549 2918090
5316 2918090 2997896 2839907 2780607 2783886 2827882 2668413 2527240 2568494 2789605 2713867 2585380
$$ packed form
5387A0014344k44177J06520l99764l33967l20356J07761k73179l78471j38965
5378H139746n6650k85407j93843j14290j71718k68096j98182j47099L9482j65574
5368F578369k78527n2211l5188k02692r0184k08140j71611M0190l43673j3751
5358E222582o6083j48061j02530J83489k70670j23586j15002p4856k05619l1681
5348D267983n1507K24359k60875k81353Q4279J88177j81627j53473O3446j42636
5338C756773M2901k09342P119K2771k3961k81414L4850j19002J75656j94105q086
5327C204160k89j23894k7659J53717o4013j38370J15622N0121m4693j45153o1459
5316B918090P9806j57989n9300L279M3996j59469j41173M1254K21111p5738j28487
$$ plain form
5305 2585380 2655174 2645501 2579271 2383883 2445282 2474066 2530995 2429964 2474849 2379252 2404606
5294 2404606 2442082 2393387 2207552 2168129 2305438 2606252 2475206 2231308 2199111 2217718
5284 2217718 2208680 2215345 2150788 2218748 2190669 2049725 1959537 2218725 2164678 2000195 2006302
5273 2006302 1932805 1928112 2102241 2213267 2017672 2085027 2068257 2175820 2238726 2181788 1978058
5262 1978058 2219326 2123283 2127655 2258146 2222580 1947594 2080255 2251610 2230402 2055877
5252 2055877 1966960 2065415 2075293 1880190 1831175 1965924 1973604 1958240 1782833 1788267 1834035
5241 1834035 1916981 1673893 1719604 1905827 1938995 1716169 1781343 1662687 1575613 1541574 1709520
5230 1709520 1750714 1711024 1678734 1666441 1660494 1612734 1701575 1799677 1763657 1711867 1915805
$$ packed form
5305B585380O9794r673o6230j95388O1399K8784N6929j01031M4885r5597K5354
5294B404606L7476m8695j85835l9423J37309L00814j31046k43898l2197J8607
5284B217718r038O665o4557O7960k8079j40944r0188K59188n4047j64483O107
5273B006302p3497m693J74129J11026j95595O7355j6770J07563O2906n6938k03730
5262A978058K41268r6043M372J30491l5566k74986J32661J71355k1208j74525
5252B055877q8917R8455R878j95103m9015J34749P680j5364j75407N434M5768
5241A834035Q2946k43088M5711J86223L3168k22826O5174j18656q7074l4039J67946
5230A709520M1194l9690l2290j2293n947m7760Q8841R8102l6020n1790K03938
$$ plain form
5219 1915805 1998004 1801067 1839796 1761131 1615548 1742415 1615417 1540562 1609433 1818520
5209 1818520 1708602 1601534 1640750 1605255 1503610 1590952 1438404 1674879 1820946 1687833
5199 1687833 1509447 1500676 1517053 1770828 1645720 1562899 1857182 1771096 1445587 1568142
5189 1568142 1869021 1748378 1580455 1455731 1671241 1831032 1647959 1493520 1728879 1621772
5179 1621772 1705891 1748011 1800228 1610353 1813291 1818760 1704427 1742774 1840860 1984641 2024929
5168 2024929 1857736 1950868 2175221 2143473 1885099 2108716 2426975 2258768 2213239 2258360
5158 2258360 2441069 2469597 2462038 2497426 2807032 2746761 2792074 2866227 3063025 2937703 2928627
5147 2928627 3034650 3105429 2939869 2999554 3283945 3204533 3159586 3162479 3187966 2940212 3009172
$$ packed form
5219A915805Q2199j96937L8729p8665j45583J26867j26998p4855O8871K09087
5209A818520j09918j07068L9216l5495j01645Q7342j52548K36475J46067j33113
5199A687833j78386q771J6377K53775j25108q2821K94283q6086l25509J22555
5189A568142L00879j20643j67923j24724K15510J59791j83073j54439K35359j07107
5179A621772Q4119M2120N2217j89875K02938N469j14333L8347R8086J43781M0288
5168B024929j67193R3132K24353l1748k58374K23617L18259j68207m5529M5121
5158B258360J82709K8528p559L5388L09606o0271M5313P4153J96798j25322r076
5147B928627J06023P0779j65560N9685K84391p9412m4947K893K5487k47754O8960
$$ plain form
5136 3009172 2963384 3083922 2891907 2733900 2859407 2974666 2796012 2723641 2749410 2836373
5126 2836373 2768019 2478034 2573980 2741392 2523817 2292545 2375313 2475406 2270108 2279597
5116 2279597 2217671 2296092 2297692 2296808 2355453 2350169 2175822 2128361 2470588 2428957 2457955 2472020
5104 2472020 2552594 2403542 2313200 2366366 2535512 2462275 2057524 2329433 2621079 2191902
5094 2191902 1991232 2143073 2439862 2282534 2253811 2177079 2219846 2207883 2064701 2347400
5084 2347400 2371191 2151174 2239044 2523995 2627450 2435503 2363895 2396865 2469240 2233694
5074 2233694 2350664 2568356 2558099 2381897 2472872 2552635 2480014 2527497 2621808 2747102 2672953
5063 2672953 2536560 2710151 2772795 2655243 2682896 2940998 3019031 2945492 3056474 3097743
$$ packed form
5136C009172m5788J20538j92015j58007J25507J15259j78654p2371K5769Q6963
5126B836373o8354k89985R5946J67412k17575k31272Q2768J00093k05298R489
5116B279597o1926P8421J600q84N8645n284j74347m7461L42227m1631K8998J4065
5104B472020Q0574j49052r0342N3166J69146p3237m04751K71909K91646m29177
5094B191902k00670J51841K96789j57328k8723p6732M2767j1963j43182K82699
5084B347400K3791k20017Q7870K84951J03455j91947p1608L2970P2375k35546
5074B233694J16970K17692j0257j76202R0975P9763p2621M7483R4311J25294p4149
5063B672953j36393J73591O2644j17552K7653K58102P8033p3539J10982M1269
$$ plain form
5053 3097743 3106358 2914187 2902536 3009321 3083948 2842105 2901501 2851444 2699757 2647938 2753318
5042 2753318 3028362 2999834 2790690 2812981 2952031 2875964 2706815 2805023 2991168 2958616
5032 2958616 3092689 3059646 3132891 2959592 2942860 3124138 3114593 2815773 2892203 2862590 2847430
5021 2847430 2878079 2956882 2992880 3134075 2872988 2928228 3152647 2958950 2868700 3092394
5011 3092394 3105558 2947655 3069742 2953476 3152424 2891256 2867050 3036387 3371947 3115762
5001 3115762 3137834 3232836 3246445 3221813 3238186 3164017 3346811 3440252 3288273 3479427 3673366
4990 3673366 3465967 3513204 3691502 3769073 3770346 3764968 3696534 3659649 3730405 3808803 4029386
4979 4029386 3863167 3868424 4005136 4185334 4154428 4098849 4265374 4421193 4373799 4100467
$$ packed form
5053C097743Q615j92171j1651J06785P4627k41843N9396n0057j51687n1819J05380
5042B753318K75044k8528k09144K2291J39050p6067j69149R8208J86145l2552
5032B958616J34073l3043P3245j73299j6732J81278r545k98820P6430k9613j5160
5021B847430L0649P8803L5998J41195k61087N5240K24419j93697r0250K23694
5011C092394J3164j57903J22087j16266J98948k61168k4206J69337L35560k56185
5001C115762K2072R5002J3609k4632J6373p4169J82794R3441j51979J91154J93939
4990C673366k07399M7237J78298P7571J273n378o8434l6885P0756P8398K20583
4979D029386j66219N257J36712J80198l0906n5579J66525J55819m7394k73332
$$ plain form
4969 4100467 4235818 4282099 4348263 4412807 4582593 4627908 4371109 4463240 4688687 4716462 4740757
4958 4740757 4885116 4787658 4894174 4846865 4917427 5006360 5028422 5093533 5223264 5380512 5340647
4947 5340647 5487070 5671777 5681168 5654195 5640534 5793410 5960869 6066109 6115047 6128895 6247412
4936 6247412 6173990 6415071 6673387 6821865 6729981 6849832 7051139 7246220 7254985 7435959
4926 7435959 7732322 7931294 7963271 8066543 8220974 8317578 8533424 8789189 8934870 8907908
4916 8907908 9013386 9197758 9608114 9738512 9911711 10140673 10395977 10550768 10964911 11272214
4906 11272214 11494721 11622330 12114379 12495251 12879097 13060936 13354729 13993938 14508581
4897 14508581 14912042 15354703 15904420 16371526 16978610 17711319 18553753 19136978 19955536
$$ packed form
4969D100467J35351M6281O6164O4544J69786M5315k56799R2131K25447K7775K4295
4958D740757J44359r7458J06516m7309P0562Q8933K2062O5111J29731J57248l9865
4947E340647J46423J84707R391k6973j3661J52876J67459J05240M8938J3848J18517
4936F247412p3422K41081K58316J48478r1884J19851K01307J95081Q765J80974
4926G435959K96363J98972L1977J03272J54431R6604K15846K55765J45681k6962
4916H907908J05478J84372M10356J30398J73199K28962K55304J54791M14143L07303
4906A1272214K22507J27609M92049L80872L83846J81839K93793O39209N14643
4897A4508581M03461M42661N49717M67106O07084P32709Q42434N83225Q18558
$$ plain form
4888 19955536 20901809 22202939 23361327 24593126 26036565 27529402 29127287 30940489
4880 30940489 33050862 34866394 36779331 39010410 41285169 43420182 45416380 47295138
4872 47295138 49159812 50736239 52486708 54144076 55553937 56948842 58215314 59603333
4864 59603333 60967143 62398050 63877707 65538640 67433187 69399101 71622656 74141538
4856 74141538 76987057 80091138 83429545 87238867 91461787 95579129 99831348 104114384
4848 104114384 108478822 112549175 116650052 120276813 123568196 126290016 128268930 129263195
4840 129263195 129056769 127843609 126141791 123665714 120703587 118103847 115765340 113622379
4832 113622379 111531895 110289190 109597715 109543408 109794924 110887048 112563344 114687642 116762989
$$ packed form
4888A9955536R46273J301130J158388J231799J443439J492837J597885J813202
4880C0940489K110373J815532J912937K231079K274759K135013J996198J878758
4872D7295138J864674J576427J750469J657368J409861J394905J266472J388019
4864E9603333J363810J430907J479657J660933J894547J965914K223555K518882
4856G4141538K845519L104081L338407L809322M222920M117342M252219M283036
4848A04114384M364438M070353M100877L626761L291383K721820J978914R94265
4840A29263195k06426j213160j701818k476077k962127k599740k338507k142961
4832A13622379k090484j242705o91475n4307K51516J092124J676296K124298K075347
$$ plain form
4823 116762989 119148392 121174512 122535530 123387275 123392217 122441892 120544700 117464769 113659112
4814 113659112 109314531 104331843 99019644 93672838 88446784 83049279 78136037 73214043
4806 73214043 69012749 65389210 61981650 58930346 56379269 54082374 52667603 51521807
4798 51521807 50428099 49674199 49400228 49395990 49741357 50092946 50733835 51655554 52801696
4789 52801696 54009742 55715110 57735352 59889819 62764030 66145592 70215190 74966765
4781 74966765 80599733 86893754 94011558 101841787 109925798 117696610 124798272 130442786
4773 130442786 134621868 136933096 137325106 135614158 132252525 127416843 121644306 115774543
4765 115774543 110371633 105604057 101620237 98650700 97053349 96865316 97891460 100527314
$$ packed form
4823A16762989K385403K026120J361018Q51745M942r50325j897192l079931l805657
4814A13659112m344581m982688n312199n346806n226054n397505m913242m921994
4806G3214043m201294l623539l407560l051304k551077k296895j414771j145796
4798E1521807j093708p53900k73971m238L45367L51589O40889R21719J146142
4789E2801696J208046J705368K020242K154467K874211L381562M069598M751575
4781G4966765N632968O294021P117804P830229Q084011P770812P101662N644514
4773A30442786M179082K311228L92010j710948l361633m835682n772537n869763
4765A15774543n402910m767576l983820k969537j597351j88033J026144K635854
$$ plain form
4757 100527314 104656337 110237888 117519065 125455143 133723666 140931889 145949856 147828477
4749 147828477 146676935 142871622 137012577 129861457 122721483 115764878 109190325 103609175
4741 103609175 98406015 93603216 89021542 84669012 80595770 76642609 73059622 70016846
4733 70016846 67528731 65462516 63779778 62692450 61706936 61065429 60523724 59915538 59091266
4724 59091266 57973574 56785432 55507835 54290237 52731020 51307061 49711605 47814459
4716 47814459 45526709 43129020 40558844 37925254 35489781 33207034 31330560 29372420
4708 29372420 27460552 25825856 24515006 23249815 22004994 21091215 20303317 19522199 18808728
4699 18808728 18196200 17622550 17133068 16555674 15948416 15602117 15155300 14706381 14403470
$$ packed form
4757A00527314M129023N581551P281177P936078Q268523P208223N017967J878621
4749A47828477j151542l805313n859045p151120p139974o956605o574553n581150
4741A03609175n203160m802799m581674m352530m073242l953161l582987l042776
4733G0016846k488115k066215j682738j087328r85514o41507n41705o08186q24272
4724E9091266j117692j188142j277597j217598j559217j423959j595456j897146
4716D7814459k287750k397689k570176k633590k435473k282747j876474j958140
4708B9372420j911868j634696j310850j265191j244821r13779p87898p81118p13471
4699A8808728o12528n73650m89482n77394o07258l46299m46817m48919l02911
$$ plain form
4690 14403470 14085133 13680248 13500575 13198257 12761293 12505662 12373006 12381570 12299181 11957122
4680 11957122 11760760 11613438 11653693 11485996 11342225 11343291 11210559 11042187 11154734 11200625
4670 11200625 11312766 11270652 11374477 11625959 11669075 11623799 11868435 12117153 12148504 12141458
4660 12141458 12377786 12255316 12185232 12113471 11748499 11768491 11686901 11537018 11194225 10988691
4650 10988691 10706435 10502957 10691378 10551550 10369012 10204730 10199570 10320998 10215492 10243213
4640 10243213 10513886 10524643 10341222 10499091 10671266 10631983 10739698 10883763 10946407 11107132
4630 11107132 11231515 11493446 11801321 11898539 12017046 12351798 12738143 12956657 13424738 13888274
4620 13888274 14248450 14935492 15552339 16256508 17175664 18117080 19258940 20738054 22462330
$$ packed form
4690A4403470l18337m04885j79673l02318m36964k55631j32656Q564q2389l42059
4680A1957122j96362j47322M0255j67697j43771J066j32732j68372J12547M5891
4670A1200625J12141m2114J03825K51482M3116m5276K44636K48718L1351p046
4660A2141458K36328j22470p0084p1761l64972J9992q1590j49883l42793k05534
4650A0988691k82256k03478J88421j39828j82538j64282n160J21428j05506K7721
4640A0243213K70673J0757j83421J57869J72175l9283J07715J44065O2644J60725
4630A1107132J24383K61931L07875R7218J18507L34752L86345K18514M68081M63536
4620A3888274L60176O87042O16847P04169R19156R41416J141860J479114J724276
$$ plain form
4611 22462330 24520373 27144701 30090143 33511149 36904091 39950458 42754010 45178700
4603 45178700 47438955 50411868 54323275 59063884 63986981 68304882 71307357 72909231
4595 72909231 73792612 74932867 76948591 80237734 83982182 87372386 89072811 88549904
4587 88549904 86142908 82581300 79278739 76924972 75958433 75156358 74119343 71699567
4579 71699567 68076932 63767127 59296736 54938238 51691157 49231315 47014124 44370460
4571 44370460 41696916 38782715 35584183 32323493 29785095 27596187 25684440 24180734
4563 24180734 23149779 22311373 21697053 21270742 20752810 20558830 19937642 19734155 19832439
4554 19832439 20061325 19897322 19888860 19765881 19913916 20090037 20217586 20416192 20786886 20921206
$$ packed form
4611B2462330K058043K624328K945442L421006L392942L046367K803552K424690
4603D5178700K260255K972913L911407M740609M923097M317901L002475J601874
4595G2909231Q83381J140255K015724L289143L744448L390204J700425n22907
4587H8549904k406996l561608l302561k353767r66539q02075j037015k419776
4579G1699567l622635m309805m470391m358498l247081k459842k217191k643664
4571D4370460k673544k914201l198532l260690k538398k188908j911747j503706
4563B4180734j030955q38406o14320m26311n17932j93980o21188k03487R8284
4554A9832439K28886j64003q462j22979J48035J76121J27549J98606L70694J34320
$$ plain form
4544 20921206 21182914 21703870 21976137 22486356 22823376 23211965 23670879 24406639 24977647
4535 24977647 25762992 26395759 27092103 27730167 28621153 29465322 30417342 31435459 32503871
4526 32503871 33727155 34840415 36186352 37571970 39092457 40794871 42859030 44961563
4518 44961563 47250092 50025113 53170722 56323922 60134074 64416047 69173603 74325393
4510 74325393 80246710 86877137 94590663 103060084 112737103 124076680 137607981 153835962
4502 153835962 173659711 197826170 227506369 263829221 307330327 357535657 411146514
4495 411146514 461755313 500614156 520525578 517591723 493161026 452593003 403155324
4488 403155324 351918008 304459781 262876778 228033200 199457491 175784529 155983522
$$ packed form
4544B0921206K61708N20956K72267N10219L37020L88589M58914P35760N71008
4535B4977647P85345O32767O96344O38064Q90986Q44169R52020J018117J068412
4526C2503871J223284J113260J345937J385618J520487J702414K064159K102533
4518D4961563K288529K775021L145609L153200L810152M281973M757556N151790
4510G4325393N921317O630427P713526Q469421R677019J1339577J3531301J6227981
4502A53835962J9823749K4166459K9680199L6322852M3501106N0205330N3610857
4495D11146514N0608799L8858843J9911422k933855k4430697m0568023m9437679
4488D03155324n1237316m7458227m1583003l4843578k8575709k3672962j9801007
$$ plain form
4481 155983522 139442095 125041115 112702894 102186069 92751456 84696177 77717393
4474 77717393 71591092 66456362 62091956 58088517 54716549 51830067 49039879 46624625
4466 46624625 44409333 42340842 40154439 38134200 36127686 34399216 33011416 31590303
4458 31590303 30203653 29100833 28145939 27039592 26303545 25414759 24726670 24018619 23392545
4449 23392545 22974502 22474408 21782537 21282878 20788230 20369886 19862870 19365636 18923006
4440 18923006 18532557 17992655 17210054 16470106 16184641 16003778 15429096 14924908 14571928
4431 14571928 14149104 13704265 13408112 12985600 12713235 12322066 11969609 11555962 11307946
4422 11307946 10912261 10729554 10511790 10280089 10024378 9822893 9491512 9070369 8968051
$$ packed form
4481A55983522j6541427j4400980j2338221j0516825r434613q055279o978784
4474G7717393o126301n134730m364406m003439l371968k886482k790188k415254
4466D6624625k215292k068491k186403k020239k006514j728470j387800j421113
4458C1590303j386650j102820r54894j106347p36047q88786o88089p08051o26074
4449B3392545m18043n00094o91871m99659m94648m18344n07016m97234m42630
4440A8923006l90449n39902p82601p39948k85465j80863n74682n04188l52980
4431A4571928m22824m44839k96153m22512k72365l91169l52457m13647k48016
4422A1307946l95685j82707k17764k31701k55711k01485l31381m21143j02318
$$ plain form
4413 8968051 8739660 8416848 8133075 7866521 7765826 7732676 7452739 7223931 6988848 6708716
4403 6708716 6603414 6601380 6513078 6259880 6114430 5981756 5949836 6011055 5788259 5737307 5500146
4392 5500146 5334683 5267299 5321734 5071972 4985886 4951381 4978678 4865042 4672632 4630252 4648638
4381 4648638 4651684 4333627 4188204 4272698 4184445 4110458 4048633 3926151 3801820 3753551 3666547
4370 3666547 3495122 3569925 3398814 3435573 3367577 3327807 3243904 3375688 3194266 3347488
4360 3347488 3431638 3361386 3382267 3361962 3314225 3313244 3297795 3227529 3159480 2985228 2864458
4349 2864458 2738989 2715897 2479008 2467358 2407028 2518302 2412310 2366927 2083813 2291105
4339 2291105 2290024 2249151 2161083 2146259 2012405 2003655 1915816 1859238 1988847 1901484 1844231
$$ packed form
4413H968051k28391l22812k83773k66554j00695l3150k79937k28808k35083k80132
4403F708716j05302k034q8302k53198j45450j32674l1920O1219k22796n0952k37161
4392E500146j65463o7384N4435k49762q6086l4505K7297j13636j92410m2380J8386
4381D648638L046l18057j45423Q4494q8253p3987o1825j22482j24331m8269q7004
4370C666547j71425P4803j71111L6759o7996l9770q3903J31784j81422J53222
4360C347488Q4150p0252K0881k0305m7737r81j5449p0266o8049j74252j20770
4349B864458j25469k3092k36889j1650o0330J11274j05992m5383k83114K07292
4339B291105j081m0873q8068j4824j33854q750q7839n6578J29609q7363n7253
$$ plain form
4328 1844231 1929638 2080934 1910375 1820546 1839053 1649622 1559021 1517758 1368268 1339475 1218761
4317 1218761 1453771 1522829 1676013 1562051 1699906 1660516 1698712 1592671 1691586 1650791
4307 1650791 1774001 1707156 1647459 1673945 1700810 1807030 1687722 1672106 1543348 1517670 1534734
4296 1534734 1668378 1440321 1512898 1422791 1638754 1525060 1527288 1373614 1371365 1244363 1259320
4285 1259320 1442615 1319576 1203251 1333487 1477136 1395063 1447689 1442520 1455042 1399491 1350175
4274 1350175 1305302 1386816 1245674 1188729 1181660 1197955 1058341 1313779 1324656 1145606 1028799
4263 1028799 1119836 1144177 1138513 1064305 1003461 1028858 1041560 962359 1117158 803373 795071
4252 795071 737093 761866 696612 857342 728384 754841 816475 792863 710487 522909 798124
$$ packed form
4328A844231Q5407J51296j70559q9829J8507j89431r0601m1263j49490k8793j20714
4317A218761K35010O9058J53184j13962J37855l9390L8196j06041R8915m0795
4307A650791J23210o6845n9697K6486K6865J06220j19308j5616j28758k5678J7064
4296A534734J33644k28057P2577r0107K15963j13694K228j53674k249j27002J4957
4285A259320J83295j23039j16325J30236J43649q2073N2626n169J2522n5551m9316
4274A350175m4873Q1514j41142n6945p069J6295j39614K55438J0877j79050j16807
4263A028799R1037K4341n664p4208o0844K5397J2702p9201J54799l13785q302
4252G95071n7978K4773o5254J60730j28958K6457O1634k3612q2376j87578K75215
$$ plain form
4241 798124 740401 911328 823062 818210 724825 697279 498034 679627 568908 620742 624929
4230 624929 573769 690753 710021 685037 639258 600646 520104 631129 628736 679253 718158
4219 718158 729689 553569 631951 864069 872492 869624 802771 586887 638447 796723 832019
4208 832019 981366 975920 976716 956431 1063729 1072788 1057748 1121896 1266240 1477203 1646278
4197 1646278 1713388 1884581 2012617 2108537 2464585 2616762 2632470 2732519 2651319 2679537
4187 2679537 2445817 2247812 2154877 1970736 1610498 1379502 1369121 1314272 1244773 1118465
4177 1118465 1009115 903755 1002231 943728 955480 901265 756818 734331 731336 737355 665299
4166 665299 644818 546154 605428 575151 541469 317592 185489 354985 754404 527799 549452
$$ packed form
4241G98124n7723J70927q8266m852r3385k7546j99245J81593j10719N1834M187
4230F24929n1160J16984J9268k4984m5779l8612q0542J11025k393N0517L8905
4219G18158J1531j76120P8382K32118Q423k868o6853k15884N1560J58276L5296
4208H32019J49347n446P96k0285J07298R059j5040O4148J44344K10963J69075
4197A646278O7110J71193J28036R5920L56048J52177J5708J00049q1200K8218
4187B679537k33720j98005r2935j84141l60238k30996j0381n4849o9499j26308
4177A118465j09350j05360R8476n8503J1752n4215j44447k2487k995O019p2056
4166F65299k0481r8664N9274l0277l3682k23877j32103J69496L99419k26605K1653
$$ plain form
4155 549452 534522 433184 299323 262157 352920 467300 510197 287804 362190 359722 349647
4144 349647 311345 423349 274202 454535 418653 358230 167336 227598 230888 293642 198930
4133 198930 221216 359633 329433 220028 51816 129947 75064 223625 17423 44170 128454
4122 128454 200093 69385 155217 150877 17981 140806 165342 166197 170710 171022 100620 313832
4110 313832 249185 164156 274753 215124 209312 297725 213017 121171 -22801 26484 158772
4099 158772 434454 225598 359294 342611 133375 38097 157836 286898 244342 274682
4089 274682 73859 332733 194187 76455 180325 289151 191455 309436 237220 212752
4079 212752 96370 41556 42984 84931 49212 99439 -9895 -37859 223636 95909 136898
$$ packed form
4155E49452j4930j01338j33861l7166R0763J14380M2897k22393P4386k468j0075
4144C49647l8302J12004j49147J80333l5882o0423j90894O0262L290O2754r4712
4133A98930K2286J38417l0200j09405j68212P8131n4883J48561k06202K6747Q4284
4122A28454P1639j30708Q5832m340j32896J22825K4536Q55M513L12p0402K13212
4110C13832o4647q5029J10597n9629n812Q8413q4708r1846j43972M9285J32288
4099A58772K75682k08856J33696j6683k09236r5278J19739J29062m2556L0340
4089B74682k00823K58874j38546j17732J03870J08826r7696J17981p2216k4468
4079B12752j16382n4814J428M1947l5719N0227j09334k7964K61495j27727M0989
$$ plain form
4068 136898 -84151 -66313 69778 286553 78478 136439 7156 258622 303059 168351
4058 168351 152598 110350 -49759 -79783 184121 159436 134849 50102 33812 34077 211567
4047 211567 109187 154281 144705 159801 86625 -32016 -69788 -132166 49272 190156 123145
4036 123145 36310 133514 131594 125548 29400 137604 302844 179476 120368 93901 88275 50279
4024 50279 167640 151650 65827 217204 37715 -103260 99821 166653 40438 127821 35250
4013 35250 -51037 -123240 18940 50694 151404 205743 89321 156740 115405 189494 22442
4002 22442 -5065 -73765 175363 188999 153781 23560 87312 58243 18276 -22132 34802
3991 34802 152535 47249 -29458 95340 215510 228346 288701 114943 96895 198543 127678
$$ packed form
4068A36898k21049J7838J36091K16775k08075N7961j29283K51466M4437j34708
4058A68351j5753m2248j60109l0024K63904k4685k4587q4747j6290K65J77490
4047B11567j02380M5094r576J5096p3176j18641l7772o2378J81438J40884o7011
4036A23145q6835R7204j920o046r6148J08204J65240j23368n9108k6467n626l7996
4024E0279J17361j5990q5823J51377j79489j40975K03081O6832j26215Q7383r2571
4013C5250q6287p2203J42180L1754J00710N4339j16422O7419m1335P4089j67052
4002B2442k7507o8700K49128J3636l5218j30221O3752k9069l9967m0408N6934
3991C4802J17733j05286p6707J24798J20170J2836O0355j73758j8048J01648p0865
$$ plain form
3980 127678 -51851 185591 187825 126540 -20671 -66145 78413 -3143 77065 18028 42963
3969 42963 33493 82135 89767 126605 207897 213038 201896 148524 200052 229423 184482 63972
3957 63972 68223 238511 276351 68396 25609 225220 151353 -32630 -92046 -163851 -50622
3946 -50622 107723 -81320 -271912 -63311 89498 -22462 126431 -53082 -19657 99875
3936 99875 50004 148701 13771 -77010 -109337 -24903 29565 97245 20235 -18968 8249 102029
3924 102029 153098 8761 41887 -13383 85334 70753 169118 -12318 53870 79639 173842
3913 173842 208674 119087 81554 -47563 99185 109631 165465 -57974 -10613 -114532 6027
3902 6027 102321 88277 725 52887 -80544 -46580 24264 158526 92582 153909 -23480
$$ packed form
3980A27678j79529K37442K234o1285j47211m5474J44558q1556Q0208n9037K4935
3969D2963r470M8642P632L6838Q1292N141j1142n3372N1528K9371m4941j20510
3957F3972M251J70288L7840k07955m2787J99611p3867j83983n9416p1805J13229
3946e0622J58345j89043j90592K08601J52809j11960J48893j79513L3425J19532
3936I9875m9871R8697j34930r0781l2327Q4434N4468O7680p7010l9203K7217R3780
3924A02029N1069j44337L3126n5270R8717j4581R8365j81436O6188K5769R4203
3913A73842L4832q9587l7533j29117J46748J0446N5834k23439M7361j03919J20559
3902F027R6294j4044q7552N2162j33431L3964P0844J34262o5944O1327j77389
$$ plain form
3891 -23480 -81741 30470 91 60329 108337 219101 180009 2808 76991 117326 30630
3880 30630 134614 55318 137515 239309 227944 58085 44266 -9041 71639 141795 113533
3869 113533 -65231 134663 55207 -23547 47374 131778 49069 23806 96743 71045 208936
3858 208936 95715 -39782 33939 145965 17209 245511 58900 149570 241831 271720
3848 271720 -21731 134074 274951 7710 -9464 36448 95282 103437 143668 96639 283208
3837 283208 182868 220979 51601 54693 -49769 116321 32665 96393 172462 102099 103048
3826 103048 41010 45023 113438 120571 -37719 49226 298118 238351 103431 53144 -8481
3815 -8481 112769 38695 41191 -10255 258597 11514 -12014 41627 -17458 -12305 13618 -78466
$$ packed form
3891b3480n8261J12211l0379O0238M8008J10764l9092j77201P4183M0335q6696
3880C0630J03984p9296Q2197J01794j1365j69859j3819n3307Q0680P0156k8262
3869A13533j78764J99894p9456p8754P0921Q4404q2709k5263P2937k5698J37891
3858B08936j13221j35497P3721J12026j28756K28302j86611R0670R2261K9889
3848B71720k93451J55805J40877k67241j7174M5912N8834Q155M0231m7029J86569
3837B83208j00340L8111j69378L092j04462J66090q3656O3728P6069p0363R49
3826A03048o2038M013O8415P133j58290Q6945K48892n9767j34920n0287o1625
3815h481J21250p4074K496n1446K68852k47083k3528N3641n9085N153K5923r2084
$$ plain form
3803 -78466 -120115 97578 21436 104643 110358 81007 144278 137054 179662 104263 -57005 7929
3791 7929 43885 279668 260772 98356 -27316 -139646 -101486 186432 71489 137466 82929
3780 82929 -10305 20510 -23192 -90018 -205184 -58932 11267 -17955 -35807 90100 67528
3769 67528 -22550 74087 11361 75032 138028 138580 139951 174039 142794 59134 178315 81111
3757 81111 197658 65381 141519 188152 277384 201801 288866 266925 205906 280310 134856
3746 134856 161689 191374 200273 295243 357665 83552 55782 157280 237624 125789 329163
3735 329163 173565 137803 173874 228016 227961 -26511 -211171 -142320 91620 -9415 123250
3724 123250 173707 82886 107532 143868 127694 196806 96101 -18015 -78722 178278 98191
$$ packed form
3803g8466m1649K17693p6142Q3207N715k9351O3271p224M2608p5399j61268O4934
3791G929L5956K35783j8896j62416j25672j12330L8160K87918j14943O5977n4537
3780H2929r3234L0815m3702o6826j15166J46252P0199k9222j7852J25907k2572
3769F7528r0078R6637o2726O3671O2996N52J371L4088l1245q3660J19181r7204
3757H1111J16547j32277P6138M6633Q9232p5583Q7065k1941o1019P4404j45454
3746A34856K6833K9685Q899R4970O2422k74113k7770J01498Q0344j11835K03374
3735C29163j55598l5762L6071N4142n5k54472j84660O8851K33940j01035J32665
3724A23250N0457r0821K4646L6336j6174O9112j00705j14116o0707K57000q0087
$$ plain form
3713 98191 73773 100943 136963 119719 157329 88896 75237 97787 37675 90272 206331 234128
3701 234128 85992 198966 99060 110689 145255 52587 167139 41055 98301 198901 142748
3690 142748 192044 122038 238909 86438 107553 9228 194891 120933 168752 178568 356905
3679 356905 283174 167352 177578 183308 154263 64411 145233 111403 97754 128498 262936
3668 262936 277076 364451 379273 383120 268663 172988 51857 391973 338265 209200 74525
3657 74525 193554 66392 87764 239354 79512 121200 -26953 -62185 112225 230941
3647 230941 198610 149812 307795 209572 287668 207667 106782 111578 148952 190220 232407
3636 232407 309690 52166 174372 10148 126138 281881 330528 166546 231407 306399
$$ packed form
3713I8191k4418K7170L6020j7244L7610o8433j3659K2550o0112N2597J16059K7797
3701B34128j48136J12974r9906J1629L4566r2668J14552j26084N7246J00600n6153
3690A42748M9296p0006J16871j52471K1115r8325J85663p3958M7819R816J78337
3679C56905p3731j15822J0226N730k9045q9852Q0822l3830j3649L0744J34438
3668B62936J4140Q7375J4822L847j14457r5675j21131L40116n3708j29065j34675
3657G4525J19029j27162K1372J51590j59842M1688j48153l5232J74410J18716
3647B30941l2331m8798J57983r8223P8096q0001j00885M796L7374M1268M2187
3636B32407P7283k57524J22206j64224J15990J55743M8647j63982O4861P4992
$$ plain form
3626 306399 155896 76454 26776 209532 323862 281960 77713 220943 176263 144388 234313
3615 234313 291156 144669 240681 90862 136334 281705 287708 293248 165026 273091 106248
3604 106248 190640 91553 188819 80928 346641 221944 203827 263023 208517 160147 -66555
3593 -66555 88227 11030 326258 109210 117167 61113 143431 108984 179582 303532 353319
3582 353319 223690 97183 168847 327473 402747 229715 296075 331055 373142 284422 490310
3571 490310 342769 473892 283691 362956 255108 253916 306889 319059 309539 360769 532015
3560 532015 385206 303226 306549 384916 451009 453009 341582 379839 352464 386171 351910 458590
3548 458590 360356 356132 327363 441990 440168 416542 227775 587909 616549 518841 513454 598872
$$ packed form
3626C06399j50503p9442m9678J82756J14330m1902k04247J43230m4680l1875Q9925
3615B34313N6843j46487R6012j49819M5472J45371O003N540j28222J08065j66843
3604A06248Q4392r9087R7266j07891K65713j24697j8117N9196n4506m8370k26702
3593f6555J54782p7197L15228k17048P957n6054Q2318l4447P0598J23950M9787
3582C53319j29629j26507P1664J58626P5274j73032O6360L4980M2087q8720K05888
3571D90310j47541J31123j90201P9265j07848j192N2973J2170r520N1230J71246
3560E32015j46809q1980L323P8367O6093K000j11427L8257k7375L3707l4261J06680
3548D58590r8234m224k8769J14627j822k3626j88767L60134K8640r7708n387Q5418
$$ plain form
3536 598872 672958 515593 638914 543982 589113 568378 645146 542521 637600 514142 385165
3525 385165 188904 283680 333951 426617 302158 338739 368279 408977 426637 360720 445629
3514 445629 407262 602470 433519 464549 257012 420760 206797 502265 468475 621498
3504 621498 511850 477981 566002 368346 499850 526172 748999 528626 713108 673297
3494 673297 708678 545819 696538 651773 696903 440860 440451 631816 663798 592673 578782
3483 578782 738834 732631 897797 773224 931897 756041 890071 1129170 1101174 1083535
3473 1083535 1130676 1250473 1411888 1141373 933074 938057 1042689 928593 922004 980484 1112280
3462 1112280 1012391 1039416 1178928 1148267 1133137 1124626 1284869 1078380 1082989 1300135 1470225
$$ packed form
3536E98872P4086j57365J23321r4932M5131k0735P6768j02625R5079j23458j28977
3525C85165j96261R4776N0271R2666j24459L6581K9540M0698J7660o5917Q4909
3514D45629l8367J95208j68951L1030k07537J63748k13963K95468l3790J53023
3504F21498j09648l3869Q8021j97656J31504K6322K22827k20373J84482l9811
3494F73297L5381j62859J50719m4765M5130k56043m09J91365L1982p1125j3891
3483E78782J60052o203J65166j24573J58673j75856J34030K39099k7996j7639
3473A083535M7141J19797J61415k70515k08299M983J04632j14096o589N8480J31796
3462A112280r9889K7025J39512l0661j5130q511J60243k06489M609K17146J70090
$$ plain form
3451 1470225 1431495 1508907 1625059 2058374 2035162 2018177 2071215 1901249 1647202 1666789 1755659
3440 1755659 1782037 1584837 1404870 1492090 1770666 1668737 1533803 1877323 1922034 1820066
3430 1820066 1898180 2286441 2244131 2183607 2163828 2490924 2685601 2675786 2756264 2805826 2837542
3419 2837542 2695622 2823901 2599816 2510492 2336249 2295556 2344585 2427691 2456976 2371692 2308793
3408 2308793 2204770 2290025 2495080 2572019 2202510 2282856 2399260 2306231 2088841 1920907
3398 1920907 1847718 1754027 1367923 1342271 1634544 1566400 1358978 1144416 1234374 1118063
3388 1118063 1105139 1068740 1104085 1024947 971561 918436 936075 943884 855405 919579 797428
3377 797428 851274 904647 950870 745378 785220 859995 877803 672743 658266 701638 938117
$$ packed form
3451A470225l8730P7412J16152M33315k3212j6985N3038j69966k54047J9587Q8870
3440A755659K6378j97200j79967Q7220K78576j01929j34934L43520M4711j01968
3430A820066P8114L88261m2310o0524j9779L27096J94677r815Q0478M9562L1716
3419B837542j41920J28279k24085q9324j74243m0693M9029Q3106K9285q5284o2899
3408B308793j04023Q5255K05055P6939l69509Q0346J16404r3029k17390j67934
3398A920907p3189r3691l86104k5652K92273o8144k07422k14562Q9958j16311
3388A118063j2924l6399L5345p9138n3386n3125J7639P809q8479O4174j22151
3377G97428N3846N3373M6223k05492L9842P4775J7808k05060j4477M3372K36479
$$ plain form
3366 938117 884344 621663 888079 1126807 981947 853105 1158371 1145017 1113283 1088444
3356 1088444 1112844 1355256 1330214 1230624 1330314 1238261 1156097 1078649 1108397 994099 1046688
3345 1046688 1010998 930664 947555 841179 805394 925756 739583 465049 704431 784257
3335 784257 710339 688871 756463 630440 516777 312091 492526 619461 352224 395970
3325 395970 544787 614924 514897 670278 654052 669072 658481 635156 671720 719039 693702
3314 693702 836979 1018835 1214608 1457951 1594907 1692147 1572672 1348672 1212438 1312927
3304 1312927 1137944 977509 885967 1030404 843271 871448 759268 758019 673533 788442
3294 788442 939316 863472 700394 667976 809945 798630 773730 803425 954282 905293 857241
$$ packed form
3366I38117n3773k62681K66416K38728j44860j28842L05266j3354l1734k4839
3356A088444K4400K42412k5042r9590R9690r2053q2164p7448K9748j14298N2589
3345A046688l5690q0334J6891j06376l5785J20362j86173k74534K39382P9826
3335G84257p3918k1468O7592j26023j13663k04686J80435J26935k67237M3746
3325C95970J48817P0137j00027J55381j6226J5020j0591k3325L6564M7319k5337
3314F93702J43277J81856J95773K43343J36956R7240j19475k24000j36234J00489
3304A312927j74983j60435r1542J44437j87133K8177j12180j249q4486J14909
3294G88442J50874p5844j63078l2418J41969j1315k4900K9695J50857m8989m8052
$$ plain form
3283 857241 961257 1407807 1607365 1919659 2282417 2415340 2302601 2226205 1989703 1623069
3273 1623069 1332289 1135423 940324 996459 792014 847442 852565 895332 819333 836309 839254
3262 839254 734954 712505 614135 873777 824330 739888 531728 730848 623162 763793
3252 763793 873803 923434 822869 990528 1109658 1445141 1532426 1296995 1369654 1248844
3242 1248844 904406 736621 829419 649093 664152 651731 652421 551343 463181 158241 336054
3231 336054 313420 339795 345250 283289 411780 342076 323556 471780 382126 51504 259126
3220 259126 457707 345129 141802 157876 78951 39472 137620 297791 337900 168677 151815
3209 151815 177752 301512 112979 180322 236906 184984 173036 186652 450970 407612 411771
$$ packed form
3283H57241J04016M46550J99558L12294L62758J32923j12739p6396k36502l66634
3273A623069k90780j96866j95099N6135k04445N5428N123M2767p5999J6976K945
3262H39254j04300k2449r8370K59642m9447q4442k08160J99120j07686J40631
3252G63793J10010M9631j00565J67659J19130L35483Q7285k35431P2659j20810
3242A248844l44438j67785R2798j80326J5059j2421O90j01078q8162l04940J77813
3231C36054k2634K6375N455o1961J28491o9704j8520J48224q9654l30622K07622
3220B59126J98581j12578k03327J6074p8925l9479R8148J60171M0109j69223j6862
3209A51815K5937J23760j88533O7343N6584n1922j1948J3616K64318m3358M159
$$ plain form
3198 411771 273925 168531 211813 234708 347232 161126 180892 178612 297656 318034 300753
3187 300753 257169 255860 107962 85806 98340 223562 139379 106693 42446 251094 363921
3176 363921 269598 240891 248685 247367 217624 226147 215845 185117 155460 253320 325168 335081
3164 335081 201440 125176 286623 408255 385796 273317 164553 268705 294124 316400
3154 316400 320817 201729 -4978 126649 273608 316095 219567 325600 267210 217117 290303
3143 290303 430705 333587 401142 352952 321192 324703 190804 164153 215696 219472 140678 250219
3131 250219 162219 298344 262096 400541 388246 335084 343911 378274 226743 64452 422799
3120 422799 436733 443775 255582 440252 457326 522856 478463 614055 621684 570722 533349
$$ packed form
3198D11771j37846j05394M3282K2895J12524j86106J9766k280J19044K0378j7281
3187C00753m3584j309j47898k2156J2534J25222q4183l2686o4247K08648J12827
3176C63921r4323k8707P794j318k9743Q523j0302l0728k9657R7860P1848R913
3164C35081j33641p6264J61447J21632k2459j12479j08764J04152K5419K2276
3154C16400M417j19088k06707J31627J46959M2487r6528J06033n8390n0093P3186
3143B90303J40402r7118O7555m8190l1760L511j33899k6651N1543L776p8794J09541
3131B50219q8000J36125l6248J38445j2295n3162Q827L4363j51531j62291L58347
3120D22799J3934P042j88193J84670J7074O5530m4393J35592P629n0962l7373
$$ plain form
3109 533349 662337 786607 739789 606247 714849 820692 874267 870495 879992 892250 677378
3098 677378 618908 668067 805064 714114 664515 718409 728026 818948 835963 968572 774495
3087 774495 894127 829423 1101593 1100540 1242041 1321550 1398099 1281587 1013898 1157214 982326
3076 982326 1023913 776277 944225 872976 871283 746790 861971 812636 796315 801725 967271
3065 967271 886993 891550 996896 1108434 969609 828265 696646 954438 1058866 941085
3055 941085 1174008 1228999 1087028 1036208 1153271 1065828 1064538 1018656 1016949 948512 948709 999045
3043 999045 1223846 1136428 1040724 1082887 1381343 1256075 1202483 1100882 1166622 1059401 966616
3032 966616 813310 831816 985944 710428 966790 813014 891299 779879 854132 722884
$$ packed form
3109E33349J28988J24270m6818j33542J08602J05843N3575l772R497J2258k14872
3098F77378n8470M9159J36997r0950m9599N3894R617R0922J7015J32609j94077
3087G74495J19632o4704K72170j053J41501P9509P6549j16512k67689J43316j74888
3076I82326M1587k47636J67948p1249j693j24493J15181m9335j6321N410J65546
3065I67271q0278M557J05346J11538j38825j41344j31619K57792J04428j17781
3055I41085K32923N4991j41971n0820J17063q7443j290m5882j707o8437J97N0336
3043I99045K24801q7418r5704M2163K98456j25268n3592j01601O5740j07221r2785
3032I66616j53306J8506J54128k75516K56362j53776P8285j11420P4253j31248
$$ plain form
3022 722884 775701 598912 881586 707757 803223 808296 799131 727478 573415 612574 616705
3011 616705 576277 644090 735436 608577 542812 346057 538672 429106 556679 438671
3001 438671 430880 489970 497406 357247 378661 372175 158604 349137 466047 508889 492822
2990 492822 402879 414933 374504 281952 345031 495722 433029 418881 365892 287181 410172
2979 410172 414168 385812 465466 480372 425912 411257 636671 344440 309272 417390 376109
2968 376109 319648 376789 223746 -46263 297258 57397 132412 157027 180005 193332 192904
2957 192904 125552 126547 375316 186208 130220 44972 51961 238926 332533 183839 212736
2946 212736 173999 200702 107194 100680 73369 125998 -12612 142385 62751 237157 109524
$$ packed form
3022G22884N2817j76789K82674j73829R5466N073r165p1653j54063L9159M131
3011F16705m0428O7813R1346j26859o5765j96755J92615j09566J27573j18008
3001D38671p791N9090P436j40159K1414o486k13571J90533J16910M2842j6067
2990D92822q9943J2054m0429r2552O3079J50691o2693j4148n2989p8711J22991
2979D10172L996k8356P9654J4906n4460j4655K25414k92231l5168J08118m1281
2968C76109n6461N7141j53043k70009L43521k39861P5015K4615K2978J3327m28
2957A92904o7352R95K48769j89108n5988q5248O989J86965R3607j48694K8897
2946B12736l8737K6703r3508o514k7311N2629j38610J54997p9634J74406j27633
$$ plain form
2935 109524 117201 36327 92493 242842 181750 83369 177041 234289 30979 -8326 152798
2924 152798 45255 196853 229304 101801 213628 60454 67038 72952 161110 13643 241860
2913 241860 131052 33117 -73411 97066 64023 114391 144657 154427 135632 62765 -12414
2902 -12414 -190029 -76896 13492 51904 123081 -1219 2900 -52844 -3682 175902 188604
2891 188604 220577 133645 299909 261192 262829 211886 220712 292846 236625 228737 144320 94034
2879 94034 53459 114679 58838 44883 220000 126171 265469 128212 148424 123570 123501 133875
2867 133875 117532 86763 69835 59623 -8666 197811 129626 24963 62199 86856 65961
2856 65961 166699 130722 63121 64596 210728 32031 206427 95118 234164 68193 143032
$$ packed form
2935A09524P677q0874N6166J50349o1092r8381R3672N7248k03310l9305J61124
2924A52798j07543J51598L2451j27503J11827j53174O584N914Q8158j47467K28217
2913B41860j10808r7935j06528J70477l3043N0368L0266R770j8795p2867p5179
2902a2414j77615J13133R0388L8412P1177j24300M119n5744M9162J79584J2702
2891A88604L1973q6932J66264l8717J637n0943Q826P2134n6221p888q4417n0286
2879I4034m0575O1220n5841j3955J75117r3829J39298j37257K0212k4854o9J0374
2867A33875j6343l0769j6928j0212o8289K06477o8185j04663L7236K4657k0895
2856F5961J00738l5977o7601J475J46132j78697J74396j11309J39046j65971P4839
$$ plain form
2845 143032 107396 219695 -149981 -170345 -4302 86765 136531 83677 34152 -85524 -18500
2834 -18500 -89657 -55138 85003 167566 21895 167187 3042 19906 -22287 86400 -71052
2823 -71052 245796 76460 76175 60333 65702 20778 145217 86817 -34277 103102 -9520
2812 -9520 75326 -35339 -8682 -67052 56870 -9698 88169 -49498 -55572 32753 173368
2801 173368 41372 86434 242376 173168 139847 41405 6233 93691 195702 40247 29826
2790 29826 -37722 -69637 -13410 213141 59177 -21334 -20284 72752 81153 158366 -2380 43585
2778 43585 -4940 -151268 -54113 127556 39436 60293 171695 147811 134877 -28406 117982
2767 117982 218347 210461 52828 84700 26473 22863 -69104 -122874 -63891 -110007 69696
$$ packed form
2845A43032l5636J12299l69676k0364J66043R1067M9766n2854m9525j19676O7024
2834a8500p1157L4519J40141Q2563j45671J45292j64145J6864m2193J08687j57452
2823g1052L16848j69336k85j5842N369m4924J24439n8400j21094J37379j12622
2812i520Q4846j10665K6657n8370J23922o6568R7867j37667o074Q8325J40615
2801A73368j31996M5062J55942o9208l3321r8442l5172Q7458J02011j55455j0421
2790B9826o7548l1915N6227K26551j53964q0511J050R3036Q401P7213j60746M5965
2778D3585m8525j46328R7155J81669q8120K0857J11402k3884j2934j63283J46388
2767A17982J00365p886j57633L1872n8227l610r1967n3770N8983m6116J79703
$$ plain form
2756 69696 -41111 5268 -18919 21645 74516 23409 -50651 46243 136131 10826 76308
2745 76308 51934 55993 112734 80672 141801 108261 55794 -42245 -28317 41874 -42885 -62619
2733 -62619 -116529 15482 -65822 124893 -16516 -51451 -169144 -48919 54036 247756
2723 247756 138671 -109786 -954 -65722 -63952 91675 235347 149635 128871 90631 77254
2712 77254 35074 156798 138308 166122 35824 -4023 147378 302043 114462 117661 146316
2701 146316 191391 343028 185633 -14723 102594 -30819 31587 324892 191818 -29775
2691 -29775 139630 140770 150483 198388 -36303 113906 83496 47849 34715 284403 28494
2680 28494 -16769 61977 140908 42040 125621 121315 7857 103552 116376 161088 203935 -7066
$$ packed form
2756F9696j10807M6379k4187M0564N2871n1107p4060R6894Q9888j25305O5482
2745G6308k4374M059N6741l2062O1129l3540n2467r8039J3928P0191q4759j9734
2733f2619n3910J32011q1304J90715j41409l4935j17693J20225J02955J93720
2723B47756j09085k48457J08832o4768J770J55627J43672q5712k0764l8240j3377
2712G7254m2180J21724j8490K7814j30298l9847J51401J54665j87581L199K8655
2701A46316M5075J51637j57395k00356J17317j33413O2406K93305j33074k21593
2691b9775J69405J140R713M7905k34691J50209l0410l5647j3134K49688k55909
2680B8494m5263P8746P8931r8868Q3581m306j13458R5695J2824M4712M2847k11001
$$ plain form
2668 -7066 -43078 89085 121207 72525 64157 65050 22598 78866 -215830 -112765 50712 -50515
2656 -50515 -30078 273338 226728 64786 144837 82812 -11595 61456 22939 159409 120057
2645 120057 45846 58575 202148 75290 62121 35602 87775 169237 159677 60479 36312
2634 36312 136072 137444 42740 -43580 -41785 -49512 -75481 55037 82594 78591 180103 151289
2622 151289 -25194 -18266 -71792 -74760 -13840 -86440 119600 82988 975 -82407 49646
2611 49646 82218 96791 -135852 23341 14162 25559 -25311 139485 51584 51292 -59851 101806
2599 101806 65150 50595 132248 113178 114822 85463 91271 17001 131540 -69686 363122
2588 363122 99663 52715 13358 282817 81987 221403 47972 178315 80603 121625
$$ packed form
2668g066l6012J32163L2122m8682q368Q93m2452N6268k94696J03065J63477j01227
2656e0515K0437L03416m6610j61942Q0051o2025r4407P3051l8517J36470l9352
2645A20057p4211J2729J43573j26858j3169k6519N2173Q1462r560r9198k4167
2634C6312R9760J372r4704q6320J795p727k5969J30518K7557m003J01512k8814
2622A51289j76483O928n3526k968O0920p2600K06040l6612q2013q3382J32053
2611D9646L2572J4573k32643J59193r179J1397n0870J64796q7901k92j11143J61657
2599A01806l6656j4555Q1653j9070J644k9359N808p4270J14539k01226M32808
2588C63122k63459m6948l9357K69459k00830J39416j73431J30343r7712M1022
$$ plain form
2578 121625 111913 158095 211775 26526 11578 6787 199165 27268 20980 361 191064
2567 191064 25182 913 4997 95915 -100593 -48412 -175174 -121385 -119702 -91502 -124316
2556 -124316 -19671 -14279 -12725 -3604 -39211 -125735 68883 144729 -102163 17999 141094
2545 141094 159804 -117844 -240678 -239867 -89473 -172513 -217908 -68086 33281 18385 -15126
2534 -15126 -28363 -57823 -66186 175642 37736 143409 82203 16668 54192 204286 141734
2523 141734 5812 2643 -166543 133192 57846 -22445 -83377 88187 68046 14767 -75646
2512 -75646 -54234 25305 99698 72327 93739 83236 81881 40854 43616 111777 180854 51936
2500 51936 185791 240264 306572 10680 -35664 -70887 -115734 -34943 70138 129227 153341
$$ packed form
2578A21625r712M6182N3680j85249j4948m791J92378j71897o288k0619J90703
2567A91064j65882k4269M084R0918j96508N2181j26762N3789J683K8200l2814
2556a24316J04645N392J554R121l5607q6524J94618P5846k46892J20162J23095
2545A41094J8710k77648j22834Q11J50394q3040m5395J49822J01367j4896l3511
2534a5126j3237k9460q363K41828j37906J05673o1206o5535L7524J50094o2552
2523A41734j35922l169j69186K99735p5346q0291o0932J71564k0141n3279r0413
2512g5646K1412P9539P4393k7371K1412j0503j355m1027K762O8161O9077j28918
2500E1936J33855N4473O6308k95892m6344l5223m4847Q0791J05081N9089K4114
$$ plain form
2489 153341 126042 153402 139497 27772 188156 144779 132500 -122834 49690 -29594 32257
2478 32257 117086 282769 50738 61609 -68741 135316 144471 59305 65808 79195 92863
2467 92863 -1367 93646 106890 114477 125400 193112 78512 98612 14628 -38662 -62387 177788
2455 177788 11650 26514 92254 89959 207549 111275 94909 194101 114175 53571 33191
2444 33191 39607 37830 72707 160103 145556 73873 62916 -44174 -13323 -31331 77174 128686
2432 128686 86481 31800 104868 139277 3442 194237 280267 149733 -919 7645 112096
2421 112096 121374 111201 40032 3523 256677 50894 156674 38849 68316 154570 166465
2410 166465 149249 206811 136334 64497 125191 88396 157821 54493 78001 109313 208993
$$ packed form
2489A53341k7299K7360j3905j11725J60384m3377j2279k55334J72524p9284O1851
2478C2257Q4829J65683k32031J0871j30350K04057R155q5166O503J3387J3668
2467I2863r4230R5013J3244P587J0923O7712j14600K0100q3984n3290k3725K40175
2455A77788j66138J4864O5740k295J17590r6274j6366R9192p9926o0604k0380
2444C3191O416j777L4877Q7396j4547p1683j0957j07090L0851j8008J08505N1512
2432A28686m2205n4681P3068L4409j35835J90795Q6030j30534j50652Q564J04451
2421A12096R278j0173p1169l6509K53154k05783J05780j17825K9467Q6254J1895
2410A66465j7216N7562p0477p1837O0694l6795O9425j03328K3508L1312R9680
$$ plain form
2399 208993 153652 68064 70018 -12142 81975 162936 72239 34760 233528 77441 -275512
2388 -275512 77631 202211 218680 85093 77043 29668 55571 -90785 12838 164782 41582
2377 41582 -57277 -89926 -19456 -23801 111632 59741 26485 15437 227085 136942 210142 66043
2365 66043 124608 -12235 71745 -51330 82448 98525 54716 95369 150419 99266 62077
2354 62077 55222 95819 236573 37245 80381 136560 153317 33399 43555 7542 156502
2343 156502 49089 208645 16005 286145 258872 167313 -25257 82719 77700 57078 8960
2332 8960 49888 310441 275686 223907 101223 138385 110398 218262 33869 22269 52459
2321 52459 214572 159370 120601 210657 332408 138502 284010 318600 297749 226762 158690
$$ packed form
2399B08993n5341q5588J954q2160R4117Q0961r0697l7479J98768j56087l52953
2388b75512L53143J24580J6469j33587q050m7375K5903j46356J03623J51944j23200
2377D1582r8859l2649P0470m345J35433n1891l3256j1048K11648r0143P3200j44099
2365F6043N8565j36843Q3980j23075J33778J6077m3809M0653N5050n1153l7189
2354F2077o855M0597J40754j99328M3136N6179J6757j19918J0156l6013J48960
2343A56502j07413J59556j92640K70140k7273r1559j92570J07976n019k0622m8118
2332H960M0928K60553l4755n1779j22684L7162k7987J07864j84393j1600L0190
2321E2459J62113n5202l8769R0056J21751j93906J45508L4590k0851p0987o8072
$$ plain form
2310 158690 404749 673220 829344 904499 990675 835698 876705 826105 595699 506955 444217
2299 444217 363824 350329 339426 238110 253089 290396 109770 189120 160743 155708 127254
2288 127254 278957 161569 226155 164409 152463 126706 103572 158267 223521 188614 30402
2277 30402 89908 237030 143502 225228 388817 369780 180869 25131 25634 168490 152305
2266 152305 18217 131477 231447 40219 -331 96159 42001 65352 190072 -65850 55670
2255 55670 -28406 25998 204421 128621 -25682 -25231 179111 82067 126988 -15912 144013
2244 144013 122405 139830 -115807 283042 151638 19232 61077 205862 125987 203592 236097
2233 236097 223097 188820 120458 227973 252674 118060 -41790 217915 113049 54521 -35700
$$ packed form
2310A58690K46059K68471J56124P5155Q6176j54977M1007n0600k30406q8744o2738
2299D44217q0393j3495j0903j01316J4979L7307j80626P9350k8377n035k8454
2288A27254J51703j17388O4586o1746j1946k5757k3134N4695O5254l4907j58212
2277C0402N9506J47122r3528Q1726J63589j9037j88911j55738N03J42856j6185
2266A52305j34088J13260R9970j91228m0550R6490n4158K3351J24720k55922J21520
2255E5670q4076N4404J78423p5800j54303M51K04342r7044M4921j42900J59925
2244A44013k1608J7425k55637L98849j31404j32406M1845J44785p9875P7605L2505
2233B36097j3000l4277o8362J07515K4701j34614j59850K59705j04866n8528r0221
$$ plain form
2222 -35700 318539 175567 127558 122943 111006 73682 84594 185470 157809 22347 -63471
2211 -63471 54555 247987 233753 204416 203086 207867 178385 18461 58180 184281 175516 -12517
2199 -12517 124568 104563 148866 -97252 68292 237395 276587 -21400 1439 -26714 119593
2188 119593 137583 91948 39980 179898 102309 221155 121726 159240 249523 138965 124213
2177 124213 85354 194888 41339 120373 -4157 262291 152847 250155 48024 101305
2167 101305 25639 -120742 -124667 -12713 135152 83435 102641 111241 220357 118622 -54348
2156 -54348 14810 135132 -39403 -66662 -125306 -7784 104477 210378 189381 262928 122913
2145 122913 78303 167270 16766 74965 120137 316058 82333 51357 19891 119866 -37481
$$ packed form
2222c5700L54239j42972m8009m615j1937l7324J0912J00876k7661j35462q5818
2211f3471J18026J93432j4234k9337j330M781k9482j59924L9719J26101q765j88033
2199a2517J37085k0005M4303k46118J65544J69103L9192k97987K2839k8153J46307
2188A19593J7990m5635n1968J39918p7589J18846r9429L7514R0283j10558j4752
2177A24213l8859J09534j53549P9034j24530K66448j09444R7308k02131N3281
2167A01305p5666j46381l925J11954J47865n1717J9206Q600J09116j01735j72970
2156e4348O9158J20322j74535k7259n8644J17522J12261J05901k0997P3547j40015
2145A22913m4610Q8967j50504N8199M5172J95921k33725l0976l1466R9975j57347
$$ plain form
2134 -37481 -86982 77894 174140 96481 -14281 265426 319758 75468 74377 43195 164014
2123 164014 129970 -49945 154267 314366 191175 68783 154059 118238 209361 119152 131963
2112 131963 150151 62361 74511 102852 94044 24100 207944 201457 -17948 43931 290686
2101 290686 320148 223695 247507 306022 150627 53530 106222 266071 108476 38885 -69140
2090 -69140 145698 261309 57324 4559 13361 98255 45372 128498 59062 90280 86769 107575
2078 107575 -20871 -41044 -34396 120984 182648 314631 155416 120097 71362 79157 4173
2067 4173 -10907 47025 -26206 71316 130403 161541 80217 245975 215901 327550 52926
2056 52926 107082 99510 8461 -77964 -96455 -124355 -56509 -73689 99557 238265 85573
$$ packed form
2134c7481m9501J64876R6246p7659j10762K79707N4332k44290j091l1182J20819
2123A64014l4044j79915K04212J60099j23191j22392Q5276l5821R1123r0209J2811
2112A31963J8188q7790J2150K8341q808o9944J83844o487k19405O1879K46755
2101B90686K9462r6453K3812N8515j55395r7097N2692J59849j57595o9591j08025
2090f9140K14838J15611k03985n2765Q802Q4894n2883Q3126o9436L1218l511K0806
2078A07575j28446k0173O648J55380O1664J31983j59215l5319m8735P795p4984
2067D173j5080N7932p3231R7522N9087L1138q1324J65758l0074J11649k74624
2056E2926N4156p572r1049q6425j8491k7900O7846j7180J73246J38708j52692
$$ plain form
2045 85573 -41308 131441 231901 244632 103122 23307 123569 17594 27979 28974 101318
2034 101318 -28795 24616 22048 79020 13988 70802 35915 81731 49237 1476 41677 66438
2022 66438 -56998 99901 -17828 -164130 -98233 -23152 -71279 -78484 32878 40789 250219
2011 250219 77414 29701 -16739 45031 18628 -33780 23077 182690 47326 -66519 60889
2000 60889 85925 -13203 32837 16457 46907 215537 194564 101419 4556 191254 268766
1989 268766 143658 181288 180907 -5183 91847 14534 110289 168861 64027 53433 144112
1978 144112 150261 142661 57695 -11213 -43081 63700 -97594 -10717 85478 -30526 -138111
1967 -138111 -193019 -37280 32667 160283 74399 123239 79663 12887 9014 -45736 -94527
$$ packed form
2045H5573j26881J72749J00460J2731j41510p9815J00262j05975J0385R95P2344
2034A01318j30113N3411k568N6972o5032N6814l4887M5816l2494m7761M0201K4761
2022F6438j23436J56899j17729j46302O5897P5081m8127p205J11362P911K09430
2011B50219j72805m7713m6440O1770k6403n2408N6857J59613j35364j13845J27408
2000F0889K5036r9128M6040j6380L0450J68630k0973r3145r6863J86698P7512
1989B68766j25108L7630l81j86090R7030p7313R5755N8572j04834j0594R0679
1978A44112O149p600q4966o8908l1868J06781j61294Q6877R6195j16004j07585
1967a38111n4908J55739O9947J27616q5884M8840m3576o6776l873n4750m8791
$$ plain form
1956 -94527 -81909 -54775 -137890 -1629 47255 -52074 -124354 -35866 71206 152433 119053
1945 119053 12756 76935 291008 265737 135236 96711 276025 114729 100629 122450 184788
1934 184788 101556 -31112 6458 193256 168038 -32304 115116 60359 148071 201489 166394
1923 166394 111162 169422 130501 191408 2387 88876 74741 74987 34138 211613 264330 186451
1911 186451 86709 45421 157262 173801 252886 -20610 17963 240452 225517 -2095 222072
1900 222072 380062 290940 34583 -46369 211060 262616 191914 25989 216047 177619 209825
1889 209825 210916 125829 72107 135902 48791 32857 119147 115540 39549 -150438 -157732 56302
1877 56302 113674 -54724 -55216 224517 144463 -70673 -39160 190719 205880 89019 85274
$$ packed form
1956i4527J2618K7134q3115J36261M8884r9329p2280Q8488J07072Q1227l3380
1945A19053j06297O4179K14073k5271j30501l8525J79314j61296j4100K1821O2338
1934A84788q3232j32668L7570J86798k5218k00342J47420n4757Q7712N3418l5095
1923A66394n5232N8260l8921O0907j89021Q6489j4135K46m0849J77475N2717p7879
1911A86451r9742m1288J11841J6539P9085k73496L8573K22489j4935k27612K24167
1900B22072J57990q9122k56357q0952K57429N1556p0702j65925J90058l8428L2206
1889B09825J091q5087n3722O3795q7111j5934Q6290l607p5991j89987p294K14034
1877E6302N7372j68398m92K79733q0054k15136L1513K29879J5161j16861l745
$$ plain form
1866 85274 146897 186567 59779 -30748 120233 119260 33304 8677 -56315 73916 122337 223775
1854 223775 88596 20730 112638 61784 -16878 -61874 5931 207066 136146 48124 230589
1843 230589 295355 165923 73309 118551 292928 399884 290845 111387 153385 19444
1833 19444 -157083 -103053 89429 91314 39255 149341 238941 75707 29467 -19335 118580
1822 118580 -10568 -126872 89790 136872 -15638 -187714 1779 97126 133195 91810
1812 91810 197948 195414 85894 25469 165342 210433 220606 234215 263960 16758 -89898
1801 -89898 -31743 9234 69602 -33526 67479 251415 180686 -194350 41466 268935 271293
1790 271293 155999 210183 17041 -15242 109470 135237 83396 -81250 -100336 20578 83921
$$ packed form
1866H5274O1623L9670j26788r0527J50981r73q5956k4627o4992J30231M8421J01438
1854B23775j35179o7866R1908n0854p8662m4996O7805K01135p0920q8022J82465
1843B30589O4766j29432r2614M5242J74377J06956j09039j79458M1998j33941
1833A9444j76527N4030J92482J885n2059J10086Q9600j63234m6240m8802J37915
1822A18580j29148j16304K16662M7082j52510j72076J89493R5347L6069m1385
1812I1810J06138k534j09520o0425J39873M5091J0173J3609K9745k47202j06656
1801h9898N8155M0977O0368j03128J01005J83936p0729l75036K35816K27469K358
1790B71293j15294N4184j93142l2283J24712K5767n1841j64646j9086J20914O3343
$$ plain form
1779 83921 -68171 73478 133947 89693 20846 45055 128511 156642 21381 39278 170890
1768 170890 185669 177253 129098 172918 31820 -68033 59703 61175 78196 101697 170632 150439
1756 150439 49109 -34204 153259 154057 -107083 -80491 234979 53623 -10907 44449 183404
1745 183404 282778 165992 20826 141539 228323 30181 19793 85066 204513 55494
1735 55494 73776 25956 189397 149922 246544 203700 189520 103459 219292 159004 -15823
1724 -15823 11568 358932 231892 92600 205037 257016 298369 78128 -14042 178865 316512
1713 316512 -843 -28132 162929 249872 114682 157674 143188 277542 -33481 -32954 231138
1702 231138 206201 -72891 -10530 -75578 -17721 45820 39807 2341 -173645 101330 13710
$$ packed form
1779H3921j52092J41649O0469m4254o8847K4209Q3456K8131j35261J7897J31612
1768A70890J4779q416m8155M3820j41098r9853J27736J472J7021K3501O8935k0193
1756A50439j01330q3313J87463P98k61140K6592L15470j81356o4530N5356J38955
1745A83404R9374j16786j45166J20713Q6784j98142j0388O5273J19447j49019
1735E5494J8282m7820J63441l9475R6622m2844j4180q6061J15833o0288j74827
1724a5823K7391L47364j27040j39292J12437N1979M1353k20241r2170J92907J37647
1713C16512l17355k7289J91061Q6943j35190M2992j4486J34354l11023N27K64092
1702B31138k4937k79092O2361o5048N7857O3541o013l7466j75986K74975q7620
$$ plain form
1691 13710 153041 13088 99414 311006 218675 -36652 147871 266915 196753 -16127
1681 -16127 -51804 201522 267204 -127649 -139963 5314 47598 104966 78034 280673 168703
1670 168703 75544 119417 236484 30579 154028 142873 275199 101169 128653 45002 218745
1659 218745 157134 18522 130261 175951 85964 54624 179477 150384 -45542 16754 237797
1648 237797 103566 125183 82702 202061 -12097 -52557 48513 256671 60845 27153
1638 27153 178220 189452 216203 101876 217937 279769 153920 170423 246825 150456 51615
1627 51615 65846 165607 134912 263852 -17252 130527 170089 23921 -85386 188486 87321
1616 87321 99101 100872 62208 -132001 -51927 117098 69917 203584 -103265 192364 250556
$$ packed form
1691A3710J39331j39953Q6326K11592r2331k55327J84523J19044p0162k12880
1681a6127l5677K53326O5682l94853j2314J45277M2284N7368k6932K02639j11970
1670A68703r3159M3873J17067k05905J23449j1155J32326j74030K7484q3651J73743
1659B18745o1611j38612J11739M5690q9987l1340J24853k9093j95926O2296K21043
1648B37797j34231K1617m2481J19359k14158m0460J01070K08158j95826l3692
1638B7153J51067J1232K6751j14327J16061O1832j25849J6503P6402r6369r8841
1627E1615J4231R9761l0695J28940k81104J47779L9562j46168j09307K73872j01165
1616H7321J1780J771l8664j94209Q0074J69025m7181J33667l06849K95629N8192
$$ plain form
1605 250556 125691 61585 310781 87482 139114 -60702 1114 11006 85713 -93891 -13239
1594 -13239 52827 -116824 82206 166670 97396 15804 235532 214193 269638 132886 237401
1583 237401 201518 248909 -8930 168253 73112 -92012 -79064 81849 108399 -35497 19185
1572 19185 8308 112463 57272 64150 144282 132585 -65049 124148 81293 81130 -53538 138789
1560 138789 145557 178008 94817 118596 169006 124838 7309 117748 293515 122365 30185
1549 30185 36575 15818 -48040 69621 118068 57619 81547 183753 174716 237799 68877 199940
1537 199940 64698 49758 16097 304200 273060 64265 -8561 1605 7793 -67446 -167391
1526 -167391 -61755 128355 47272 40304 -119014 -45752 -125109 39178 64431 247011 328384
$$ packed form
1605B50556j24865o4106K49196k23299N1632j99816O1816R892P4707j79604Q0652
1594a3239O6066j69651J99030Q4464o9274q1592K19728k1339N5445j36752J04515
1583B37401l5883M7391k57839J77183r5141j65124J2948J60913K6550j43896N4682
1572A9185j0877J04155n5191O878Q0132j1697j97634J89197m2855j63j34668J92327
1560A38789O768L2451q3191K3779N0410m4168j17529J10439J75767j71150r2180
1549C0185O390k0757o3858J17661M8447o0449K3928J02206r037O3083j68922J31063
1537A99940j35242j4940l3661K88103l1140k08795p2826J0166O188p5239r9945
1526a67391J05636J90110q1083o968j59318P3262p9357J64287K5253J82580Q1373
$$ plain form
1515 328384 232978 50909 319260 239000 188532 266450 159996 5395 -15234 -41 60784
1504 60784 186049 66400 154075 121624 111454 71296 166767 35501 24958 38121 222376
1493 222376 57190 109157 189303 93922 7004 -131521 17049 4594 151061 119697 124619
1482 124619 51588 18869 57269 75177 54322 34166 86181 229681 146558 -89637 57371
1471 57371 72133 26145 -8031 152216 177434 64335 72322 143865 59505 8476 48512 55592
1459 55592 49900 43953 89683 172386 144088 -9772 198967 275928 197805 181289 88086 226374
1447 226374 335059 142528 81300 98225 45424 16898 14552 123497 34577 80739 132387
1436 132387 153612 204291 105133 117174 137260 42131 -108747 198610 165296 93061 -40750
$$ packed form
1515C28384r5406j82069K68351q0260n0468P7918j06454j54601k0629J5193O0825
1504F0784J25265j19649Q7675l2451j0170m0158R5471j31266j0543J3163J84255
1493B22376j65186N1967Q0146r5381q6918j38525J48570j2455J46467l1364M922
1482A24619p3031l2719L8400J7908k0855k0156N2015J43500q3123k36195J47008
1471E7371J4762m5988l4176J60247K5218j13099P987P1543q4360n1029M0036P080
1459E5592n692n947M5730Q2703k8298j53860K08739P6961p8123j6516r3203J38288
1447B26374J08685j92531o1228J6925n2801k8526k346J08945q8920M6162N1648
1436A32387K1225N0679r9158J2041K0086r5129j50878L07357l3314p2235j33811
$$ plain form
1425 -40750 -62240 45686 51707 94419 89767 257697 143800 181790 212994 88451 -31761
1414 -31761 179489 131746 164721 193995 104153 49213 231192 116740 47247 129836 207017
1403 207017 94782 64106 285327 287423 156266 87603 36348 -69138 -132140 -5375 262122
1392 262122 117249 101054 130305 149802 45440 44847 -43833 51964 47097 89997 129789 166933
1380 166933 61128 103394 84783 167994 55227 14539 205501 96812 36400 43351 35147
1369 35147 98127 99330 29065 293319 236342 37681 25373 18365 -68941 130719 141220 169888
1357 169888 75698 298637 75689 102009 -37373 -174230 76344 130520 66119 266157
1347 266157 307704 36558 64710 79582 111249 99487 106182 -37736 217774 86669 64445
$$ packed form
1425d0750k1490J07926O021M2712m652J67930j13897L7990L1204j24543j20212
1414c1761K11250m7743L2975K9274q9842n4940J81979j14452o9493Q2589P7181
1403B07017j12235l0676K21221K096j31157o8663n1255j05486o3002J26765K67497
1392B62122j44873j6195K9251J9497j04362n93q8680R5797m867M2900L9792L7144
1380A66933j05805M2266j8611Q3211j12767m0688J90962j08689o0412O951q204
1369C5147O2980J203p0265K64254n6977j98661j2308p008q7306J99660J0501K8668
1357A69888r4190K22939k22948K6320j39382j36857K50574N4176o4401K00038
1347B66157M1547k71146K8152J4872L1667j1762O695j43918K55510j31105k2224
$$ plain form
1336 64445 138860 161782 -99783 75543 201769 198714 129036 33137 27455 105087 85601 12186
1324 12186 245432 120867 82421 -13444 298609 234788 94899 -97343 -175762 15969 16417
1313 16417 161615 193164 171728 77530 100861 138685 196198 131453 22784 23853 105635 82616
1301 82616 10066 20653 18580 59359 21749 -27585 94136 69190 31536 120421 42736 76709
1289 76709 139344 219646 66769 -10045 238877 248331 103507 -50083 64695 12315 71680
1278 71680 275078 226276 259605 264195 93690 124800 278784 160381 96149 191929 -9387
$$ packed form
1336F4445P4415K2922k61565J75326J26226l055o9678r5899n682P7632j9486p3415
1324A2186K33246j24565l8446r5865L12053o3821j39889j92242p8419J91731M48
1313A6417J45198L1549k1436r4198K3331L7824N7513o4745j08669J069Q1782k3019
1301H2616p2550J0587k073M0779l7610m9334J21721k4946l7654Q8885p7685L3973
1289G6709O2635Q0302j52877p6814K48922R454j44824j53590J14778n2380N9365
1278G1680K03398m8802L3329M590j70505L1110J53984j18403o4232R5780k01316
$$ [...]
##END NTUPLES=NMR SPECTRUM
##END=
