##TITLE=1H_DE-80H_X3
 200.13MHz, d2o
 8 sc
 
 19ns.26.2.2025
##JCAMPDX= 6.0         $$ Bruker NMR JCAMP-DX V2.0
##DATA TYPE= NMR SPECTRUM
##DATA CLASS= NTUPLES
##ORIGIN= UXNMR, Bruker Analytische Messtechnik GmbH
##OWNER= pz
$$ XWIN-NMR		Version 3.5
$$ Thu Dec  4 11:57:04 2025 Russian Standard Time (UT+4h)  Yarkov@DPX200
##.OBSERVE FREQUENCY= 200.1313
##.OBSERVE NUCLEUS= ^1H
##.ACQUISITION MODE= SIMULTANEOUS
##.ACQUISITION SCHEME= undefined
##.AVERAGES= 8
##.DIGITISER RES= 18
##SPECTROMETER/DATA SYSTEM= spect
##.PULSE SEQUENCE= zg30
##.SOLVENT NAME= CDCl3
##.SHIFT REFERENCE= (INTERNAL, CDCl3, 0, 15.5442)
##AUDIT TRAIL= $$ (NUMBER, WHEN, WHO, WHERE, WHAT)
$$ ##TITLE= Audit trail, XWIN-NMR		Version 3.5
$$ ##JCAMPDX= 5.01
$$ ##ORIGIN= Bruker BioSpin GmbH
$$ ##OWNER= Yarkov
$$ C:/Bruker/XWIN-NMR/data/yarkov2/nmr/H-C/1/pdata/1/auditp.txt
$$ ##AUDIT TRAIL=  $$ (NUMBER, WHEN, WHO, WHERE, WHAT)
(   1,<2025-12-04 11:55:59.81 +0400>,<Yarkov>,<DPX200>,
      <created by zg, POWCHK disabled, PULCHK disabled
       configuration hash MD5:
       00 E9 B6 7A A2 85 ED C7 34 08 36 98 17 FE 4E 26
       data hash MD5: 16K
       EF B7 38 FE 67 A5 2A B5 BD 1E BC 78 E7 17 15 5B>)
(   2,<2025-12-04 11:56:04.07 +0400>,<Yarkov>,<DPX200>,
      <Start of raw data processing
       efp BC_mod = 2 LB = 0.25 FT_mod = 6 PKNL = 1 PHC0 = -5314.298 PHC1 = 31.02191 SI = 16K 
       data hash MD5: 16K
       45 99 20 D5 4B D5 29 A0 E8 54 F0 C0 DE 51 96 AE>)
(   3,<2025-12-04 11:56:09.15 +0400>,<Yarkov>,<DPX200>,
      <abs ABSG = 5 
       data hash MD5: 16K
       71 51 53 55 A3 91 C8 8B E1 19 E4 F3 8C FD 18 5B>)
(   4,<2025-12-04 11:56:33.42 +0400>,<Yarkov>,<DPX200>,
      <pk PHC0 = 1.653991 PHC1 = -7 
       data hash MD5: 16K
       82 FF E6 37 60 58 80 88 FD DB 93 C6 AA EE B7 7C>)
$$ ##END=
$$ 
$$ hash MD5
$$ 45 C5 0E 2A 98 82 0B 3F A6 36 46 A2 AF EF 7E E2
##$RELAX= 
##$RELAX= 
##$RELAX= 
##$RELAX= 
##$RELAX= 
##$RELAX= 
$$ Bruker specific parameters
$$ --------------------------
##$DU= <C:/Bruker/XWIN-NMR>
##$EXPNO= 1
##$NAME= <H-C>
##$PROCNO= 1
##$TYPE= <nmr>
##$USER= <yarkov2>
##$AMP= (0..31)
100 100 100 100 100 100 100 100 100 100 100 100 100 100 100 100 100 100 
100 100 100 100 100 100 100 100 100 100 100 100 100 100 
##$AQSEQ= 0
##$AQ_mod= 1
##$AUNM= <au_zg>
##$AUTOPOS= <>
##$BF1= 200.13
##$BF2= 200.13
##$BF3= 200.13
##$BF4= 200.13
##$BF5= 200.13
##$BF6= 200.13
##$BF7= 200.13
##$BF8= 200.13
##$BYTORDA= 1
##$CFDGTYP= 0
##$CFRGTYP= 5
##$CHEMSTR= <none>
##$CNST= (0..31)
1 1 145 1 1 1 1 1 1 1 1 1 1 1 1 1 1 1 1 1 1 1 1 1 1 1 1 1 1 1 1 1 
##$CPDPRG= <>
##$CPDPRG1= <>
##$CPDPRG2= <>
##$CPDPRG3= <>
##$CPDPRG4= <mlev>
##$CPDPRG5= <mlev>
##$CPDPRG6= <mlev>
##$CPDPRG7= <mlev>
##$CPDPRG8= <mlev>
##$CPDPRGB= <>
##$CPDPRGT= <>
##$D= (0..31)
0 0.7 0 0 0 0 0 0 0 0 0 0.03 0 0 0 0 0 0 0 0 0 0 0 0 0 0 0 0 0 0 0 0 
##$DATE= 1764834959
##$DBL= (0..7)
120 120 120 120 120 120 120 120 
##$DBP= (0..7)
150 150 150 150 150 150 150 150 
##$DBP07= 0
##$DBPNAM0= <>
##$DBPNAM1= <>
##$DBPNAM2= <>
$$ [...]
##$SUBNAM3= <"">
##$SUBNAM4= <"">
##$SUBNAM5= <"">
##$SUBNAM6= <"">
##$SUBNAM7= <"">
##$SUBNAM8= <"">
##$SUBNAM9= <"">
##$SW= 18.0517328524113
##$SWIBOX= (0..15)
0 0 2 0 0 0 0 0 0 0 0 0 0 0 0 0 
##$SW_h= 3612.71676300578
##$TD= 16384
##$TD0= 1
##$TE= 0
##$TE2= 300
##$TE3= 300
##$TEG= 300
##$TL= (0..7)
0 120 120 120 120 120 120 120 
##$TP= (0..7)
150 150 150 150 150 150 150 150 
##$TP07= 0
##$TPNAME0= <>
##$TPNAME1= <>
##$TPNAME2= <>
##$TPNAME3= <>
##$TPNAME4= <>
##$TPNAME5= <>
##$TPNAME6= <>
##$TPNAME7= <>
##$TPOAL= (0..7)
0.5 0.5 0.5 0.5 0.5 0.5 0.5 0.5 
##$TPOFFS= (0..7)
0 0 0 0 0 0 0 0 
##$TUNHIN= 0
##$TUNHOUT= 0
##$TUNXOUT= 0
##$USERA1= <user>
##$USERA2= <user>
##$USERA3= <user>
##$USERA4= <user>
##$USERA5= <user>
##$V9= 5
##$VALIST= <valist>
##$VCLIST= <CCCCCCCCCCCCCCC>
##$VD= 0
##$VDLIST= <DDDDDDDDDDDDDDD>
##$VPLIST= <PPPPPPPPPPPPPPP>
##$VTLIST= <TTTTTTTTTTTTTTT>
##$WBST= 1024
##$WBSW= 4
##$XGAIN= (0..3)
0 0 0 0 
##$XL= 0
##$YL= 0
##$YMAX_a= 891133
##$YMIN_a= -810439
##$ZGOPTNS= <>
##$ZL1= 120
##$ZL2= 120
##$ZL3= 120
##$ZL4= 120
##$ABSF1= 15.49898
##$ABSF2= -2.55287
##$ABSG= 5
##$ABSL= 3
##$ALPHA= 0
##$AQORDER= 0
##$ASSFAC= 0
##$ASSFACI= 0
##$ASSFACX= 0
##$ASSWID= 0
##$AUNMP= <proc_1d>
##$AZFE= 0.1
##$AZFW= 0.1
##$BCFW= 0
##$BC_mod= 2
##$BYTORDP= 0
##$COROFFS= 0
##$CY= -3
##$DATMOD= 1
##$DC= 0
##$DFILT= <>
##$DTYPP= 0
##$F1P= 0
##$F2P= 0
##$FCOR= 1
##$FTSIZE= 16384
##$FT_mod= 6
##$GAMMA= 0
##$GB= 0
##$INTBC= 1
##$INTSCL= 3.241238e-09
##$ISEN= 128
##$LB= 0.25
##$LEV0= 0
##$LPBIN= 0
##$MAXI= 10000
##$MC2= 0
##$MEAN= 0
##$ME_mod= 0
##$MI= 1.114404
##$NCOEF= 0
##$NC_proc= -6
##$NLEV= 6
##$NOISF1= 3.799351
##$NOISF2= 2.8
##$NSP= 0
##$NTH_PI= 0
##$NZP= 0
##$OFFSET= 15.54416
##$PC= 1
##$PHC0= -5312.644
##$PHC1= 24.02191
##$PH_mod= 1
##$PKNL= yes
##$PPARMOD= 0
##$PSCAL= 0
##$PSIGN= 0
##$REVERSE= no
##$SF= 200.129995504866
##$SI= 16384
##$SIGF1= 3
##$SIGF2= 2
##$SINO= 0.751879
##$SIOLD= 32768
##$SREGLST= <19F.Aceton>
##$SSB= 0
##$STSI= 16384
##$STSR= 0
##$SW_p= 3612.71676300578
##$SYMM= 0
##$S_DEV= 0
##$TDeff= 16384
##$TDoff= 0
##$TI= <>
##$TILT= no
##$TM1= 0
##$TM2= 0
##$TOPLEV= 0
##$USERP1= <user>
##$USERP2= <user>
##$USERP3= <user>
##$USERP4= <user>
##$USERP5= <user>
##$WDW= 1
##$XDIM= 16384
##$YMAX_p= 321719505
##$YMIN_p= -1814539
$$ End of Bruker specific parameters
$$ ---------------------------------
##NTUPLES= NMR SPECTRUM
##VAR_NAME=  FREQUENCY,     SPECTRUM/REAL,   SPECTRUM/IMAG
##SYMBOL=    X,             R,               I
##VAR_TYPE=  INDEPENDENT,   DEPENDENT,       DEPENDENT
##VAR_FORM=  AFFN,          ASDF,            ASDF
##VAR_DIM=   16384,         16384,           16384
##UNITS=     HZ,            ARBITRARY UNITS, ARBITRARY UNITS
##FACTOR=    0.220516191357247, 1,           1
##FIRST=     3110.85264875676, 0,            0
##LAST=      -501.864114249025, 0,           0
##MIN=       -501.864114249025, -1814539,    0
##MAX=       3110.85264875676, 321719505,    0
$$ Real data points
##PAGE= N=1
##DATA TABLE= (X++(R..R)), XYDATA
$$ [...]
11007 141969 151665 140307 115656 87127 78116 127760 85215 59961 101837 109963 103703 100828
10995 100828 85425 56990 71750 113378 124443 127160 82505 134718 144015 100170 57506 13633
10983 13633 35571 102526 87175 33829 -17137 30219 81590 88163 80658 97558 132850 135699
10971 135699 124209 158110 157590 77716 98522 161699 96591 117361 92304 67255 118279 95507
10959 95507 108200 144448 144092 79783 52721 113862 121747 106806 80940 55417 44399 73210
10947 73210 124801 120365 102732 101327 97001 61215 59670 34744 40967 21837 30492 29691 -6575
10934 -6575 25137 45049 70097 127352 107922 97731 19978 14243 94398 130206 145537 163215
10922 163215 113288 57206 21078 39670 3035 -37349 -5126 9976 103603 136759 118759
10911 118759 90032 108941 59943 89123 129311 89934 90202 145389 174962 184355 212311 159032
10899 159032 141799 88201 157604 167540 129951 83074 89625 131718 118334 76458 87001 115556
10887 115556 180610 128295 101474 156752 126935 50230 36698 79969 93745 83127 86870 63539
10875 63539 92318 33170 64489 65939 29366 6192 55385 85275 95731 143142 128314 156090
10863 156090 83763 82259 98832 109501 103846 107578 91918 102269 84477 95811 111857 113708
10851 113708 181834 133866 130170 175258 167990 155231 118715 134474 173769 151486 131242 103566
10839 103566 76204 55348 73957 123606 79041 65534 109495 193949 162313 121697 68450
10828 68450 35497 55986 47543 20185 63579 77610 81875 125089 120378 149212 153204 91360
10816 91360 48226 31758 62254 23315 28792 119411 147040 168471 169030 118774 69302 59843
10804 59843 97625 138053 115713 74801 56430 37877 16410 79838 79199 96033 95498 57992
10792 57992 48300 135868 148578 143263 144974 137582 219677 152109 139584 115553 121587 82052 153585
10779 153585 130974 164670 190669 160323 186042 131484 98943 120558 153819 106498 130240
10768 130240 114769 159642 153460 51379 72166 82117 112667 126100 91039 143066 186550 131178
10756 131178 124771 130936 107565 90683 101115 69755 86225 64742 76270 87647 83152 73857
10744 73857 94537 111555 150671 97442 65994 91993 101879 106345 58483 71071 120173 168535
10732 168535 221334 183110 118806 70983 109806 109995 82564 154685 176104 166022 144835 74687
10720 74687 77056 129571 104308 96946 137115 140461 89335 152529 111845 134547 153856 234090
10708 234090 228990 143405 37624 107725 148352 133603 123810 58280 89089 142513 122337 145615
10696 145615 80437 72793 99591 158477 177653 160746 177299 162491 157523 110440 86281 171751
10684 171751 165606 114596 134905 81799 109951 170880 207812 186255 104974 191384 160515 127227
10672 127227 133130 163690 219160 168080 149387 174211 105272 156460 136101 95962 128871 129635
10660 129635 114634 130721 126587 106207 130708 104130 170556 214006 129540 73319 129091 144989
10648 144989 231313 228888 183738 174572 119494 55742 70044 95516 181805 95565 88237 138942
10636 138942 85166 78843 90293 131830 193961 172343 127239 96334 90368 89836 63386 84698
10624 84698 101127 64331 59922 108938 93637 116247 99157 80849 67362 51757 126241 142623
10612 142623 160578 141688 102134 127296 131944 124853 193853 166195 139787 177897 123960 108215
10600 108215 143161 151156 140482 120235 163802 131573 131662 104564 127515 121750 86487 101216
10588 101216 115907 157312 239217 230178 251235 182009 170511 154877 110229 106947 118973 158383
10576 158383 170372 120705 88150 101545 155381 170351 126311 118654 110104 139300 138296 136462
10564 136462 150359 111909 131372 145508 120604 128945 110941 160275 178113 74694 74593 104193
10552 104193 121126 117443 60665 128151 143154 94562 60363 123649 127811 93057 92528 108843
10540 108843 69153 105175 92154 66066 62030 153399 184014 107020 120441 132363 114379 137124
10528 137124 124171 74193 86826 120932 115887 104607 119638 166669 191385 216222 293396 238782
10516 238782 176438 83837 56705 10809 36257 127310 130025 172717 73942 138317 155868 109094
10504 109094 153522 198123 164854 168054 118745 168307 168300 116089 123090 84603 81756 129841 95991
10491 95991 68725 88478 106547 144532 144382 136943 115348 161030 203628 149335 119802 153048
10479 153048 180080 160197 199160 114118 67465 112850 120577 105055 88799 118457 113851 135517
10467 135517 118857 74191 101328 203767 195431 191300 151339 158045 172937 110170 148401 120642
10455 120642 104625 65683 90129 146597 170182 87596 16342 118954 151364 147482 171743
10444 171743 124767 104403 112496 102945 124609 169269 125531 92989 95028 30479 90281 120866
10432 120866 189705 168642 153771 174778 137833 105073 116815 142779 137336 75522 114273 93268
10420 93268 148249 139355 56556 31243 6822 32516 46120 86632 109507 84144 162372 148821
10408 148821 195311 155495 175251 203997 174126 153015 73115 84965 199040 223326 242422
10397 242422 190924 164846 157057 133704 134175 134323 193171 87174 125583 211065 168680 121918
10385 121918 176309 218954 213527 187750 228765 158862 137011 152631 169111 194051 166757 133179
10373 133179 98115 216090 197486 108671 114702 155295 163375 149911 141373 129585 108401 118508
10361 118508 154447 97942 49601 98076 101860 43247 26222 58935 66996 106374 143065 99016
10349 99016 148956 147683 134036 164729 195093 227528 150907 107449 170282 127061 109976 162389
10337 162389 133006 84399 118301 117473 128610 142963 117580 117874 142687 192360 156193 43954
10325 43954 118800 129324 78674 144381 193565 263451 250169 136306 64065 71679 106353 87103
10313 87103 144245 142514 108453 90542 145780 173593 122316 94583 103067 60253 47185 77264
10301 77264 71808 37725 132371 146504 188065 170907 141334 143912 92254 119596 98309 82310
10289 82310 145657 148015 142736 122093 121109 218362 268650 192893 179251 182196 174170 217340 150812
10276 150812 161669 158062 201856 218225 171845 97471 98249 147483 156564 128284 56030 79679
10264 79679 74756 106229 232148 254780 259317 227494 253556 246669 238722 202991 195748 150912
10252 150912 185743 174883 84076 118719 150699 187130 116781 88499 191677 224584 180616
10241 180616 187277 184093 187091 231271 197858 133055 134764 152787 150725 157187 167617 182343 121865
10228 121865 77513 93871 47227 115198 223303 215874 189974 231624 184950 138200 190666
10217 190666 190444 182685 196390 177665 92022 107682 175744 175339 115199 128908 148963 177800
10205 177800 176587 141159 154977 154647 101461 94218 103673 153292 155363 182053 157476 139557 178421
10192 178421 186765 192184 228396 208265 169944 177804 184557 84495 133894 206130 180751 173270
10180 173270 214224 257666 196040 157966 175800 159474 147509 186521 210600 212948 155926 91758
10168 91758 116277 136807 79492 87473 77435 121202 79286 83153 126977 131376 115143 133222
10156 133222 186535 165650 179032 156417 130177 138723 148126 140652 92513 185721 150796 189289
10144 189289 240419 181259 171800 132304 161562 186030 161608 139984 131261 194473 151065 172888
10132 172888 146669 57758 108855 158689 148767 165678 188860 182947 205256 170409 189281 195855
10120 195855 123701 158498 189958 214560 224691 217529 176340 116499 147513 192717 168124 197928
10108 197928 230493 173817 125595 160580 251768 209236 106046 143315 145568 126889 182302
10097 182302 192517 134961 119467 150961 207379 144017 142758 166966 230692 249566 253329 286999
10085 286999 251857 236196 270205 206075 131089 187227 182199 207667 273917 290613 150359
10074 150359 148745 182710 169942 255453 263541 207874 221281 174809 145819 128274 144637 99793
10062 99793 168179 167284 182596 273439 291496 248792 200766 178405 159686 168816 138366 131885
10050 131885 173328 154612 143761 196966 176792 119379 87204 91949 126718 162187 208829 212929
10038 212929 174224 162876 172026 188473 192751 182679 155329 84270 101597 147320 119841 151579
10026 151579 197463 209740 171961 183603 189389 227496 239819 168472 135556 103046 115281 137806
10014 137806 108099 115746 99424 113204 140461 166846 227099 185583 216045 173558 108937 170338
10002 170338 217766 226986 144606 136855 114751 55552 31425 20507 42071 45818 113056 180444
9990 180444 186671 156419 184281 187903 150700 136165 139294 168335 200932 227962 200391 172998
9978 172998 71090 66400 103107 136336 96600 85322 95865 131784 154352 93940 63103 43637
9966 43637 134460 140249 115829 70085 182035 207516 185024 135806 118912 75975 133436 191998
9954 191998 155928 224235 149781 74515 150191 178796 149967 150325 130699 106617 147691 162970
9942 162970 158005 204921 172722 143433 105303 162506 121333 119202 138303 155297 167030 172382
9930 172382 129947 144405 142470 158266 166125 157640 117198 150589 183646 190829 257988 196112
9918 196112 156545 99008 92168 200145 210021 206486 188136 166972 124177 142720 247951 197252
9906 197252 172054 134401 149469 147831 178304 200325 128906 72787 138326 201541 218285 178923
9894 178923 162444 182581 182065 219004 183722 138336 134514 153471 175866 187397 204334 172084
9882 172084 197376 156149 96598 124921 149635 125795 168342 226618 241382 265911 176265 169619
9870 169619 190380 150529 193528 211946 132454 163958 175383 196430 177412 190580 169969 167069
9858 167069 123284 146702 180897 169508 150015 193072 214278 244705 265731 250136 208847 165343
9846 165343 195715 165390 211932 152962 161299 224711 183108 190401 205223 204020 207639 165819
9834 165819 148889 145144 163812 151038 193573 190182 215607 236224 226608 259003 191676 119909
9822 119909 122218 147134 198662 185244 226446 194591 101598 157145 191558 145514 184896 142544
9810 142544 126630 158741 125230 94299 140905 131746 162373 255476 234020 229236 209867 215724
9798 215724 200826 188413 258311 247860 232760 195096 225737 193598 179568 240593 227507 233760
9786 233760 221723 160050 160253 142923 109534 183784 216774 184110 156969 155631 98267 120537
9774 120537 201771 262492 240109 189218 145761 139459 199584 190843 173752 216298 228825 287918
9762 287918 304402 290833 249622 200932 192905 229871 230289 199034 194189 147054 172365 205635
9750 205635 194996 201517 160366 195284 182642 184232 161880 173265 211162 243494 238579 204092
9738 204092 133528 184972 288801 193249 198770 178473 279818 222826 190158 154341 155148 183095
9726 183095 200098 221786 241034 234050 168091 183705 202363 199200 163509 128518 98892 161308
9714 161308 184007 167993 177552 237946 181591 181106 180014 255973 202958 163517 160590 228408 223085
9701 223085 201040 189446 240242 165310 103206 125951 174107 193081 218574 231664 238547 208613
9689 208613 123279 177038 196469 177538 219651 291993 225904 216827 299044 311237 220457 258173
9677 258173 249918 226111 198110 159619 158180 208201 166798 201854 224488 267568 183255 129048
9665 129048 164275 225287 165861 176848 180939 187072 204123 243966 267039 196103 197088 160748
9653 160748 230025 182630 187311 245439 225749 242663 259661 233874 203202 222539 221916 229374
9641 229374 234911 263646 199106 179048 159373 191603 219614 229637 208232 169759 199892 163215
9629 163215 175293 196392 177203 150017 188139 194861 211690 252627 269717 190061 192243 177393
9617 177393 168940 262405 287255 236426 254505 225166 271224 273401 246402 242938 214299 230956
9605 230956 195053 204740 225730 203237 178549 238389 271891 291825 265374 261240 249068 212063
9593 212063 240773 243838 260205 277340 252031 207466 228028 201207 245432 214477 274200 294209
9581 294209 237606 172879 161314 167731 135090 205100 248230 203350 222857 241011 181669 237659
9569 237659 195496 174390 202938 215080 189775 176465 167379 170508 219937 203117 233241 205392
9557 205392 222281 167931 113593 168282 165539 208016 198253 193998 159624 200665 167191 176028
9545 176028 185837 237152 224474 208254 209200 214794 249844 177085 203956 218999 227680 311751 258878
9532 258878 179569 222532 223792 249890 219721 112842 225494 281667 207311 275908 250607
9521 250607 259810 265776 247328 303055 307816 236666 261896 209551 182425 234237 235524 283359
9509 283359 250593 197491 145857 173497 251738 227473 236471 261690 193972 170366 223618 220010
9497 220010 184067 210268 235860 227841 217085 234325 261547 232743 250445 219504 199164 196116
9485 196116 179414 208375 203026 258141 197658 232534 229389 231597 266262 307123 293145 281892
9473 281892 268347 174323 196466 236560 178477 180703 222294 199371 197610 147905 183471 231682
9461 231682 275762 291326 278468 252195 225095 175752 203239 247505 177608 226611 263767 226195
9449 226195 223868 226796 225535 185144 253247 253492 210157 234152 239974 223313 264526 293725 258029
9436 258029 233118 178299 158188 185783 239537 226883 120649 149875 232581 221438 242039
9425 242039 270822 171164 179906 226317 231963 268708 307992 258122 166665 209193 274228 285283
9413 285283 265889 222056 224352 250631 241375 247756 184447 184961 230717 240463 242183 222916 257584
9400 257584 339978 326043 308671 267731 298972 318956 283209 291369 234372 279540 334520 306826
9388 306826 301047 321439 326824 268756 308789 299346 271237 299687 221057 223016 242190 300227
9376 300227 263068 273828 261621 225625 227906 249402 239041 254800 254752 222871 232161 223060 214341
9363 214341 200655 232022 165874 159047 195402 226932 177416 159755 130956 204375 313854 241326
9351 241326 224046 253950 275519 305271 327777 296832 244477 184321 213526 260872 280882 252025
9339 252025 217098 220654 228665 227676 231374 227072 238399 251976 232987 264069 283161 242718 220239
9326 220239 223179 222825 259986 277700 230418 228214 273025 241770 270595 228623 215734 265089
9314 265089 251911 282826 268144 254685 209029 163654 250864 229696 226385 202725 162319 226444
9302 226444 206655 199302 230432 226025 283899 282243 271911 273370 259851 278369 314518 275475
9290 275475 228401 229818 229315 267221 262320 240415 229888 255046 254333 246795 237324 225736 231533
9277 231533 250157 331684 253969 241622 270796 260049 308078 280255 190909 201776 246748 241408
9265 241408 229235 319109 274868 247787 250986 286122 230715 226111 331727 305031 317746 284824
9253 284824 257777 267092 284432 320475 336360 306371 286883 286505 281543 248793 270756 270884 280805
9240 280805 246465 237955 218788 285596 249416 248332 207040 214574 212985 201522 247970 201233
9228 201233 208111 256277 254640 306962 344879 288467 267809 300836 297720 265551 290976 345420
9216 345420 345647 294236 283845 329825 309323 291232 308023 342064 323761 286832 222521 210035
9204 210035 231606 306582 277562 238426 246788 268519 280929 294847 297692 325349 282261 219692
9192 219692 209201 225800 302777 276432 235918 188595 195109 241285 265877 284142 288634 213734
9180 213734 229776 253156 213405 235920 280303 265412 250782 235074 229210 297402 324304 325306
9168 325306 330110 239434 236005 290697 335908 246878 277576 245841 216309 258535 277322 265438
9156 265438 261048 294505 309378 274012 278959 294706 320322 340963 353153 341378 328082 294726
9144 294726 284901 330699 338941 312656 309496 301455 293836 293282 332369 370932 309932 254503 246755
9131 246755 293150 300200 312664 302744 259264 242380 303134 317498 276244 271332 318337 294584
9119 294584 282530 316402 328566 321438 270952 336862 282468 209872 274200 309346 306944 232673
9107 232673 192183 233808 244575 261629 238516 245102 307332 336757 304733 262648 283931 267811
9095 267811 262102 274850 273250 321701 278181 249089 306097 285157 290900 322102 277015 316369
9083 316369 323534 308639 264837 307629 335902 387613 391958 366178 322131 337075 369045 360748
9071 360748 361227 308425 314563 283984 356977 401632 411760 366562 376225 375042 338995 305926 385575
9058 385575 336075 298438 270291 298256 361725 377234 348294 408518 427248 343482 285113 281914
9046 281914 259469 332388 346015 314837 334802 345870 363907 364405 383664 378218 383920 407943
9034 407943 370710 382428 390787 425886 428308 396623 397066 415920 425247 440278 437304 432872 396850
9021 396850 368350 396159 414852 423066 400651 302252 284032 358364 388032 427306 418786 430863
9009 430863 349630 371743 412060 407324 445501 406974 381372 414263 445390 429235 383813 426184
8997 426184 448281 456838 465070 449440 492696 467581 412208 453671 481836 557582 495184 521477
8985 521477 558781 503850 396395 476029 517881 499805 422006 413113 498973 543701 605989 679136
8973 679136 595095 543435 528851 510944 551913 632594 699739 686482 635839 660447 701972 640231
8961 640231 624058 661197 707410 793423 869561 812395 824149 864288 923956 965233 926852 956765
8949 956765 1023778 1011841 1048927 1107701 1292841 1406342 1417305 1552054 1678156 1720407 1798223
8938 1798223 1892471 1976613 2199317 2453147 2833096 3341793 3996598 4930651 6384063 8619589
8928 8619589 11724426 14340499 15212621 14737607 12521111 9545064 7120693 5380944 4158328
8919 4158328 3415662 2892334 2491328 2119735 1774895 1545995 1400690 1197190 1023893 951862
8909 951862 887502 905164 868272 751334 780228 710971 626866 703661 735207 652690 585242
8898 585242 619191 582557 604539 554619 508199 510477 493484 528543 578890 577008 595115 515309
8886 515309 531882 530981 529115 524611 493811 456399 433241 424894 430366 448206 476748 438264 406161
8873 406161 355364 332290 422795 441625 472318 415674 417888 323289 369979 417915 415063 378364
8861 378364 316238 286588 328591 334453 296717 328698 367178 323368 340716 382012 373348 405364
8849 405364 332551 411568 418190 446228 404113 372604 384868 392563 419190 329553 316095 314715
8837 314715 285649 331648 348350 361326 291780 259636 373151 394296 342622 273125 302794
8826 302794 388226 350740 383910 396119 414150 418948 362142 355445 356880 398791 277673 268967
8814 268967 323980 350920 324525 348662 308761 291796 302080 251013 274692 292093 302862 310504
8802 310504 264654 263862 307063 343681 371456 324880 333191 339670 346938 287190 291129 289100 300330
8789 300330 379967 358286 317417 370886 346477 406938 402627 422490 399944 390309 382976 357051
8777 357051 380196 383149 376133 355143 356145 330964 354501 326091 322744 346390 330348 320170
8765 320170 364590 360043 326204 281687 320085 297226 269395 250103 268699 294473 320967 290305
8753 290305 336142 357088 333047 364197 288538 257472 318672 302262 332541 288313 278040 306885
8741 306885 302931 332333 320367 345707 339455 333352 342819 333161 355116 386607 404595 435543 403147
8728 403147 432059 313185 326916 285560 275032 290313 315015 341728 364832 312766 361906
8717 361906 441960 341500 299527 345951 421563 436956 411644 399675 352633 251267 304245
8706 304245 368455 328382 292192 278777 277782 353195 306517 308436 261704 315365 322146 268013
8694 268013 331533 334575 307323 231238 177100 171867 223996 305967 319257 288618 287694 280780 228353
8681 228353 202713 219660 201820 220603 282024 271030 304369 336689 359393 302299 228921 236717
8669 236717 281464 256955 236627 263429 260050 370443 380267 294198 260896 295380 350098 233347
8657 233347 207042 247714 298100 309659 326595 352556 307145 296629 286008 309416 293677 307087
8645 307087 314636 264660 310791 302084 282465 275501 277893 223599 204013 231098 297518 335115
8633 335115 329441 334510 265272 286626 267916 261487 175827 233938 230413 206673 283291 262415
8621 262415 298819 365825 298061 294826 322273 297307 199993 242160 249194 297159 334450 277237
8609 277237 271172 241627 314680 377072 382822 286301 247615 277595 258626 262213 301335 279370
8597 279370 210498 226895 298321 310214 253850 258988 322358 300454 316705 318001 326098 290480
8585 290480 291738 282548 294770 329199 129186 4727 330797 380437 332745 254703 301232
8574 301232 357592 320406 343960 334924 348340 280594 292177 276811 246621 231814 308193 271663
8562 271663 260203 262366 239206 260596 295705 346537 364644 361469 339137 304125 278036 255705
8550 255705 244272 252852 300740 301513 302404 352195 358183 332107 291310 260152 282200 353484 307087
8537 307087 249188 267493 294846 314668 307551 299251 369925 406632 309409 282829 278714 227268
8525 227268 247209 307579 302834 376493 329717 261552 314244 324290 244078 280751 341053 350647
8513 350647 322851 350459 289707 268027 239293 228185 245479 233887 234112 237157 232965 194893
8501 194893 255608 328382 314450 284327 334716 348546 303752 296420 295754 308656 296171 321482
8489 321482 313061 316359 262349 278933 306052 288025 322502 249407 291641 327705 344184 294547
8477 294547 379745 352990 319717 343892 356160 339769 284125 230366 312654 301057 316301 311095
8465 311095 358623 298827 269289 263113 251916 305134 293130 365887 348210 316672 272888 301209
8453 301209 364238 388937 306558 356449 368950 392773 419305 396086 476876 493303 445284 367519
8441 367519 387085 359649 363035 355212 331716 300950 307308 382254 447614 434229 391806 388483
8429 388483 351895 348560 316077 285049 262441 228694 307833 353303 414660 373112 295569 371773
8417 371773 386748 406711 326731 297048 299099 319127 302920 276841 324308 402112 326501 283448
8405 283448 399559 411403 356928 274189 340140 381493 316331 288065 366308 408625 343127
8394 343127 365328 283507 266160 260406 318466 330614 355889 334217 358927 404590 395376 368326
8382 368326 304466 329534 319266 341444 382457 314826 297222 351622 319684 321327 314499 375859
8370 375859 461949 352881 412488 390676 340489 287915 245621 341319 352873 387636 380709 476312
8358 476312 424977 438694 554285 463083 468428 434273 359595 319182 311528 326316 337828 362841
8346 362841 318932 269332 260364 302909 288887 206836 203733 325103 415148 376912 327062 373860
8334 373860 421731 425338 417214 391783 288481 326819 354202 279640 237875 273964 366362 347423
8322 347423 333986 421873 384552 373846 321885 320667 388941 353949 347359 341658 307104 386205
8310 386205 344150 266509 311081 334434 310902 289130 292257 388017 407291 332997 259312 209022
8298 209022 255004 331569 338343 271474 301625 315448 321829 311418 281509 253207 262155 246617
8286 246617 313277 368513 358179 373608 388336 408046 432059 402426 375119 351899 277459 266190
8274 266190 335570 318309 270695 283148 345870 352389 319036 365062 415307 396503 355180 324348
8262 324348 289901 298974 311964 315258 315959 292846 279460 288292 308857 357910 387325 336523 319942
8249 319942 311079 262662 296506 360630 370724 354049 387917 326724 249026 239895 299838 349627
8237 349627 298638 276136 288495 318388 368578 348564 336983 340736 317523 319949 377231 339814
8225 339814 294650 307692 249940 280288 311157 348903 318031 272826 296427 301070 357599 351023
8213 351023 301310 298630 310096 288979 292731 227510 258848 282311 358193 392677 342959 261604
8201 261604 203391 256668 297024 238681 289761 330464 362860 340474 381541 958082 751321
8190 751321 482694 474380 436221 512152 440744 468956 461981 459442 442750 401876 392673 402219
8178 402219 426370 431386 386015 417373 395415 393803 349109 325523 353616 357274 420780 405951
8166 405951 448078 418582 367930 356463 389727 425818 452647 406888 431919 499531 448131 401770
8154 401770 423808 472773 465058 450343 422578 374214 370370 394183 399078 392619 351171 369911
8142 369911 298046 305614 309746 292903 357586 315725 311017 331121 311385 285113 319056 390209
8130 390209 388170 407259 381439 368378 351542 343947 351580 417300 466318 465722 397068 410674 396959
8117 396959 338095 450527 364405 347072 354923 402051 385382 366783 352644 401236 394394 411490
8105 411490 381387 351762 408575 387621 418442 391927 379388 422816 454491 430748 358078 320968
8093 320968 338123 332674 391155 339954 324502 353871 410860 393588 360620 335491 283894 328123
8081 328123 404319 336302 297850 303420 378049 367698 351978 337034 361850 357868 403811 362402
8069 362402 347342 414506 411542 428093 464530 470454 414978 365822 325446 367812 425220 456142
8057 456142 422889 416476 407874 341435 255965 236277 327019 346917 363393 398211 364682 314081
8045 314081 349616 424204 423001 430587 405959 375254 394575 380060 425425 473685 428611 414646
8033 414646 363705 344195 408837 456799 423775 425585 368206 341969 399180 476338 447935 424791
8021 424791 386265 372410 371625 363159 372107 353633 385043 435428 380438 415983 317991 296223
8009 296223 426223 368220 288311 319507 381257 403381 377554 399671 410923 421350 380331
7998 380331 310521 355409 335072 278240 330799 398528 359942 360721 369632 312352 348634 427685
7986 427685 439703 428110 418641 379958 432093 425506 424965 456561 459639 464090 438730 414933 467380
7973 467380 412209 331850 408012 434709 483609 498336 446309 396797 367737 353134 378172 344677
7961 344677 319958 332259 362242 347211 350937 407121 453239 417005 417935 369284 416594 443381
7949 443381 363881 354389 334306 389305 408504 384453 330597 343159 449912 434388 482606 442558
7937 442558 373507 404316 431168 449057 427599 430476 424369 386117 419274 427535 375743 374178
7925 374178 420548 419515 430062 468323 462988 425067 408850 381032 368106 405086 346432 353817
7913 353817 386123 361317 374446 338887 373679 354263 378812 410806 415665 401355 409309 429464
7901 429464 439130 391146 474813 475418 473994 422398 367816 434045 399986 441426 348225 355652 417958
7888 417958 428019 376074 400850 362523 299529 329598 364248 340083 333341 407717 448974 396105
7876 396105 402155 413238 416770 377377 411073 450839 498516 439847 442946 446976 369876 438683
7864 438683 492148 521922 525928 513407 469964 476865 514032 402868 415702 501110 516500 515288
7852 515288 485799 427662 420370 459901 397471 408111 416505 386156 361449 375611 370712 361679
7840 361679 339779 356449 418671 388724 344978 455322 456146 441255 515851 467432 501952 475982
7828 475982 478363 490240 385752 364316 409008 436249 409763 348686 346860 310144 301352 376189
7816 376189 345044 360706 411810 393741 469582 489372 495238 516111 592468 492887 432251 335555
7804 335555 230230 444740 470134 478779 458656 410109 394183 423717 399352 382674 361381
7793 361381 430244 471256 473989 462981 440027 445074 456951 375630 448005 468835 416081 408065
7781 408065 422900 539114 504589 443425 432281 449378 443798 489312 468019 395874 390065 417445
7769 417445 472970 495648 419919 411142 457264 487001 454302 423411 398599 423676 460932 535748
7757 535748 562278 529324 422452 439149 475434 489579 449082 458965 508149 491188 463933 397160
7745 397160 426863 444422 452375 413770 528995 521477 461770 436417 463524 511336 538988 507165
7733 507165 523330 497848 447271 473107 533862 546377 476790 472201 471397 509035 506239 497301 432505
7720 432505 474652 601112 584965 517600 475024 392081 343547 372642 387219 425260 453356
7709 453356 493325 444051 433947 524256 578777 551189 453737 508172 583606 522773 462131 483299
7697 483299 465067 507580 446541 482610 472437 407016 392162 387903 472578 466817 452873 471988
7685 471988 462293 499521 503676 501151 498106 452376 424179 436933 503917 495594 480552 451984 461642
7672 461642 507309 505342 536432 531742 529876 540108 522558 512152 473715 481622 468751 489007
7660 489007 528910 526698 573429 534888 525714 445126 412871 490385 491781 473405 491663 542180
7648 542180 530708 546647 485136 518592 608883 564308 575057 561638 529747 508950 455112 477897
7636 477897 503799 551565 520957 513063 524495 489826 543565 548651 498105 508229 530893 542036
7624 542036 493674 493395 504265 458066 429036 513057 560098 552324 559931 531823 482622 502787
7612 502787 538655 514576 469172 474760 488932 472356 430951 495865 568070 530825 532206 524847
7600 524847 562418 525768 488301 477607 546178 568539 556867 520549 464773 498080 540939 519699
7588 519699 536703 588164 530798 536291 533876 471041 480361 478786 482091 484383 488404 510480 500467
7575 500467 482075 440570 475842 465992 464004 523133 563480 596844 492695 498326 579078 568293
7563 568293 490913 519734 600020 578137 541220 526157 483920 495117 529325 525882 507904 558560
7551 558560 555851 485984 480934 573172 612993 602647 574269 572482 612690 571916 575504 636966
7539 636966 664380 604878 596073 571992 566516 586569 568273 591332 653516 585512 595597 572824
7527 572824 589402 562147 558029 608935 590489 596877 594156 533660 569652 545418 545468 544265 561726
7514 561726 647800 717457 727336 794038 728169 704556 681515 710665 757242 746230 841149 1006818
7502 1006818 1203694 1221371 1207410 1017946 909339 832864 814756 758049 714302 688635 694519
7491 694519 644145 624220 623377 632736 667412 600389 541960 604946 600615 605473 604554 606819 603585
7478 603585 576058 611860 640421 647557 689749 668028 649829 588956 549622 586193 598353 577567
7466 577567 579697 560166 578709 599799 565838 593556 597815 553709 580677 546661 581752 569191
7454 569191 481445 529864 546653 555471 579533 598518 594033 583949 546369 518131 572567 604697
7442 604697 619687 638490 617455 570204 557604 649273 639578 611255 627425 618901 562722 593051
7430 593051 616371 558939 578292 582264 568594 630608 666459 664990 615834 606353 673785 586004
7418 586004 596832 637544 662782 635542 591456 667203 662147 661154 624610 646511 632707 602642
7406 602642 639552 724181 687898 679298 640918 718032 763405 742626 721544 649071 649821 652264
7394 652264 632095 608481 648742 633571 592557 612208 688455 697645 674298 670235 642915 658693
7382 658693 638019 682211 628326 617813 672354 681801 576250 567189 661899 672182 682709 625154
7370 625154 749397 750023 708516 653034 646290 703594 742714 709612 712745 735752 773014 820649
7358 820649 805043 797244 727160 694272 683416 631453 625912 631199 594819 622756 637777 639499
7346 639499 604053 644043 664036 667406 679210 689172 765699 765918 749725 814543 777669 785030 787335
7333 787335 775062 794433 749633 682772 668924 667287 712295 728459 723393 699870 639915 701681
7321 701681 716928 707328 699898 654014 777997 792892 770913 850243 834809 796282 732239 705908
7309 705908 738248 780837 779089 795430 765042 775756 750753 732660 777706 853289 814694 761552
7297 761552 729994 701410 685213 682097 671496 741439 707182 764915 824653 866105 908119 878068
7285 878068 858399 854464 872916 855985 914404 871086 826500 797140 846096 915375 900644 882418
7273 882418 887247 852035 817989 875490 954383 974975 941543 946976 984488 990295 995457 939051
7261 939051 895641 901735 957944 916575 885682 900837 927769 921741 1006403 1050082 1048938 985874
7249 985874 1025462 960258 913407 960435 950983 1029100 1049852 1097022 1072772 1035219 1014357 1059662
7237 1059662 1051948 1085694 1070809 1137364 1123120 1099322 1115914 1163172 1153749 1107873 1112998 1149448
7225 1149448 1175444 1204336 1218886 1273747 1261367 1326789 1419518 1376842 1292671 1299354 1299143 1309306
7213 1309306 1376068 1375671 1324526 1356989 1301322 1337603 1427983 1345522 1305119 1372948 1449150 1420428
7201 1420428 1365019 1369907 1333683 1443689 1419849 1364942 1290452 1230026 1326657 1362867 1397422
7190 1397422 1360497 1389585 1441715 1441240 1436642 1444999 1407768 1433934 1465695 1497984 1584271 1608740
7178 1608740 1604166 1719554 1758024 1745173 1784786 1825722 1825183 1890586 1959820 1995239 1969474 1994586
7166 1994586 2022783 2068427 2140572 2169893 2169348 2177400 2194840 2286723 2309135 2370166 2389711 2416986
7154 2416986 2436542 2483674 2508719 2672938 2690206 2704867 2725731 2755083 2807050 2898611 2922378
7143 2922378 3065326 3143570 3250031 3310379 3383081 3401370 3517331 3672870 3829340 4047022
7133 4047022 4378525 4590751 4817518 4995748 5203734 5340414 5620187 5886448 6178455 6472465
7123 6472465 6854924 7238493 7710799 8268241 8944943 9626014 10399751 11187207 12173479 13101911
7113 13101911 14018515 15133249 16941344 19148433 22222653 25777549 30402485 36676643
7105 36676643 46512245 62420490 89030788 114977498 123795142 123739616 113237728 92436663
7097 92436663 69430792 52274573 40674217 32264671 26518657 22376409 18931183 15884764
7089 15884764 13308236 11202694 9568321 8347073 7412615 6654483 6072373 5712172 5418853
7080 5418853 5108890 4828429 4517501 4267561 4101469 3942449 3689610 3535008 3396386 3355613
7070 3355613 3199316 3058037 3028254 2999719 2998361 2901277 2738643 2653968 2594132 2544794 2403812
7059 2403812 2395647 2319404 2185623 2046243 2058585 1966026 1957901 1925238 1898355 1793199 1801655
7048 1801655 1681674 1672810 1562370 1497874 1424371 1452216 1404704 1369056 1336911 1330630 1294125
7037 1294125 1321709 1233443 1185566 1241601 1286680 1235749 1163309 1131923 1207397 1239004 1261308
7026 1261308 1192970 1178436 1132908 1133126 1189179 1251811 1251897 1161907 1189942 1201775 1190844 1182869 1092628
7013 1092628 1091577 1086048 1119573 1104623 1046759 1049005 1043966 944731 884217 879294 912921 894525
7001 894525 809321 769236 806305 760199 783328 840983 877040 846307 849834 856175 747265 733371
6989 733371 719828 718250 689846 686860 741438 721114 739473 766971 728013 691104 699106 779241
6977 779241 786068 766099 798028 828390 800417 833701 837972 838807 793551 780567 727522 710939
6965 710939 738189 811320 836966 835081 890494 836924 791997 824106 781207 768660 845087 894797
6953 894797 907063 882586 830356 776438 800709 851819 884784 840571 836576 923976 806296 760676
6941 760676 791688 773843 817227 828247 837236 867958 730089 743600 741982 758199 774682 764397
6929 764397 848121 858268 836308 756046 713509 709074 731990 783887 714710 736496 724509 694588
6917 694588 723296 664717 663937 680930 616514 655343 706188 745950 750429 792198 798853 766960
6905 766960 779532 884771 767128 849174 751911 701012 696806 739525 759010 737476 788876
6894 788876 807332 818177 763434 751687 646645 645288 614149 661408 694580 685812 689870 695377
6882 695377 693515 709285 719876 755214 693212 639318 678993 739179 752694 748999 714633 757848
6870 757848 780440 689421 641037 696477 726022 683115 727097 726260 708028 680192 661301 659572
6858 659572 689052 697611 686177 684971 710098 725637 744771 768444 771956 698436 683380 728846
6846 728846 757546 781582 757764 736539 718526 698811 671395 658874 694461 710198 670613 636237
6834 636237 602500 640972 687226 689455 666144 775129 771351 800035 802602 789955 749560 750730
6822 750730 677161 663695 706331 697061 668330 660825 693707 703101 670590 641654 672760 745388
6810 745388 765222 720490 706163 706778 659578 648334 657033 764005 701361 760102 743610 704416
6798 704416 696151 744622 729831 710175 721348 731374 696641 750335 726804 718676 752707 710729
6786 710729 739074 752258 737383 691597 735735 716903 694029 692864 766918 784903 842433 789675
6774 789675 744402 723698 700607 743343 755498 718419 766418 784632 770138 744936 730609 751679
6762 751679 745843 757545 769821 756825 703337 726395 764553 732181 720102 690349 695576 731334
6750 731334 731823 723123 766526 822616 822411 850429 813042 759365 783714 778374 773047 746154 760604
6737 760604 722104 746926 711201 742794 796202 839857 850713 846677 869445 861059 787339 802364
6725 802364 829527 828913 789546 803706 850777 864437 849280 811752 780882 811484 776070 774102
6713 774102 799383 802895 805734 832741 872647 921174 910140 936689 946385 1004056 966211 1020807
6701 1020807 1094799 1127363 1164664 1323138 1479996 1514496 1518006 1502689 1370191 1226522 1179298
6690 1179298 1088289 998536 926185 988902 967838 970502 917515 848659 851844 876521 884046 841751
6678 841751 816503 813291 882791 910699 965693 974451 934628 920466 842804 870954 921133 963825
6666 963825 947960 932198 857255 908244 876806 869671 862824 822112 877977 851170 846329 871190
6654 871190 810381 805921 874395 922577 870409 843548 868100 942633 915916 888061 854067 866718
6642 866718 880983 892924 915537 963699 953901 999515 944188 867179 865882 889565 837055 883228
6630 883228 855032 872277 919415 948644 977598 964921 949119 987251 1011794 940082 902762 879634
6618 879634 871789 868078 928677 954366 952811 979922 959347 898887 1006804 968650 975540 975416 933049
6605 933049 916595 926033 953388 927448 937799 991054 972310 993357 1000514 1003713 1010204 1002617 1016574
6592 1016574 1018913 969295 1033211 1065938 958999 879545 966558 1045943 1088398 1106803 1135133
6581 1135133 1111437 1107923 1088430 1064246 1110494 1155525 1097731 1082153 1113107 1113496 1120361 1110387
6569 1110387 1119348 1193066 1208008 1197233 1117447 1133678 1096632 1119321 1118401 1098142 1084381 1093858
6557 1093858 1106740 1051052 1083122 1083288 1153265 1118696 1121793 1120651 1136828 1099106 1146016 1145387 1178385
6544 1178385 1069355 1072294 1085152 1127800 1129358 1104396 1154095 1210933 1195856 1175151 1189955 1170271
6532 1170271 1119239 1023656 1101689 1133005 1129020 1166084 1081625 1108260 1179354 1161189 1173216 1226214
6520 1226214 1242948 1181421 1150041 1203491 1224949 1210600 1175911 1137320 1226850 1209496 1228162
6509 1228162 1127825 1121204 1152537 1199207 1217580 1276306 1264968 1203068 1171621 1128220 1165016
6498 1165016 1170744 1247494 1226556 1184148 1147279 1059929 1145611 1142252 1145946 1223634 1175815 1158516
6486 1158516 1250364 1285280 1221679 1255137 1242039 1186869 1251321 1224335 1197765 1274989 1303726
6475 1303726 1269204 1207673 1219246 1279045 1216925 1168764 1299236 1246764 1208619 1271987 1224322
6464 1224322 1181372 1267944 1269371 1212197 1252943 1342566 1348571 1274610 1289563 1299567 1326163 1299818
6452 1299818 1352419 1342764 1333031 1336526 1269697 1266703 1303120 1325233 1336472 1378811 1393760 1393219 1372297
6439 1372297 1404502 1370893 1377441 1441131 1475974 1429005 1377993 1383541 1451934 1395627 1389380 1515450
6427 1515450 1499642 1481395 1427810 1446705 1501249 1413361 1391652 1425693 1453408 1415615 1449492
6416 1449492 1464958 1535828 1582809 1541439 1490703 1515375 1582428 1516475 1466090 1467844 1541275 1486814
6404 1486814 1444589 1489943 1503033 1457860 1451055 1394153 1418933 1515119 1531818 1538643 1573345 1598925
6392 1598925 1554427 1503028 1510456 1548094 1544225 1583689 1583611 1517064 1530938 1516839 1505040 1565072
6380 1565072 1570052 1511728 1503818 1515841 1578145 1588327 1649119 1652804 1595965 1579857 1583300 1532823
6368 1532823 1483773 1511234 1578889 1617627 1591361 1593596 1584775 1569764 1544932 1550662 1551551 1601556
6356 1601556 1621943 1647502 1642472 1672503 1601828 1598652 1644532 1671899 1685961 1677795 1709010 1758575
6344 1758575 1765114 1639540 1688972 1802147 1793856 1724961 1752724 1814935 1860806 1809249 1804739 1876783
6332 1876783 1859775 1901862 1951923 1940761 1972333 1997627 2015111 2037094 2086222 2253488 2314897
6321 2314897 2368835 2501157 2597992 2765057 2907455 3066586 3140630 3182766 3289883 3295258 3273893
6310 3273893 3193568 3108909 3137150 3069929 2999506 3047486 2992984 3009694 3107305 3156990 3271066
6299 3271066 3376608 3459141 3567493 3811707 4099998 4383668 4791191 5144520 5652561 6112624
6289 6112624 6634737 6993949 7122442 7192730 7146044 6869637 6541561 6185560 5832977 5548272
6279 5548272 5317737 5084153 4924022 4854497 4757708 4749666 4820164 4840213 4913606 5162386 5495901
6268 5495901 5792113 6129541 6635984 7304604 8030951 8747453 9445000 9976771 10272579 10250787
6258 10250787 10041379 9489432 8785094 8030907 7422825 6832821 6326427 5917399 5576540
6249 5576540 5271949 5097354 4969582 4864065 4829240 4847469 4888316 4996811 5178394 5407999
6239 5407999 5722554 6061360 6469449 6837554 7214777 7572797 7768839 7717254 7505455 7120669
6229 7120669 6704106 6169375 5587946 5176916 4789610 4431189 4078564 3897760 3747982 3618184
6219 3618184 3485438 3363974 3310899 3229084 3202903 3229191 3264582 3327680 3368703 3412851 3473110
6208 3473110 3559184 3602232 3614320 3551832 3495348 3323293 3288088 3179329 2935679 2832080 2746167
6197 2746167 2638280 2583458 2533160 2440389 2415876 2346922 2332387 2338674 2264612 2242853 2238564 2210688
6185 2210688 2189163 2140240 2186057 2174076 2163728 2164987 2153004 2096233 2050719 2059059 2099562 2020420
6173 2020420 2100356 2134396 2077592 2098879 2122178 2136790 2115732 2082455 2099239 2116591 2127416
6162 2127416 2138995 2182171 2215905 2167070 2151596 2062789 2121373 2187933 2159649 2178903 2227038
6151 2227038 2214754 2185310 2178204 2162846 2228624 2245289 2257202 2306582 2305672 2297650 2298500 2293397 2281397
6138 2281397 2350596 2384930 2326090 2319799 2418369 2400938 2313675 2294516 2290939 2325244 2352144 2341686
6126 2341686 2328266 2356218 2429636 2525175 2445393 2411681 2360817 2387194 2491479 2486556 2408745
6115 2408745 2454300 2542476 2480814 2473419 2554763 2578807 2568612 2601118 2618344 2568094 2547615 2563388
6103 2563388 2547482 2589498 2552485 2656270 2687871 2695354 2701642 2681928 2819706 2769127 2791399
6092 2791399 2758566 2720641 2694000 2719950 2768819 2800201 2775065 2761694 2798317 2822558 2881864
6081 2881864 2923986 2894968 2926264 2909606 2950747 3003110 3009825 2997156 2984768 3050695 3044001 2992071
6069 2992071 3005041 2994320 2963105 2951202 2978326 2956401 2938406 3000839 3073794 3096156 3129950
6058 3129950 3162448 3127857 3155407 3137674 3166048 3132821 3143571 3151950 3172241 3158011 3192964 3160314
6046 3160314 3126626 3072366 3148153 3253843 3261861 3233306 3195173 3241669 3335282 3253443 3291933
6035 3291933 3311562 3287495 3281974 3284238 3349056 3390150 3413931 3405121 3416362 3409628 3331008 3299841
6023 3299841 3356716 3347965 3370896 3404364 3411819 3446169 3489094 3520797 3547622 3584561 3593191 3542626
6011 3542626 3566492 3589419 3591673 3642978 3606797 3586816 3635606 3600207 3621174 3626837 3674575 3710266
5999 3710266 3700368 3740647 3809932 3852481 3908617 3968664 3947967 3956155 3928404 3888046 3851699 3884247
5987 3884247 3921858 3943808 3934509 3940102 3940013 3950056 4023003 4071102 4109838 4144424 4219671 4270397
5975 4270397 4331735 4393105 4487545 4574628 4714924 4819230 4809631 4756037 4714161 4791659 4743673
5964 4743673 4639889 4632510 4595451 4578208 4629737 4672239 4691464 4664461 4734809 4812254 4795888
5953 4795888 4821504 4965217 5115634 5209419 5286833 5525835 5611307 5636368 5699097 5741862 5760599
5942 5760599 5717097 5745837 5734242 5739149 5727960 5637322 5573715 5561909 5537584 5548420 5503791 5479864
5930 5479864 5454814 5541939 5615981 5718377 5758638 5825743 5903380 5962712 6079511 6217375 6125302
5919 6125302 6055163 6060563 6090972 6077391 6139190 6276400 6387800 6473467 6510366 6535449 6586455
5908 6586455 6558351 6444919 6402089 6338617 6386165 6424483 6393854 6365767 6469361 6592390 6606977
5897 6606977 6651910 6603293 6656670 6725396 6721291 6740541 6844782 6915000 6973406 7131294 7258354
5886 7258354 7336211 7451129 7568194 7645118 7704280 7747997 7678787 7678080 7775959 7782863 7776758 7782537
5874 7782537 7892767 7942730 7998106 8150167 8205265 8318853 8423722 8451772 8585246 8633047
5864 8633047 8718878 8953552 9130030 9241992 9413167 9591267 9828480 9948388 10051336 10235768
5854 10235768 10423946 10607182 10808845 11000330 11225007 11482333 11732056 12108017 12539066
5845 12539066 12997080 13505430 14087225 14923538 15869425 16931322 18007488 19000328 19747588
5836 19747588 20138632 20262972 20177240 19921862 19640870 19447392 19489461 19639300 19901867 20399440
5826 20399440 21042055 21740117 22730182 24020261 25389714 26683430 27896627 28864146 29778367
5817 29778367 30754876 31945031 33373495 34994006 36664714 38051143 38828162 38926015 38436370
5808 38436370 37625033 36643402 35756238 35388232 35505730 36324456 37670362 39544732 41803828
5799 41803828 44253687 46694493 49076992 51050582 52513021 53285795 53358142 52977213 52299452
5790 52299452 51703836 51406606 51399652 51527154 51782144 52032487 52208337 52439595 52742282 53186869
5780 53186869 53904606 54969100 56720149 58981763 61859782 65057271 68255243 70986863
5772 70986863 72958915 74004599 74042823 73263889 71831232 70154409 68240273 66411832 65038046
5763 65038046 64160706 63811571 64248467 65450926 67265875 69488269 71858559 73907164 75365119
5754 75365119 76134947 76426952 76444173 76351103 76239007 76059189 75549917 74639418 73481035 71970295
5744 71970295 70210140 68494335 66846856 65516833 64661523 64227654 64321667 65023184 66301771
5735 66301771 68208795 70529244 72944344 75043408 76294549 76549652 75640228 73724531
5727 73724531 71146736 68221451 65349571 62844021 60716093 58889117 57532618 56483495
5719 56483495 55807799 55522834 55572827 55925847 56556224 57205745 57791342 58371667 58851094 59160939
5709 59160939 59277012 58995895 58336650 57123179 55432993 53433635 51293025 49332949 47561889
5700 47561889 46063441 44922039 44152053 43613274 43383367 43453902 43641924 43925363 44287280
5691 44287280 44586585 44650114 44657919 44534742 44149819 43561117 42837817 42043772 41178001 40317078
5681 40317078 39470295 38755946 38173329 37703063 37269889 36951053 36659907 36378668 36172960
5672 36172960 36025142 35914474 35867808 35838136 35844737 35865139 35938881 35942197 35966804 36090874 36210109
5661 36210109 36299749 36438063 36691514 36894181 37004375 37185980 37361802 37596566 37735624 37971398
5651 37971398 38232600 38472433 38682763 39106254 39584205 39904037 40320252 40725448 41198416
5642 41198416 41588185 42057178 42497787 42891575 43327161 43677673 43965448 44283529 44675241
5633 44675241 45077098 45489107 45943137 46453571 47072840 47772963 48478648 49349081 50303090
5624 50303090 51366702 52571134 53728685 54749173 55535454 56133794 56419576 56515648 56560933
5615 56560933 56550465 56553956 56698821 56976849 57363084 57810892 58371235 58992213 59622319 60337814
5605 60337814 61093946 61894305 62733108 63717353 64697444 65785466 66858037 67766317 68704429
5596 68704429 69605637 70335963 71014427 71567272 71981676 72371810 72707956 73054709 73499580
5587 73499580 74073718 74725170 75475148 76267435 77131837 78148880 79309003 80559392 82082004
5578 82082004 83759351 85599718 87547040 89521628 91340181 93150121 94846348 96300848
5570 96300848 97216140 97765313 98044241 98107439 98151833 98000737 97772747 97320262 96629882 95883986
5560 95883986 95132525 94463667 94124529 93982618 94017244 94184113 94539857 95168293 96136796 97570750
5550 97570750 99418623 101437608 103369407 104945837 106072232 106853958 107280187 107390797 107163872
5541 107163872 106737632 106334775 106047560 105875074 105839946 105920780 105894428 105658252 105179911 104639147
5531 104639147 104135629 103976831 104272240 105171243 106844435 109371305 112962216 117808355 123926718
5522 123926718 131192221 138661294 145217387 150312711 154065483 156973551 159667461 162571572
5514 162571572 165279298 167347746 168620271 169428387 170342449 171943906 174733231 179012693
5506 179012693 184906332 192522598 201928123 212619472 223869137 234961934 244685527 252433199
5498 252433199 258251002 263167077 269554037 279819648 294934744 311311720 321661480
5491 321661480 321719505 311665824 293357480 269668195 245083171 223259710 205631700
5484 205631700 192190735 182379756 175656927 171517719 170067273 171174017 174178624 178078191
5476 178078191 181539147 183430708 183500856 182466845 181848423 183272117 188210515 196640941
5468 196640941 206082980 212668952 212996687 205946164 192524346 174986574 155940890 137597796
5460 137597796 121758096 108771277 98229048 89732804 83042127 77712228 73550711 70388112
5452 70388112 68030023 66085331 64167615 61949148 59212298 56364103 53514105 50719200
5444 50719200 48232998 46151295 44353028 42679161 41149130 39805035 38557766 37492024
5436 37492024 36555811 35776679 35231371 34796404 34506853 34377752 34503127 34925819 35613993
5427 35613993 36420083 37065914 37201737 36648142 35552071 34029095 32304346 30646021 29155673
5418 29155673 27881385 26809753 25758655 24945057 24119788 23362257 22703449 22061610 21431589
5409 21431589 20902419 20363627 19829873 19437467 19015722 18595843 18285336 17888943 17599958
5400 17599958 17363894 17082003 16814168 16523510 16248680 15934940 15646592 15362429 15142065
5391 15142065 14948391 14660843 14369807 14166206 13975443 13741780 13500342 13262883 13118433
5382 13118433 12926951 12750075 12533290 12284113 12073182 11844197 11623275 11407403 11319716 11147305
5372 11147305 10943181 10796786 10622075 10482187 10367395 10188129 9966086 9986092 9898557 9769636
5362 9769636 9701219 9504295 9369851 9247668 9167146 9009764 8924201 8812924 8748589 8604211
5352 8604211 8453218 8378600 8334165 8190769 8063801 7976309 7908515 7883581 7835880 7770452 7673304
5341 7673304 7593168 7524535 7454949 7368501 7305277 7155557 7081271 6997779 6902366 6884916 6720394
5330 6720394 6603425 6556867 6569481 6540470 6398142 6318056 6277277 6216039 6149483 6124950 6102722
5319 6102722 6012977 5929582 5867245 5843419 5804219 5775289 5706548 5626715 5575690 5566774 5554509 5403672
5307 5403672 5298582 5210944 5181401 5180597 5174380 5080118 4992396 5101403 4959738 4927551 4991776
5296 4991776 4954313 4881279 4806373 4707364 4708172 4658022 4632154 4562512 4544736 4520177 4505035 4430570
5284 4430570 4377805 4333200 4270993 4292507 4258914 4294893 4237989 4263649 4246161 4252364 4164515 4141762
5272 4141762 4145572 4122734 4055231 4025370 4034240 3922454 3888131 3865914 3860075 3916598 3850321 3779129
5260 3779129 3778563 3869770 3790183 3758060 3681915 3675211 3674398 3673336 3649320 3654656 3588838 3521383 3591195
5247 3591195 3556180 3589896 3598688 3559716 3563797 3552682 3569312 3600277 3528430 3524221 3393081 3358175
5235 3358175 3412848 3331651 3358159 3361614 3351758 3351830 3340471 3318153 3316532 3286113 3233307 3208239 3177646
5222 3177646 3165163 3232453 3258049 3230748 3261644 3279190 3233757 3211013 3202536 3177107 3176885 3138707
5210 3138707 3130182 3194332 3292225 3269213 3199994 3206511 3190069 3206935 3198511 3218311 3203285 3192178
5198 3192178 3194820 3195212 3250110 3289845 3275293 3260186 3189280 3200495 3279758 3248068 3191483 3197607
5186 3197607 3225498 3255313 3295594 3282000 3202451 3162908 3198262 3255575 3321881 3299691 3300742 3269637
5174 3269637 3263761 3231617 3289849 3335971 3373508 3409428 3426204 3290205 3224465 3263444 3361326
5163 3361326 3369973 3404081 3398084 3460138 3586030 3612796 3718387 3771962 3831193 3849867 3946817
5152 3946817 4060520 4200286 4237001 4310002 4317073 4254747 4159841 4047324 3983306 3822267 3722968
5141 3722968 3675914 3644102 3660237 3644663 3583999 3568972 3591673 3551737 3592301 3638599 3629116 3722812
5129 3722812 3774076 3722649 3721457 3807568 3802678 3752675 3671415 3572151 3498525 3438460 3331318 3216959
5117 3216959 3181812 3126877 3054946 2976593 2954644 2897352 2807171 2749233 2719537 2696228 2695054 2724329
5105 2724329 2652795 2647990 2638650 2602598 2658107 2618888 2583043 2592712 2532164 2578773 2591547 2548416
5093 2548416 2577361 2596626 2572485 2623577 2629715 2593449 2568743 2612975 2636159 2700376 2710995 2740008
5081 2740008 2774066 2680386 2641815 2670435 2652430 2590038 2555482 2473586 2500699 2523038 2556229
5070 2556229 2539713 2587318 2558344 2478946 2509676 2513413 2565648 2582935 2538062 2503958 2496989 2517330
5058 2517330 2523195 2531757 2581694 2518062 2536366 2532923 2565594 2628717 2544797 2546538 2554400 2553029 2593056
5045 2593056 2689264 2629761 2614155 2622462 2541532 2534486 2553870 2574170 2645049 2667238 2645035 2638419
5033 2638419 2630602 2682686 2746306 2737809 2826417 2896232 2954410 2923565 2851896 2858194 2960265 2998457
5021 2998457 3079170 3090437 3150989 3267234 3369287 3537065 3498190 3514478 3552556 3505544 3450043
5010 3450043 3404771 3418216 3490615 3510966 3485774 3506243 3529615 3511508 3556899 3523577 3583571
4999 3583571 3615449 3608253 3577213 3541248 3516216 3431353 3504787 3467929 3425468 3452661 3498036 3554002
4987 3554002 3671227 3702571 3683662 3718563 3722445 3762895 3774062 3817868 3836924 3859516 3903066
4976 3903066 4004174 4058313 4204557 4218647 4209951 4256472 4295066 4300044 4302015 4340772 4450091
4965 4450091 4520951 4598996 4700532 4768363 4898068 4995552 5095695 5218897 5270191 5344077 5448889
4954 5448889 5448257 5557816 5684471 5767907 5872551 6039580 6186298 6356170 6539021 6762515
4944 6762515 7017725 7252666 7559787 7869261 8189235 8531146 8878134 9419247 10076047 10840083
4934 10840083 11791348 12898646 14004698 15166847 15955861 16447664 16726274 16706909 16533560
4925 16533560 16343231 16270915 16238104 16248181 16394439 16520431 16626043 16675195 16687805 16741740
4915 16741740 16915711 17225993 17676457 18316333 19285381 20464145 21982744 23939114 26294895
4906 26294895 29134924 32529629 36567138 41020929 45573160 49312118 51454516 51790442
4898 51790442 50667587 48402594 45846822 43396238 41352423 39940362 39090629 38688276
4890 38688276 38589320 38729736 39398928 40675817 42782442 45163209 46846250 47062580 45703245
4881 45703245 43094603 39846992 36359700 33215157 30731443 28782246 27423010 26416347
4873 26416347 25723375 25179337 24700731 24525174 24525920 24655111 25126997 25759679 26436169 27024682
4863 27024682 27520956 27819568 27997809 28281508 28676813 29444613 30604243 32328723 34629932
4854 34629932 37520547 40906034 44561836 48517802 52939553 58068452 63752737 69359455
4846 69359455 73361458 74800053 73827688 70746791 66235932 61558044 57360580 54240450
4838 54240450 52313514 51636066 51990023 53529228 56222299 60058064 64853965 69955690
4830 69955690 74149044 76025193 75144482 71806657 66791330 60906823 55164292 50270327
4822 50270327 46449606 43764444 42008786 41019623 40642477 40520641 40203176 39558416 38490831
4813 38490831 37056619 35348869 33713276 32304031 31171703 30325313 29866865 29862561 30204756
4804 30204756 30999001 32244005 33840647 35640411 37377477 38791394 39763858 40247738 40559508
4795 40559508 40858682 41375559 42341033 43776578 45356947 46648585 47350691 47206952 46126434
4786 46126434 44419828 42268698 40116334 38222753 36724794 35578813 34951722 34600652
4778 34600652 34572483 34873261 35566042 36609852 37989231 39705437 41609659 43631786 45290889
4769 45290889 46298535 46501014 45833572 44599983 43035993 41539037 40356664 39536315 39390630
4760 39390630 39804673 40794900 42496825 44707316 47126051 49358009 50872304 51346732 50839093
4751 50839093 49470346 47440444 45265232 43303825 41732206 40565808 39973569 39898926 40452453
4742 40452453 41526316 43219907 45303541 47477965 49425197 50764378 51204132 50779037
4734 50779037 49588741 47915767 46134762 44376708 42868232 41503574 40335000 39312936
4726 39312936 38580102 38092596 37918098 38165554 38716428 39767709 41099526 42770546 44958003
4717 44958003 47691543 51274860 55857068 61395739 67134130 71682823 73831370 73350951
4709 73350951 70614184 66343785 61351435 56413319 51970296 48194267 45117640 42521332
4701 42521332 40374962 38605471 37167919 35911418 34962254 34088578 33306718 32813487 32390290
4692 32390290 32169248 32205334 32356957 32661763 33099201 33548390 34029549 34753120 35684196 36785945
4682 36785945 38209965 40066989 42414910 45449201 49349135 54234707 60010974 65996199
4674 65996199 70783478 73204394 72984600 70651943 66819927 62294902 57978836 54372622
4666 54372622 51771303 50110354 49440545 49734965 51030456 53648896 57405618 62019210
4658 62019210 66810434 70756840 73198163 74132581 73650655 71916712 69247173 66023902
4650 66023902 62484871 58745222 55073999 51720690 48784645 46305282 44350516 42767875
4642 42767875 41645783 40768885 40205857 39886352 39815125 39870112 40105102 40593428 41246078 42049918
4632 42049918 43050129 44180859 45577770 47096429 48720949 50581745 52698940 55231537
4624 55231537 58487904 62523961 67808162 74336963 81632017 88817716 95166459 100087839
4616 100087839 103244830 104269182 103034818 100003732 95620083 90286784 84548082 78785471
4608 78785471 73374713 68421599 64043489 60250020 56918798 54139046 51877547 49963118
4600 49963118 48349571 47193405 46395033 45880615 45618966 45713144 45970402 46519038 47235942
4591 47235942 47862866 48231544 48282431 47982130 47581009 47015097 46557562 46419156 46762885 47442962
4581 47442962 48600529 50227623 52167014 54338753 56086255 57350872 57999726 57562786
4573 57562786 56183586 54103035 51699177 49283671 47067964 45185857 43611262 42496050
4565 42496050 41766068 41346283 41213502 41228726 41563962 42175717 43123586 44497248 46386078
4556 46386078 48744460 51334789 53715465 55247990 55721671 54927655 53189023 50837976
4548 50837976 48188445 45701378 43534737 41824172 40609785 39794115 39270403 38917505 38843925
4539 38843925 38921378 39149562 39466651 39878978 40463644 41040325 41662854 42282529 42930441 43456394
4529 43456394 43852637 44117599 44401519 44623622 44938336 45240906 45638195 46267658 47118542
4520 47118542 48302906 49916311 51905450 54252553 56815077 59260819 61226034 62313143
4512 62313143 62364139 61425973 59932917 58081869 56168583 54446916 53118206 52109154 51447804
4503 51447804 51153473 51029157 51143081 51422790 51899835 52223267 52514982 52732637 52730868 52654891
4493 52654891 52576572 52470355 52615907 53016077 53686429 54678171 56004399 57553942 59043368
4484 59043368 60286996 60966515 61043498 60679780 60029939 59158236 58417214 57887970 57703109
4475 57703109 57825492 58303979 59116623 60334886 61854121 63553849 65284210 66721695 67466665
4466 67466665 67416033 66546838 64989605 62989232 60868223 58812205 56951479 55479183 54400354
4457 54400354 53531800 52971572 52619896 52488421 52388231 52144765 51781390 51249336 50413821
4448 50413821 49342868 48244691 47152974 46059866 45178863 44587658 44249468 44098462 44213191
4439 44213191 44463398 44630908 44608746 44169712 43351371 42196759 40733672 39365455 38162514
4430 38162514 37215556 36520320 36111656 35979422 36084774 36494225 37118130 37712735 38271417
4421 38271417 38538656 38269232 37490286 36363436 34957725 33323346 31755035 30351326 29040500
4412 29040500 27989287 27160297 26388994 25804125 25410266 24991350 24504325 23952133 23253108
4403 23253108 22568396 21678713 20647434 19617188 18567005 17529707 16630636 15748820 14974841
4394 14974841 14275754 13585962 12913475 12350321 11840138 11327254 10775458 10349616 9973871
4385 9973871 9630602 9278363 8934195 8668175 8449521 8244916 8008905 7807193 7657084 7454012
4375 7454012 7254447 7126947 7001814 6805073 6604036 6480096 6348388 6206461 6031585 5772876
4365 5772876 5664780 5619366 5487564 5390565 5254860 5117111 5023260 4972080 4903858 4902949 4904493
4354 4904493 4837316 4762286 4678363 4624403 4554206 4535281 4479215 4412735 4238878 4190995 4115486
4343 4115486 4078489 4080738 4061053 3997387 4006035 3960756 3932754 3926114 3866903 3817092 3749859 3731746
4331 3731746 3656811 3592460 3519628 3453992 3385617 3370579 3324708 3242681 3192125 3172797 3144392
4320 3144392 3139530 3093201 3102458 3051207 3032823 3056722 3117315 3036783 2980021 2952198 2917550 2956190
4308 2956190 2978560 2888934 2827512 2812002 2784465 2724542 2625967 2620210 2539958 2492970 2499244 2451016
4296 2451016 2428345 2397717 2378847 2404402 2411692 2433822 2475943 2414480 2357592 2375576 2399103 2422288
4284 2422288 2458991 2412679 2385189 2398150 2411737 2463867 2524510 2543484 2502097 2604041 2596864
4273 2596864 2506532 2519859 2564101 2638841 2646235 2645724 2679000 2760833 2761736 2754484 2810809 2860474 2948173
4260 2948173 3065158 3223616 3388777 3617732 3867516 4359700 5139345 5762563 5973228 5933969
4250 5933969 5719311 5202721 4574121 4175973 3950449 3813079 3636459 3500394 3408368 3383889
4240 3383889 3305551 3254726 3252824 3181520 3132894 3155060 3179991 3120758 3179653 3211050 3243006 3194703
4228 3194703 3198155 3182487 3196957 3197196 3195471 3272722 3321253 3392893 3402787 3508412 3518169 3516238 3504332
4215 3504332 3452836 3462199 3480944 3454183 3430629 3450707 3399182 3455563 3397467 3405942 3371403 3413010
4203 3413010 3430683 3425291 3405714 3364744 3336387 3319475 3273706 3249379 3280301 3329739 3307505 3358862
4191 3358862 3378221 3342900 3356063 3380745 3375960 3358710 3446874 3493611 3557939 3517999 3527942 3567072
4179 3567072 3539091 3557518 3679759 3693515 3645757 3674575 3773895 3797111 3834069 3851083 3875016
4168 3875016 3891611 3943486 4029421 4128836 4126143 4207482 4316937 4366708 4389659 4488342 4537148
4157 4537148 4588362 4599136 4635574 4654363 4586708 4634148 4666975 4653388 4689136 4713669 4706173 4695258
4145 4695258 4747563 4925938 4941736 5017814 5141522 5169602 5195768 5328513 5507821 5557150 5708415
4134 5708415 5830706 5970314 6074257 6172233 6307275 6428744 6530880 6576656 6643938 6705509
4124 6705509 6861924 6983686 7025983 7135075 7230968 7429964 7591650 7832451 8010015 8174053
4114 8174053 8288614 8362229 8372530 8402393 8491188 8468145 8553074 8602336 8663943 8723381 8829457
4103 8829457 8934726 9094117 9206967 9390021 9569929 9714813 9784463 9976946 10123054 10241461
4093 10241461 10438217 10704144 11053522 11504665 12050162 12769414 13674764 14996019 16650006
4084 16650006 18237148 19528075 20145081 20076148 19374644 18409662 17526433 16791493 16331582
4075 16331582 16089952 16052346 16142259 16334606 16660422 17033752 17505560 17937593 18346981 18797619
4065 18797619 19120660 19434006 19741387 19981243 20366856 20806351 21287775 21908284 22590579
4056 22590579 23404230 24356976 25371953 26437253 27684947 28966327 30205925 31575094
4048 31575094 32948022 34387144 35954283 37619692 39335836 41195151 43256174 45456060
4040 45456060 47726572 50023737 52410715 54816441 57270829 59597507 61789704 63901420
4032 63901420 65760416 67488036 69151801 70776659 72295117 73701876 75147436 76535305
4024 76535305 77862207 79064674 80087314 80893791 81391308 81705304 81731681 81472706 80913179
4015 80913179 80278121 79570833 78632112 77687245 76704024 75807152 74959702 74207413 73584868
4006 73584868 72980471 72519120 72097448 71663393 71288577 71057672 70867423 70860019 70895455 71038403
3996 71038403 71375511 71870320 72420551 73134641 74075209 75152577 76405386 77781534 79265653
3987 79265653 80770953 82243962 83845175 85700022 87544644 89572530 91690608 93888405
3979 93888405 96086481 98259968 100394019 102423240 104499812 106495324 108320623 110182582
3971 110182582 111983264 113606816 115040941 116207330 117179514 117981040 118584220 118934899 119165562
3962 119165562 119452141 119808175 120298745 121328219 121898507 121504681 120425870 118522499 115964813
3953 115964813 113312516 110916036 108880199 107067168 105442751 104048209 102749090 101657744
3945 101657744 100747675 99940315 99213094 98633257 98198881 97810894 97480316 97303898 97248707
3936 97248707 97313324 97419630 97625735 98000323 98640155 99456536 100377989 101426124 102536550
3927 102536550 103657680 104876862 106106876 107304052 108628876 110010810 111359396 112810443
3919 112810443 114349296 115795828 117399796 119003005 120490551 122013780 123454125 124805298
3911 124805298 126147174 127412732 128672549 129979578 131195849 132502129 133729569 135046259
3903 135046259 136458269 138014018 139806645 141700162 143710891 145719601 147769829 149815788
3895 149815788 151704604 153462091 155008569 156351873 157422693 158378395 159110633 159625799
3887 159625799 160049694 160456044 160795862 161038612 161399634 161646846 161822884 161848621 161636565
3878 161636565 161213601 160565366 159497371 158201936 156707568 154864073 152827186 150768980
3870 150768980 148751993 146692447 144803366 143035732 141377674 139806397 138403217 137136126
3862 137136126 135947393 134837348 133715125 132667551 131717716 130838259 130136592 129718255 129394647
3853 129394647 129232632 129332508 129566026 129868342 130241091 130686345 131221879 131783724 132395431
3844 132395431 133099451 133729819 134422630 135293107 136361625 137482577 138729267 140065761 141482655
3835 141482655 142822816 144028455 145202403 146193478 147011742 147546161 148036905 148440493 148842815
3826 148842815 149256205 149463249 149567852 149580427 149297294 148666421 147568704 145997718 143945288
3817 143945288 141554866 138804602 135917126 133031855 130178963 127586976 125203859 122959023
3809 122959023 120961467 119087945 117274461 115475401 113700114 111871341 110065624 108188398
3801 108188398 106365872 104676925 103025154 101419045 99867762 98386431 97028204 95840663
3793 95840663 94895122 94095716 93435404 92935753 92669354 92431487 92247253 92086487 91952729
3784 91952729 91940743 91878350 91904400 92075311 92324345 92578354 92878395 93207508 93395517 93284549
3774 93284549 93104860 92757249 92202639 91549241 90927062 90257563 89700928 89120978 88504400
3765 88504400 87852172 87331709 86751819 86185354 85678962 85197881 84831324 84329403 83666046
3756 83666046 83064393 82455982 81778806 81216232 80652114 80121490 79660759 79138714 78775353
3747 78775353 78399113 78088357 77988703 78059978 78319139 78539321 78862044 79199833 79463667 79525742
3737 79525742 79609086 79593928 79447130 79239926 78876314 78458524 77887763 77197250 76494268 75872047
3727 75872047 75175706 74446281 73745841 72999080 72137881 71243987 70326280 69410554 68480991
3718 68480991 67541561 66611896 65565574 64523597 63522721 62511038 61438009 60269964
3710 60269964 59207051 57895692 56550459 55178486 53639449 52057620 50491515 48957654
3702 48957654 47308874 45715657 44208060 42791184 41389509 40095349 38873225 37750117
3694 37750117 36720776 35688781 34595916 33544863 32555783 31441185 30318179 29253699
3686 29253699 28126770 27091066 26132062 25133398 24126599 23190758 22427641 21683770 20896238
3677 20896238 20093458 19393039 18776281 18207318 17549210 17034222 16573025 16114202 15595117
3668 15595117 15064277 14734322 14402744 14015805 13651823 13385636 13105479 12875122 12571015
3659 12571015 12320969 12098881 11856662 11626673 11414273 11210970 11173110 11025248 10820083 10518654
3649 10518654 10272519 10219698 10055056 9884384 9729337 9556851 9511860 9455270 9317095 9189843
3639 9189843 9164591 9055818 8909604 8783709 8695897 8645281 8521258 8602784 8669068 8626162 8576788
3628 8576788 8541537 8494708 8474637 8464459 8385839 8368477 8417099 8457666 8492993 8625494 8646818
3617 8646818 8661881 8698919 8675676 8713699 8750549 8844887 8956390 8986266 9005103 9052158 9086070
3606 9086070 9114237 9191483 9255145 9151991 9120605 9129060 9037673 8981068 8956805 9008732 9024215
3595 9024215 8924670 8929761 8953555 8868536 8793220 8747837 8724410 8646969 8623031 8641486 8636045 8665100
3583 8665100 8615565 8596858 8644398 8669905 8757190 8760074 8744582 8817929 8908094 8979959 9074959 9201891
3571 9201891 9247460 9292819 9397844 9475854 9551557 9707427 9811684 9929101 10051683 10174639
3561 10174639 10349266 10427870 10539729 10685610 10859202 10925895 10979936 11053391 11114673 11272908
3551 11272908 11365877 11438060 11551675 11699291 11789571 11933775 12037999 12226486 12363184 12437930
3541 12437930 12499881 12662404 12784029 12959204 13184821 13329107 13487286 13720167 13951842 14271647
3531 14271647 14679152 14985534 15384239 15861903 16352499 16902511 17454233 18077749 18818157
3522 18818157 19550537 20339767 21290206 22145797 23010753 23916168 24778142 25654181 26442973
3513 26442973 27322003 28128516 28799893 29495092 30088604 30625934 31171999 31718365 32365251
3504 32365251 32870414 33436818 33891801 34344673 34680345 34892474 35085496 35141908 35207152 35236410
3494 35236410 35261368 35244450 35277478 35296527 35302001 35275771 35336420 35447856 35505928 35606792 35771267
3483 35771267 35998825 36365008 36854423 37417278 38045170 38866024 39766048 40737664 41839857
3474 41839857 43134626 44604810 46271371 48095028 50113284 52392516 54809482 57227147
3466 57227147 59670084 62193791 64638378 67108852 69632999 71994932 74264460 76326260
3458 76326260 78198790 79957041 81517103 83029772 84477701 85717643 86731768 87687976
3450 87687976 88507912 89146827 89686296 90128697 90495942 90748289 90856578 90923244 90838509 90638764
3440 90638764 90365727 90108130 89847764 89462436 89105841 88905675 88688760 88534269 88440886 88442100
3430 88442100 88510684 88637415 88875656 89295444 89843966 90570712 91447362 92542270 93675966
3421 93675966 94999476 96499794 98255151 100241381 102351624 104707358 107211613 109680086
3413 109680086 112158903 114613843 116864277 118906511 120799952 122783829 124806439 127038315
3405 127038315 129416067 131968898 134779490 137813679 140847495 143717089 146436880 148884103
3397 148884103 150963864 152638294 154008614 155068105 155815031 156502317 157049356 157392912 157588686
3388 157588686 157731241 157783453 157646849 157409950 156996039 156499876 155920695 155204968 154510092
3379 154510092 153939987 153903318 154507384 155406899 155915752 156117194 156276116 156344030 156352797 156558811
3369 156558811 157128477 157817769 158559052 159459329 160445328 161381810 162394904 163556998 165057368
3360 165057368 166917145 169299588 172145193 175320467 178522699 181520619 184227089 186661451
3352 186661451 188775566 190529065 192330321 194174304 195442571 195697316 195437961 194692414
3344 194692414 193558842 192236955 191052156 189911402 188515696 186921628 185165893 183203859
3336 183203859 181217671 179111782 177019049 174880487 172790600 170756624 168759308 166737943
3328 166737943 164745465 162958085 161207604 159636604 158327130 157142222 156157887 155472401
3320 155472401 155078216 154928980 154735492 154631792 154499692 154270261 153711497 152771739 151572528
3311 151572528 150194262 148609992 146997448 145375493 143677569 141998998 140310526 138669649
3303 138669649 136954151 135101311 133354447 131463843 129518338 127472177 125406197 123437013
3295 123437013 121531820 119727182 118028637 116471626 115125727 113969671 112978363 112263066
3287 112263066 111746985 111277080 110997130 110776061 110654142 110666619 110753626 110977669 111185270 111444406
3277 111444406 111759281 112076804 112544250 113085710 113712899 114461908 115128610 115891250 116688143
3268 116688143 117459822 118217571 118927348 119562735 120101546 120434009 120532185 120388898 120030124
3259 120030124 119453478 118638574 117640770 116568402 115335921 113995666 112565110 111005339
3251 111005339 109239555 107346717 105232526 103096714 100806762 98368360 95829371 93231824
3243 93231824 90760818 88417413 86173998 84154651 82296443 80524424 78884389 77346118
3235 77346118 76029571 74872651 73884954 73081003 72423015 71939382 71722582 71602644 71678319
3226 71678319 71889953 72187328 72710687 73225458 73853179 74734966 75696050 76724760 77761629
3217 77761629 78887161 79984918 81061259 81958252 82812840 83538728 83978624 84266178 84493922
3208 84493922 84400792 84228752 83838348 83168462 82163589 80872671 79306070 77531219 75743639
3199 75743639 73796094 71779429 69719851 67716347 65662071 63626997 61552557 59510906
3191 59510906 57462938 55482652 53636005 51798427 49967427 48282550 46641832 45134352
3183 45134352 43731472 42321647 41203090 40213984 39465375 38810363 38214125 37881823 37675822
3174 37675822 37596441 37452643 37366840 37412730 37492286 37463532 37453640 37473201 37503338 37549740 37533016
3163 37533016 37525729 37560117 37545641 37506224 37391909 37328520 37160781 36877517 36515002 36043188
3153 36043188 35538214 34993450 34388644 33664874 32843026 31922562 30958563 29976056 28955081
3144 28955081 27951274 27094611 26276455 25574869 24955661 24381428 23823938 23332259 22835566
3135 22835566 22314323 21776305 21154155 20537172 19887476 19325884 18796163 18330200 17843598
3126 17843598 17458709 17101054 16711802 16331445 15969653 15671652 15423636 15341970 15235156 15088010
3116 15088010 14953080 14828888 14691634 14585684 14598597 14489393 14395172 14321176 14275263 14247178
3106 14247178 14095357 14024933 13930929 13817270 13691168 13568431 13387615 13149616 12877148 12649808
3096 12649808 12443709 12092151 11768990 11477865 11154202 10859429 10547169 10336155 10013338
3087 10013338 9689974 9388982 9073884 8818037 8608195 8463572 8212824 8087203 7975725
3078 7975725 7939858 7878831 7803546 7817536 7762405 7679142 7669464 7606523 7474537 7452988 7431502
3067 7431502 7431175 7428344 7491438 7545049 7600659 7614150 7593620 7696529 7844707 7894233 7991974 8205174
3055 8205174 8434370 8629785 8979432 9381086 9891939 10541711 11297674 12228991 13324291
3046 13324291 14640211 16033777 17217964 17902026 17923681 17284004 16100251 14602441 13084031
3037 13084031 11793635 10647694 9665297 8924039 8213077 7577086 7009978 6562130 6138498
3028 6138498 5719740 5432626 5145149 4917739 4690520 4502457 4404265 4256555 4068474 3949627
3018 3949627 3816129 3684714 3630180 3543243 3436576 3360529 3313413 3258328 3196886 3127753 3038800
3007 3038800 2929394 2853790 2784887 2790771 2732346 2699020 2686822 2708628 2717523 2581686 2548078
2996 2548078 2450972 2399057 2416668 2395265 2422126 2373844 2308849 2329483 2372922 2356678 2300510
2985 2300510 2279021 2288185 2294667 2252646 2188037 2144102 2233620 2262866 2147065 2053526 1978665 1996175
2973 1996175 2017365 2005024 1916996 1902331 1959466 1924520 1878425 1837922 1713941 1733306 1745747
2962 1745747 1657094 1539678 1550458 1571112 1591316 1585755 1585072 1532645 1485322 1521710 1549537 1517505
2950 1517505 1442839 1468150 1523909 1485227 1480637 1458079 1422441 1357228 1354555 1360284 1367347 1393947
2938 1393947 1363563 1379521 1362161 1276251 1345522 1351697 1279019 1328539 1338674 1362349 1297391 1251798
2926 1251798 1246553 1278405 1207951 1231986 1279811 1226831 1292196 1226452 1189919 1220281 1118441
2915 1118441 1087686 1025977 1112667 1118281 1014230 1017998 994537 916929 951721 1031964 1037583 996121
2903 996121 946951 885115 864789 912408 888393 809595 867404 886739 836540 842860 821961 766784
2891 766784 678495 762793 762061 688002 716608 727755 723499 764166 748892 789780 820782 775982
2879 775982 787398 709118 709715 664177 663688 667285 780567 785237 753749 724261 712807 687183 643007
2866 643007 658614 671564 694254 677900 619381 615485 562520 566452 629301 593263 568587 561595
2854 561595 598162 579315 576170 578398 567331 565531 498645 492326 487870 497106 513830 548747 563649
2841 563649 503325 507978 520480 511258 556401 617127 653126 717454 642972 543483 580362 561682
2829 561682 588995 608399 625795 635099 658035 673375 631578 692678 766486 816421 800820 868505
2817 868505 806898 871080 919429 830214 738680 688390 700729 772893 808724 746961 729911 778215
2805 778215 812123 855195 899167 882220 871338 890059 914279 931595 918584 1001322 1008093 967067
2793 967067 1003561 1054079 1045226 1080262 1101986 1080951 1111002 1197411 1221916 1233819 1242119 1293752
2781 1293752 1184531 1117337 1152256 1214362 1269097 1205033 1139145 1173018 1189151 1243865 1205268
2770 1205268 1116054 1112158 1109407 1187209 1250580 1236998 1325468 1335314 1295971 1401452 1487078 1531027
2758 1531027 1593529 1705815 1715934 1683192 1617618 1592240 1489996 1431173 1455044 1465609 1444665
2747 1444665 1342272 1270620 1220068 1164555 1122175 1186460 1228386 1179978 1161057 1139218 1121949
2736 1121949 1053090 1105997 1089505 1032878 1011978 1044523 979198 1038091 1021309 1028223 1095576 1113758
2724 1113758 1145279 1183949 1201923 1248444 1215087 1208800 1199415 1112215 994827 952325 935899 865419
2712 865419 913488 890913 799295 738942 652692 582179 580590 619051 640890 590278 599054 554218
2700 554218 568931 583280 682546 619988 513716 502797 429443 434103 506626 484514 509871 577729
2688 577729 598684 543390 522585 511036 462398 442320 354373 354247 361904 374025 441031 432751
2676 432751 321185 247793 244409 278046 286614 253928 255892 273519 237754 219965 235569 262911
2664 262911 314447 281749 285544 335154 257097 197594 177911 145714 177650 191138 155895 257646
2652 257646 176518 150501 181629 144875 98300 133787 159202 170033 153805 119894 184536 158473
2640 158473 154404 207889 149744 144319 210992 183134 163682 188021 117452 124882 132297 113389
2628 113389 138022 112993 112846 152362 160852 122779 125222 68270 126421 106707 52739 65379
2616 65379 65890 68073 92326 134666 129133 77541 64154 80754 111706 115854 112527 104309 88066
2603 88066 88359 149639 91608 107000 91681 112709 107625 8588 76385 86598 12067 33218
2591 33218 3212 16777 65349 70114 118141 114616 39290 28181 -397 96619 102188 77782
2579 77782 117567 56421 84456 104845 71123 77293 43434 9327 27481 64208 54027 64755
2567 64755 90633 61349 73182 57484 54174 69614 127623 61656 75351 81514 115535 139673
2555 139673 166179 121351 78428 103205 127904 161014 115655 115307 229840 273998 235469 256604
2543 256604 280894 295597 343390 355966 281593 163949 114405 125643 110749 12771 6395 5717
2531 5717 18229 38343 20745 57698 21508 -12817 -7366 -13180 -12917 13240 -19466 22822 62485
2518 62485 56688 62381 115376 86595 72074 95008 70995 59981 49369 9743 61963 48378
2506 48378 -25241 -38610 -34292 -17077 30167 15333 -58599 -40051 12046 13356 62762 65365
2494 65365 45534 34653 25152 15653 -8831 -26126 2766 21236 37289 65325 52337 74593
2482 74593 89933 108709 95114 91105 -6708 -34841 -31858 -40889 17816 83010 -18588 -21799
2470 -21799 11714 9773 25362 -9245 46869 39140 26929 31447 79830 31998 25365 -13876 -90550
2457 -90550 -75035 -46308 9044 130828 68852 41582 24064 27070 61572 58768 116335 57248
2445 57248 50335 63479 84574 82 -13427 -31239 -30396 -20997 -44656 -71455 -45618 11300 26250
2432 26250 -29662 -21698 -6460 14790 -30529 36637 71183 40780 32753 -22639 21820 24638
2420 24638 542 32800 48004 32090 -47899 10363 51428 37146 77117 111720 99977 103411
2408 103411 68213 10819 11643 64278 63884 568 -8808 36633 54261 17959 31913 20540 59634
2395 59634 44545 34749 40768 61961 137482 111889 145262 95036 80191 102981 153037 155493
2383 155493 93332 47108 76513 153040 135585 173488 112099 77542 82020 132708 117536 76078
2371 76078 70146 121207 111625 61094 90743 138816 121656 124627 82404 150016 175290 137145
2359 137145 96627 111404 73330 71591 119877 169576 172527 218560 260949 276877 284092 247514
2347 247514 295143 309736 371433 378010 284803 275370 337755 391740 325086 252726 323410 365209
2335 365209 367495 325174 309075 318602 445174 398721 336026 389129 370215 360374 432993 481579
2323 481579 467970 515948 524300 535266 600910 590608 588382 664454 722142 737368 732857 725768
2311 725768 755656 867484 918532 1023207 1148199 1278228 1350169 1379328 1492973 1618477
2301 1618477 1708286 1861097 2001673 2182951 2395769 2636662 2916331 3387456 4027525 4562225
2291 4562225 4927044 5262801 5440031 5719074 6063789 6768810 7659014 8932894 10501941
2282 10501941 12626050 15562901 20193135 28189596 40288768 48644471 50791874 49716022
2274 49716022 44358947 36122898 27831444 21996662 17723324 14599589 12248546 10506607
2266 10506607 9052305 7863529 6939088 6428190 5871995 5439508 4928965 4456435 3922914
2257 3922914 3531137 3140618 2904687 2640874 2418546 2383667 2257914 2115306 2026549 1915400
2247 1915400 1899375 1731530 1648016 1609575 1621862 1538440 1453068 1427469 1353239 1317756 1231145
2236 1231145 1185458 1177821 1226181 1191596 1074927 1033750 1001613 939536 901321 850650 812125
2225 812125 798579 727090 739694 697212 656044 665209 645672 622652 560556 498847 445157 496105
2213 496105 503659 506772 503882 490365 486474 506846 425277 388732 417179 478236 461253 460527 451035
2200 451035 406169 375508 384079 291375 290090 355250 361873 287618 307897 282554 208375 225978
2188 225978 228281 271639 258567 224562 232710 252928 258810 229911 193881 142583 127607 149974
2176 149974 143644 134250 171321 150163 201770 92661 57765 82514 85901 106054 65032 63302
2164 63302 159475 91472 103700 21536 18996 58117 28512 13620 11729 33267 -49695 -86649
2152 -86649 -64373 20644 43316 99936 107861 25822 -30203 -9585 18595 12990 -29524 -25311
2140 -25311 -37514 -51135 -2113 -10736 45133 8131 2642 -3572 -19804 -69126 -6308 24656
2128 24656 2831 36044 12539 4738 45134 -17874 -58808 -10363 -23708 -4341 -44918 17044
2116 17044 24716 -10087 -64016 -101494 -104309 -78343 -59209 -73045 -103379 -90718 -81198 -75436 -70321
2103 -70321 -114897 -38291 -75350 -71809 -70680 -92914 -98434 -56227 -26813 -50465 -62267 -96424
2091 -96424 -110056 -128879 -56257 -109779 -71851 -102507 -132583 -121969 -91710 -100034 -144452 -80301
2079 -80301 -41618 -27764 -100224 -114470 -105962 -165819 -168501 -92612 -110189 -51150 -30583 -53194
2067 -53194 39651 -60499 -107556 -114438 -111886 -146896 -137121 -181773 -195072 -167073 -132191 -58117
2055 -58117 -70912 -126439 -121009 -82558 -111131 -97906 -43142 -119581 -108424 -164285 -96639 -107643
2043 -107643 -146347 -143871 -206108 -194119 -182588 -143163 -129259 -142269 -22198 -11730 -72617 -107701
2031 -107701 -75682 -108368 -151250 -143118 -142112 -99857 -112199 -156366 -122099 -67575 -84161 -139826
2019 -139826 -169345 -251148 -179000 -91526 -105992 -26474 -78648 -112649 -95014 -61873 30000 38935
2007 38935 5952 102834 53879 12979 -4013 8683 -35130 -64272 -135067 -152501 -146744 -109933
1995 -109933 -39356 -83409 -186613 -158103 -158801 -162698 -129888 -35044 -71174 -92008 -141616 -152331
1983 -152331 -209444 -233037 -238752 -146570 -124009 -274936 -280385 -183944 -140316 -115164 -158558 -176842
1971 -176842 -144165 -172400 -203747 -209309 -131677 -185227 -170255 -198352 -152853 -166301 -203409 -221218
1959 -221218 -261815 -209298 -144056 -229895 -263329 -281893 -220847 -132142 -170741 -276037 -211563
1948 -211563 -120369 -107622 -121494 -131083 -139789 -143321 -115529 -107095 -72054 -81494 -154205 -228991 -195391
1935 -195391 -112543 -158875 -285677 -233853 -198585 -240670 -300893 -255685 -178556 -216400 -195274
1924 -195274 -234057 -211216 -182577 -200915 -185834 -153935 -152568 -206912 -163430 -204639 -180519 -189203
1912 -189203 -213686 -195095 -161525 -146909 -181576 -192002 -200383 -208301 -192255 -219488 -209687 -185980
1900 -185980 -160148 -193651 -198163 -218077 -196866 -209897 -291637 -277480 -268281 -254604 -189731 -179465
1888 -179465 -251140 -207574 -200413 -287170 -223456 -190147 -203591 -203734 -236456 -261160 -233127 -224022
1876 -224022 -249118 -164896 -179733 -232164 -301558 -230498 -139630 -242957 -212240 -239477 -278251
1865 -278251 -250318 -225752 -182844 -238761 -257497 -279509 -262866 -214779 -300759 -251845 -163897 -210325
1853 -210325 -222165 -233374 -194002 -188326 -210188 -182766 -180821 -210824 -207823 -257489 -234116 -223458
1841 -223458 -228777 -190911 -131180 -182623 -249001 -250043 -210417 -221895 -241525 -229331 -254842 -325481
1829 -325481 -211317 -232257 -243713 -228594 -245205 -194947 -220807 -264038 -296352 -277817 -267672
1818 -267672 -228332 -204058 -214221 -240106 -223293 -231782 -266361 -310062 -304499 -217407 -233945 -244889
1806 -244889 -302890 -290163 -203382 -223188 -178473 -197139 -223466 -237577 -193787 -216275 -204490 -191236
1794 -191236 -198024 -219108 -280613 -306252 -268160 -294986 -312249 -277988 -296533 -321040 -360888 -349411
1782 -349411 -330471 -220158 -202734 -160569 -143921 -231497 -250316 -199899 -272469 -317217 -274031
1771 -274031 -250364 -273313 -262414 -228385 -283672 -289909 -295860 -247710 -324423 -323187 -288458 -284612
1759 -284612 -295155 -247360 -243042 -253879 -234014 -239873 -240432 -270247 -259840 -263581 -255987 -202286 -190479
1746 -190479 -226406 -258064 -227022 -262134 -294290 -275040 -292308 -284227 -261106 -234401 -212664 -224075
1734 -224075 -249135 -202577 -230765 -278799 -239578 -207118 -198048 -246296 -225528 -214708 -277396 -232990
1722 -232990 -196147 -237667 -221715 -230936 -282740 -302126 -258014 -316397 -348342 -331225 -318430 -243501
1710 -243501 -175228 -183768 -230057 -274515 -296170 -247714 -240779 -258238 -253567 -273979 -257090 -284239
1698 -284239 -251841 -271891 -310308 -250306 -299568 -260015 -241445 -220631 -284600 -217911 -226294 -290900
1686 -290900 -284820 -282854 -251757 -247639 -306002 -284576 -275721 -294006 -277764 -258564 -209620 -273562
1674 -273562 -295449 -217153 -265565 -264583 -263999 -303694 -253241 -258447 -259664 -257647 -285594 -314270 -312796
1661 -312796 -344069 -308454 -269954 -365109 -319515 -304761 -292215 -295402 -278743 -245905 -276953 -259107
1649 -259107 -269949 -244801 -255566 -277408 -351112 -359979 -332767 -307161 -314192 -329897 -348072 -350012
1637 -350012 -354355 -278743 -243570 -254389 -283929 -301819 -372764 -401840 -408361 -375324 -331078 -349408
1625 -349408 -265834 -260787 -276151 -232130 -294204 -293742 -256671 -291342 -286655 -275865 -240068 -252931
1613 -252931 -257478 -212508 -255677 -273759 -183146 -207856 -275511 -233129 -257464 -307384 -309126 -227563
1601 -227563 -224646 -326291 -271128 -213055 -225576 -259604 -287766 -263778 -304802 -348969 -300070 -329685
1589 -329685 -360178 -280869 -333311 -275595 -292287 -318114 -355779 -359926 -283598 -245323 -310091 -348435
1577 -348435 -309955 -377789 -380149 -332035 -321858 -345355 -348170 -329131 -327897 -313411 -282430 -252196
1565 -252196 -279299 -369364 -346572 -304917 -339422 -368114 -296224 -310205 -363749 -371511 -325398 -362225
1553 -362225 -314417 -327182 -285154 -262860 -255376 -237036 -259030 -325190 -341199 -369952 -369525 -354828
1541 -354828 -332478 -289557 -245542 -202496 -257491 -222830 -278989 -361070 -328706 -353949 -333548 -341254
1529 -341254 -329070 -305361 -298130 -315744 -292722 -306859 -388026 -377701 -369191 -390472 -368717 -368711 -362966
1516 -362966 -329564 -338709 -446907 -479420 -398416 -362803 -343962 -333809 -308827 -265440 -277769 -290905
1504 -290905 -293465 -306144 -342148 -374374 -354016 -353989 -337622 -309942 -324439 -392254 -380707 -339102
1492 -339102 -256980 -328589 -387164 -418703 -397025 -372976 -370295 -297535 -329398 -328602 -338739 -415223
1480 -415223 -423455 -430067 -361117 -321588 -350623 -347491 -343385 -374591 -388395 -345548 -353719 -327663 -279022
1467 -279022 -299951 -328790 -372323 -336954 -339454 -368409 -296415 -299468 -257187 -283917 -299155 -306536
1455 -306536 -384562 -323158 -315464 -313453 -366327 -363085 -317267 -318425 -303930 -338917 -352188 -346963 -330380
1442 -330380 -292352 -300221 -299547 -353082 -417957 -375353 -417989 -451692 -413739 -432597 -393900 -413185
1430 -413185 -397100 -378259 -296202 -333192 -394276 -413312 -428800 -379484 -324742 -366485 -350438 -388459
1418 -388459 -359903 -443987 -475591 -360784 -409753 -409859 -404767 -379363 -357783 -352821 -401210 -410542
1406 -410542 -349388 -342152 -334026 -363501 -423605 -320819 -325420 -355199 -333016 -328233 -369948 -318528
1394 -318528 -306049 -367618 -359619 -374272 -402438 -458379 -381201 -385101 -363906 -327681 -298937 -329894
1382 -329894 -354780 -344907 -336813 -388129 -402005 -360530 -399871 -294435 -314162 -353819 -360007 -402853
1370 -402853 -453125 -425337 -458591 -469370 -468969 -399890 -411362 -405381 -450692 -482106 -435611 -419590
1358 -419590 -380641 -320139 -391041 -360901 -336588 -389478 -401682 -381406 -407814 -455858 -477400 -437025
1346 -437025 -397560 -410653 -378615 -277516 -326850 -379126 -407499 -405266 -376927 -322588 -268598 -374145
1334 -374145 -374054 -419562 -371693 -325991 -374684 -341960 -356966 -420764 -441747 -477749 -443082 -453354
1322 -453354 -435233 -372139 -393353 -381258 -356104 -311317 -373117 -381684 -406551 -423922 -465741 -418838
1310 -418838 -376924 -382802 -326946 -356625 -365216 -381998 -383367 -371759 -379520 -429795 -412713 -378689
1298 -378689 -270772 -311057 -408743 -423915 -440890 -457189 -407533 -372930 -371683 -363117 -314454 -322673
1286 -322673 -393654 -435502 -414842 -397085 -436108 -470966 -484474 -406492 -424638 -423844 -471945 -444347
1274 -444347 -402709 -377929 -474293 -573603 -474783 -407281 -355586 -431741 -473617 -522882 -522341 -440197
1262 -440197 -463076 -520829 -515156 -442727 -421211 -414558 -440501 -475930 -416270 -413766 -404934 -386747
1250 -386747 -393842 -444957 -408778 -400091 -322781 -400594 -404946 -406489 -489849 -475982 -386622 -329304
1238 -329304 -390612 -389719 -312074 -352385 -330079 -291227 -329215 -382464 -379099 -362238 -401403 -445148
1226 -445148 -458839 -405756 -407106 -397844 -414082 -439959 -401935 -356241 -348871 -436471 -422670 -415603
1214 -415603 -438454 -452967 -441026 -390339 -350055 -372367 -391811 -442066 -427101 -415908 -446273 -444498
1202 -444498 -465409 -478265 -468770 -486022 -466424 -382222 -419346 -395321 -383881 -358688 -448317 -441284
1190 -441284 -485509 -472952 -437073 -509616 -539442 -495801 -499551 -410807 -431058 -496459 -390882 -395897
1178 -395897 -458816 -420216 -459486 -508848 -462149 -507386 -457643 -408055 -409973 -481278 -531679 -545325
1166 -545325 -531848 -487981 -458135 -456061 -457302 -436633 -429329 -415944 -435357 -455133 -453497 -403031
1154 -403031 -495634 -544077 -466144 -386010 -428733 -460855 -452548 -421451 -422981 -462195 -435304 -417841
1142 -417841 -457296 -485228 -451259 -464401 -491325 -452886 -414869 -353285 -445174 -504951 -481318 -514610
1130 -514610 -508740 -495978 -452187 -422814 -443196 -421225 -360161 -385059 -385937 -378039 -388885 -475711
1118 -475711 -526252 -460394 -430089 -397271 -451522 -473353 -601614 -568318 -470227 -451422 -480382
1107 -480382 -506784 -466932 -479437 -548667 -563627 -437694 -406541 -412898 -446182 -475816 -492298 -508296
1095 -508296 -479094 -429370 -379776 -402214 -452988 -457959 -491595 -496015 -448703 -431987 -479966 -540651
1083 -540651 -575272 -554413 -501205 -450013 -436118 -440339 -523618 -454099 -401762 -430139 -437515 -400524
1071 -400524 -457557 -505111 -431689 -387974 -423784 -477965 -514912 -491708 -490428 -477536 -428044 -515901
1059 -515901 -450552 -449668 -510837 -500888 -523731 -537620 -581551 -508571 -448312 -434148 -485198 -461858
1047 -461858 -466474 -503758 -475371 -484446 -463693 -473366 -491285 -496138 -492195 -537137 -545786 -524920 -596612
1034 -596612 -549048 -537829 -501337 -492438 -508913 -534482 -506483 -529295 -519582 -527380 -532802 -506155
1022 -506155 -530972 -456130 -426345 -444892 -436190 -492638 -487811 -541465 -501468 -404013 -399005 -436387
1010 -436387 -531667 -558352 -518648 -428048 -437306 -474288 -470921 -487761 -534239 -516402 -470756 -529611
998 -529611 -568154 -538552 -557760 -576748 -539632 -501834 -536528 -526463 -547003 -526671 -547125 -550054
986 -550054 -586450 -653224 -652526 -626490 -549481 -489007 -529530 -513086 -538606 -497213 -486238 -516998
974 -516998 -522477 -520809 -551415 -596152 -557028 -509483 -516194 -614088 -529900 -508716 -563558 -589032
962 -589032 -547013 -529855 -607666 -618216 -557286 -488126 -568023 -519688 -425180 -457782 -559177 -537092
950 -537092 -504618 -506577 -526695 -508805 -549158 -591404 -580460 -551463 -533484 -551808 -523748 -521424
938 -521424 -536423 -544551 -510493 -496389 -545949 -504655 -513787 -512752 -503653 -460740 -477454 -487153 -485363
925 -485363 -476468 -507519 -551543 -556587 -587043 -621357 -657282 -548531 -462844 -540147 -542354 -563160
913 -563160 -566329 -505219 -492663 -528918 -594982 -588989 -499826 -425323 -444602 -466533 -557885 -495169
901 -495169 -506238 -537111 -504070 -489442 -539967 -573991 -621739 -561029 -581309 -564300 -510343 -535251
889 -535251 -542231 -525974 -500797 -549222 -626258 -553402 -596454 -602910 -532345 -513398 -534118 -552537
877 -552537 -532352 -513316 -460678 -450429 -516328 -590904 -502806 -503265 -555681 -531561 -436549 -502953
865 -502953 -576530 -518631 -530039 -543813 -489910 -530983 -574513 -551540 -555188 -593413 -661739 -641476
853 -641476 -669963 -680689 -619281 -552757 -555025 -589141 -640975 -599488 -571316 -532040 -516420 -655313
841 -655313 -598836 -525768 -526245 -555509 -557812 -559433 -575026 -502277 -504250 -545397 -541651 -589018 -584595
828 -584595 -497903 -545770 -576043 -541549 -565194 -594947 -645486 -669118 -623201 -604342 -578311 -563397
816 -563397 -508169 -512584 -519179 -541706 -565990 -548431 -577357 -530774 -532976 -599024 -624496 -576839
804 -576839 -536393 -537184 -569641 -620051 -634140 -563729 -611905 -614049 -592759 -543441 -574007 -525910
792 -525910 -532074 -554359 -535900 -566761 -584386 -566914 -556958 -604299 -577824 -580549 -627295 -613337
780 -613337 -623842 -655895 -645582 -644792 -567885 -546672 -530201 -595506 -585442 -584057 -555489 -555985 -665299
767 -665299 -624656 -614987 -614286 -582893 -592079 -648707 -589127 -554623 -601808 -612631 -539021 -547798 -525034
754 -525034 -573759 -608202 -564832 -675397 -647760 -632411 -586883 -613352 -643509 -605297 -576419 -556781
742 -556781 -612939 -682742 -686860 -644008 -706510 -675622 -610398 -596873 -614235 -647594 -657214 -626166
730 -626166 -643434 -648478 -574123 -509315 -535365 -601650 -586555 -606714 -589501 -571926 -565266 -509731
718 -509731 -558498 -619903 -639761 -654897 -646704 -597334 -609055 -659761 -638991 -641921 -551525 -561464
706 -561464 -680635 -686275 -645124 -647212 -608911 -612604 -662156 -675844 -597303 -589373 -695480 -677327
694 -677327 -680162 -758849 -671364 -625078 -607333 -583455 -574024 -607205 -608171 -642357 -712858 -708095 -644847
681 -644847 -637982 -668297 -740760 -781771 -739127 -773030 -703864 -647470 -666211 -619036 -606049 -576357
669 -576357 -637497 -650369 -565005 -546831 -555634 -588733 -590526 -608428 -619457 -605465 -568757 -566565
657 -566565 -630139 -666235 -702486 -704585 -655370 -602155 -612969 -585998 -626084 -653181 -578072 -576334
645 -576334 -603170 -647536 -636355 -696031 -601926 -657816 -663177 -689711 -680248 -705313 -659171 -631411
633 -631411 -720729 -664870 -605341 -619274 -659625 -672407 -630328 -654904 -681878 -670923 -687282 -692612
621 -692612 -644288 -649849 -666762 -645720 -652603 -631844 -705432 -649408 -637109 -624924 -596505 -584490
609 -584490 -677583 -732440 -696592 -688490 -671919 -586449 -612037 -604113 -666169 -715088 -713098 -703120 -708310
596 -708310 -700091 -694953 -704320 -658649 -675512 -636790 -589520 -559208 -580649 -597943 -704659 -659485
584 -659485 -633333 -678528 -636752 -683968 -634065 -603337 -637448 -644221 -660308 -692893 -710566 -720210
572 -720210 -706006 -666883 -657000 -709187 -733401 -740572 -792398 -767987 -695211 -652846 -644105 -600341
560 -600341 -601352 -650638 -662005 -696411 -705198 -655047 -672947 -619981 -605676 -638924 -676756 -670170
548 -670170 -674475 -695205 -658614 -634767 -672359 -710750 -708109 -688180 -696658 -647625 -698162 -671539
536 -671539 -592368 -652230 -706747 -658999 -669852 -756119 -663152 -661201 -710137 -714584 -665207 -681364
524 -681364 -627051 -692932 -732914 -711613 -755408 -772089 -739168 -727576 -731916 -725241 -710778 -702522
512 -702522 -726145 -684018 -719025 -708406 -724765 -727333 -661127 -712119 -728912 -722224 -756168 -649666
500 -649666 -683913 -693201 -691733 -678635 -699998 -695397 -656275 -680223 -744738 -717211 -692263 -744942
488 -744942 -682188 -641310 -655654 -681123 -703585 -692463 -736192 -726493 -704700 -762689 -692043 -682127
476 -682127 -739807 -712026 -633230 -664400 -658403 -721605 -696880 -715787 -648713 -726771 -730143 -721118
464 -721118 -675284 -634262 -671872 -676136 -643559 -702024 -724967 -697796 -791709 -737860 -686078 -666190
452 -666190 -706576 -760132 -723708 -678027 -696371 -719085 -750689 -756977 -740670 -756262 -783001 -823630
440 -823630 -844153 -743723 -709025 -754647 -740905 -737517 -772495 -773845 -750144 -807026 -796808 -748837
$$ [...]
##END NTUPLES=NMR SPECTRUM
##END=
