##TITLE=1H_DE-80H_X3
 200.13MHz, d2o
 8 sc
 
 19ns.26.2.2025
##JCAMPDX= 6.0         $$ Bruker NMR JCAMP-DX V2.0
##DATA TYPE= NMR SPECTRUM
##DATA CLASS= NTUPLES
##ORIGIN= UXNMR, Bruker Analytische Messtechnik GmbH
##OWNER= pz
$$ XWIN-NMR		Version 3.5
$$ Thu Dec  4 12:03:48 2025 Russian Standard Time (UT+4h)  Yarkov@DPX200
##.OBSERVE FREQUENCY= 200.1313
##.OBSERVE NUCLEUS= ^1H
##.ACQUISITION MODE= SIMULTANEOUS
##.ACQUISITION SCHEME= undefined
##.AVERAGES= 8
##.DIGITISER RES= 18
##SPECTROMETER/DATA SYSTEM= spect
##.PULSE SEQUENCE= zg30
##.SOLVENT NAME= DMSO
##.SHIFT REFERENCE= (INTERNAL, DMSO, 0, 15.5056)
##AUDIT TRAIL= $$ (NUMBER, WHEN, WHO, WHERE, WHAT)
$$ ##TITLE= Audit trail, XWIN-NMR		Version 3.5
$$ ##JCAMPDX= 5.01
$$ ##ORIGIN= Bruker BioSpin GmbH
$$ ##OWNER= Yarkov
$$ C:/Bruker/XWIN-NMR/data/yarkov2/nmr/H-C/1/pdata/1/auditp.txt
$$ ##AUDIT TRAIL=  $$ (NUMBER, WHEN, WHO, WHERE, WHAT)
(   1,<2025-12-04 12:02:36.68 +0400>,<Yarkov>,<DPX200>,
      <created by zg, POWCHK disabled, PULCHK disabled
       configuration hash MD5:
       00 E9 B6 7A A2 85 ED C7 34 08 36 98 17 FE 4E 26
       data hash MD5: 16K
       7C 46 05 56 F3 2A 20 B5 09 37 5E 82 29 6B 03 EA>)
(   2,<2025-12-04 12:02:41.68 +0400>,<Yarkov>,<DPX200>,
      <Start of raw data processing
       efp BC_mod = 2 LB = 0.25 FT_mod = 6 PKNL = 1 PHC0 = -5312.644 PHC1 = 24.02191 SI = 16K 
       data hash MD5: 16K
       94 F5 95 71 2A 9D B5 47 1F FD 28 E9 AB 79 61 78>)
(   3,<2025-12-04 12:02:56.78 +0400>,<Yarkov>,<DPX200>,
      <abs ABSG = 5 
       data hash MD5: 16K
       2F 67 50 1A 35 C1 6B A6 13 E9 CB E0 21 9D DD 3E>)
(   4,<2025-12-04 12:03:10.98 +0400>,<Yarkov>,<DPX200>,
      <pk PHC0 = 0.091199 PHC1 = -3.8 
       data hash MD5: 16K
       BA DF 51 BB E8 E8 90 8C 91 12 5D 95 41 1D CD 72>)
$$ ##END=
$$ 
$$ hash MD5
$$ 49 21 2E 88 4C BE B4 E2 8F 21 EB 88 B1 59 68 A6
##$RELAX= 
##$RELAX= 
##$RELAX= 
##$RELAX= 
##$RELAX= 
##$RELAX= 
$$ Bruker specific parameters
$$ --------------------------
##$DU= <C:/Bruker/XWIN-NMR>
##$EXPNO= 1
##$NAME= <H-C>
##$PROCNO= 1
##$TYPE= <nmr>
##$USER= <yarkov2>
##$AMP= (0..31)
100 100 100 100 100 100 100 100 100 100 100 100 100 100 100 100 100 100 
100 100 100 100 100 100 100 100 100 100 100 100 100 100 
##$AQSEQ= 0
##$AQ_mod= 1
##$AUNM= <au_zg>
##$AUTOPOS= <>
##$BF1= 200.13
##$BF2= 200.13
##$BF3= 200.13
##$BF4= 200.13
##$BF5= 200.13
##$BF6= 200.13
##$BF7= 200.13
##$BF8= 200.13
##$BYTORDA= 1
##$CFDGTYP= 0
##$CFRGTYP= 5
##$CHEMSTR= <none>
##$CNST= (0..31)
1 1 145 1 1 1 1 1 1 1 1 1 1 1 1 1 1 1 1 1 1 1 1 1 1 1 1 1 1 1 1 1 
##$CPDPRG= <>
##$CPDPRG1= <>
##$CPDPRG2= <>
##$CPDPRG3= <>
##$CPDPRG4= <mlev>
##$CPDPRG5= <mlev>
##$CPDPRG6= <mlev>
##$CPDPRG7= <mlev>
##$CPDPRG8= <mlev>
##$CPDPRGB= <>
##$CPDPRGT= <>
##$D= (0..31)
0 0.7 0 0 0 0 0 0 0 0 0 0.03 0 0 0 0 0 0 0 0 0 0 0 0 0 0 0 0 0 0 0 0 
##$DATE= 1764835356
##$DBL= (0..7)
120 120 120 120 120 120 120 120 
##$DBP= (0..7)
150 150 150 150 150 150 150 150 
##$DBP07= 0
##$DBPNAM0= <>
##$DBPNAM1= <>
##$DBPNAM2= <>
$$ [...]
##$SUBNAM3= <"">
##$SUBNAM4= <"">
##$SUBNAM5= <"">
##$SUBNAM6= <"">
##$SUBNAM7= <"">
##$SUBNAM8= <"">
##$SUBNAM9= <"">
##$SW= 18.0517328524113
##$SWIBOX= (0..15)
0 0 2 0 0 0 0 0 0 0 0 0 0 0 0 0 
##$SW_h= 3612.71676300578
##$TD= 16384
##$TD0= 1
##$TE= 0
##$TE2= 300
##$TE3= 300
##$TEG= 300
##$TL= (0..7)
0 120 120 120 120 120 120 120 
##$TP= (0..7)
150 150 150 150 150 150 150 150 
##$TP07= 0
##$TPNAME0= <>
##$TPNAME1= <>
##$TPNAME2= <>
##$TPNAME3= <>
##$TPNAME4= <>
##$TPNAME5= <>
##$TPNAME6= <>
##$TPNAME7= <>
##$TPOAL= (0..7)
0.5 0.5 0.5 0.5 0.5 0.5 0.5 0.5 
##$TPOFFS= (0..7)
0 0 0 0 0 0 0 0 
##$TUNHIN= 0
##$TUNHOUT= 0
##$TUNXOUT= 0
##$USERA1= <user>
##$USERA2= <user>
##$USERA3= <user>
##$USERA4= <user>
##$USERA5= <user>
##$V9= 5
##$VALIST= <valist>
##$VCLIST= <CCCCCCCCCCCCCCC>
##$VD= 0
##$VDLIST= <DDDDDDDDDDDDDDD>
##$VPLIST= <PPPPPPPPPPPPPPP>
##$VTLIST= <TTTTTTTTTTTTTTT>
##$WBST= 1024
##$WBSW= 4
##$XGAIN= (0..3)
0 0 0 0 
##$XL= 0
##$YL= 0
##$YMAX_a= 446287
##$YMIN_a= -393199
##$ZGOPTNS= <>
##$ZL1= 120
##$ZL2= 120
##$ZL3= 120
##$ZL4= 120
##$ABSF1= 15.54416
##$ABSF2= -2.507691
##$ABSG= 5
##$ABSL= 3
##$ALPHA= 0
##$AQORDER= 0
##$ASSFAC= 0
##$ASSFACI= 0
##$ASSFACX= 0
##$ASSWID= 0
##$AUNMP= <proc_1d>
##$AZFE= 0.1
##$AZFW= 0.1
##$BCFW= 0
##$BC_mod= 2
##$BYTORDP= 0
##$COROFFS= 0
##$CY= -3
##$DATMOD= 1
##$DC= 0
##$DFILT= <>
##$DTYPP= 0
##$F1P= 0
##$F2P= 0
##$FCOR= 1
##$FTSIZE= 16384
##$FT_mod= 6
##$GAMMA= 0
##$GB= 0
##$INTBC= 1
##$INTSCL= 3.241238e-09
##$ISEN= 128
##$LB= 0.25
##$LEV0= 0
##$LPBIN= 0
##$MAXI= 10000
##$MC2= 0
##$MEAN= 0
##$ME_mod= 0
##$MI= 1.114404
##$NCOEF= 0
##$NC_proc= -8
##$NLEV= 6
##$NOISF1= 3.799351
##$NOISF2= 2.8
##$NSP= 0
##$NTH_PI= 0
##$NZP= 0
##$OFFSET= 15.5056
##$PC= 1
##$PHC0= -5312.553
##$PHC1= 20.22191
##$PH_mod= 1
##$PKNL= yes
##$PPARMOD= 0
##$PSCAL= 0
##$PSIGN= 0
##$REVERSE= no
##$SF= 200.130003222566
##$SI= 16384
##$SIGF1= 3
##$SIGF2= 2
##$SINO= 0.751879
##$SIOLD= 32768
##$SREGLST= <19F.Aceton>
##$SSB= 0
##$STSI= 16384
##$STSR= 0
##$SW_p= 3612.71676300578
##$SYMM= 0
##$S_DEV= 0
##$TDeff= 16384
##$TDoff= 0
##$TI= <>
##$TILT= no
##$TM1= 0
##$TM2= 0
##$TOPLEV= 0
##$USERP1= <user>
##$USERP2= <user>
##$USERP3= <user>
##$USERP4= <user>
##$USERP5= <user>
##$WDW= 1
##$XDIM= 16384
##$YMAX_p= 447851399
##$YMIN_p= -2897317
$$ End of Bruker specific parameters
$$ ---------------------------------
##NTUPLES= NMR SPECTRUM
##VAR_NAME=  FREQUENCY,     SPECTRUM/REAL,   SPECTRUM/IMAG
##SYMBOL=    X,             R,               I
##VAR_TYPE=  INDEPENDENT,   DEPENDENT,       DEPENDENT
##VAR_FORM=  AFFN,          ASDF,            ASDF
##VAR_DIM=   16384,         16384,           16384
##UNITS=     HZ,            ARBITRARY UNITS, ARBITRARY UNITS
##FACTOR=    0.220516191357247, 1,           1
##FIRST=     3103.13577308183, 0,            0
##LAST=      -509.580989923948, 0,           0
##MIN=       -509.580989923948, -2897317,    0
##MAX=       3103.13577308183, 447851399,    0
$$ Real data points
##PAGE= N=1
##DATA TABLE= (X++(R..R)), XYDATA
$$ [...]
8486E85298k41448k05190J31322L73249j56982k9162K22711o2619L3242p1261
$$ 585298 343850 138660 269982 643231 486249 457087 679798 617179 650421 579160
8476E79160J02442k59601l135J44728o3842J34112n6579p105q1345J29891M7733
$$ 579160 681602 422001 418866 563594 499752 633864 577285 570180 488835 618726 666459
8465F66459M6639J73351j12210J7088l53209K82618K69009k11029r1494L62705
$$ 666459 713098 886449 774239 791327 438118 720736 989745 778716 687222 1049927
8455A049927j02406j67548j03284M1874j60j60356j42209k14779j20257M81516
$$ 1049927 947521 779973 676689 718563 718403 558047 415838 201059 80802 562318
8445E62318M5067K9603M7694q7630k10444J73165K23882O2834k38686J30259l9889
$$ 562318 607385 636988 684682 597052 386608 559773 783655 846489 607803 738062 698173
8434F98173L7400n7074K3803k05790K8033M62872j52292k93947k6740J91063K3471
$$ 698173 735573 678499 702302 496512 524545 987417 835125 541178 514438 705501 728972
8423G28972k2037K05905N2064l70339O0968J8782j344K4090J81433O8134l22891
$$ 728972 706935 912840 964904 594565 655533 674315 672971 697061 878494 946628 623737
8412F23737l7701M5623O5074J92784r1275O5740J12540K30402l04833j95802P4848
$$ 623737 586036 631659 696733 889517 798242 863982 976522 1206924 902091 706289 781137
8401G81137J6465P9976r0860J6990m1814q2900l4807K6866R1925O8233L2225K29663
$$ 781137 797602 877578 786718 803708 761894 678994 644187 671053 762978 831211 863436 1093099
8389A093099O5150m21307l04285J09065K06604J20351K06671k38276j49766J30738
$$ 1093099 1158249 736942 432657 541722 748326 868677 1075348 837072 687306 818044
8379H18044O3182j44636K22407q9357p3083j82091j58231J71358n2093r1557K96439
$$ 818044 881226 736590 958997 869640 796557 614466 456235 627593 575500 483943 780382
8368G80382J21726j98508M6546k08598J36289J76834n8628J12987l35892p6j32231
$$ 780382 902108 703600 750146 541548 677837 854671 796043 909030 573138 573062 440831
8357D40831K9183J81969J91144N4068k58594o2565q6240j463J8462J0790K30172
$$ 440831 470014 651983 843127 897195 638601 576036 489796 488333 506795 517585 747757
8346G47757j6233M1128j39775R1810R6077K09031K4689j75189j37129j43098j09737
$$ 747757 731524 772652 632877 724687 820764 1029795 1054484 879295 742166 599068 489331
8335D89331j29488m4772M12748K16355q2640o2705k4385K2714k57551L19473r9590
$$ 489331 359843 315071 727819 944174 861534 798829 774444 797158 539607 859080 759490
8324G59490k33146J70620N317j67848N2197M50344j82623J65230j34134j70447
$$ 759490 526344 696964 702281 534433 586630 1036974 854351 1019581 885447 715000
8314G15000K5184j34521k9364J63964L42579j98277j15100o8402O8255K03136
$$ 715000 740184 605663 576299 740263 1082842 884565 769465 701063 769318 972454
8304I72454K1400k66060r9238L711P3701J06245j88125l7976R6903L65315Q7599
$$ 972454 993854 727794 628556 632267 705968 812213 624088 586112 683015 1048330 1135929
8293A135929l35506l7598K735j15921l5424K83488J8324K15795m51807k14430
$$ 1135929 800423 762825 765560 649639 614215 897703 916027 1131822 680015 465585
8283D65585K56051J9752k05087L91669J70934m39461j5156J76049n269J26090
$$ 465585 721636 741388 536301 927970 1098904 659443 644287 820336 815067 941157
8273I41157l9986j20424J29396n9510j65831L1225K30331J96555l28065l2574
$$ 941157 901171 780747 910143 850633 684802 716027 946358 1142913 814848 782274
8263G82274j63491k0443O8763j9582j6792N0425J24123J83659r5088j56938r0862
$$ 782274 618783 598340 667103 647521 630729 681154 805277 988936 893848 736910 646048
8252F46048J67426K30595r9405j0278n9245l64116l1104K93340L87091k1594l74803
$$ 646048 813474 1044069 944664 934386 875141 511025 479921 773261 1160352 1138758 763955
8241G63955j88352j02586R5086L0864J56579J40743J04823J66001m5509l93870
$$ 763955 575603 473017 568103 598967 755546 896289 1001112 1167113 1121604 727734
8231G27734N1179k37734J0667M02199J46161k81902j29233k18621J20382J90565
$$ 727734 778913 541179 551846 954045 1100206 818304 689071 470450 590832 781397
8221G81397R7488J04414m6343j57619r0303N9452K38187L17692K8174k14600J44771
$$ 781397 878885 983299 936956 779337 689034 748486 986673 1304365 1332539 1117939 1262710
8210A262710j9797k47733l76848M3864P3445J39259M4129J94158k89389L31195
$$ 1262710 1242913 995180 618332 662196 735641 874900 919029 1113187 823798 1154993
8200A154993J23885m3686j60211J98339l24271N27921J49498J448005J160845
$$ 1154993 1278878 1235192 1074981 1273320 949049 1476970 1626468 3074473 4235318
8191D235318l623489q3823J51882K35638j44250q0505q0709K54640j16876k20690
$$ 4235318 611829 528006 679888 915526 771276 690771 610062 864702 747826 527136
8181E27136L43918M1790j23653j75314j85683L65915J46447j15608o0883k10272
$$ 527136 871054 912844 789191 613877 428194 794109 940556 824948 764065 553793
8171E53793P319K6803K68405k12336j7123m5772K57088P6677M6150K06317k34582
$$ 553793 561112 587915 856320 643984 626861 581089 838177 914854 961004 1167321 932739
8160I32739j95351J62989K5529q7888j3676k8715k70K96074m0809l79964J49118
$$ 932739 737388 900377 925906 838018 824342 795627 795357 1091431 1050622 670658 819776
8149H19776l6321l2981L95244j06864l58018p1904P5203k0509K53423j74787K93330
$$ 819776 783455 750474 1145718 1038854 680836 608932 684135 663626 917049 742262 1035592
8138A035592k38344j42697p5814J41361j31890M5043O1653L39806L1152j43021
$$ 1035592 797248 654551 578737 720098 588208 633251 694904 1034710 1065862 922841
8128I22841l15905k44138L40407N7034j89303j87903J617n9156Q9862P4764K25684
$$ 922841 606936 362798 703205 760239 570936 383033 384650 325494 415356 490120 715804
8117G15804M2132k7244k3338k79296J56017J86371k18631M03056L4073q6563P1883
$$ 715804 757936 730692 707354 428058 584075 770446 551815 954871 988944 902381 974264
8106I74264j42885R8434Q9333r9487P4354n1802o2205Q9602q0518j69232J60024
$$ 974264 831379 929813 1019146 919659 994013 942211 880006 969608 889090 719858 879882
8095H79882j074j36108J45232j28804k44387K33425L1665k03921K18582K05983
$$ 879882 878808 742700 887932 759128 514741 748166 779831 575910 794492 1000475
8085A000475P7898L589j98822k39901j74080Q5445K9281J75847J35149r300r9554
$$ 1000475 1078373 1081962 883140 643239 469159 554604 583885 759732 894881 885581 786027
8074G86027J35035k60711k35365K66179J57714p8685j64921K92540j56739j29564
$$ 786027 921062 660351 424986 691165 848879 770194 605273 897813 741074 611510
8064F11510j15918K7693J72239l6588N687J98614N3142j51607k974n6066K23072
$$ 611510 495592 523285 695524 658936 664623 863237 916379 764772 761798 705732 928804
8053I28804j40216Q5679r745Q4533L92J35908n4978j73313j64587Q4662R1698
$$ 928804 788588 874267 864522 949055 949447 1085355 1030377 857064 692477 777139 868837
8042H68837P0338J01099p4680m8600n1405q4542j0812M14859l25544m9435J66798
$$ 868837 939175 1040274 965594 916994 865589 781047 770235 1185094 859550 810115 976913
8031I76913j25075N2524N9632p8733j46988K07995J05890q670Q9622j93484k0352
$$ 976913 851838 904362 963994 885261 738273 946268 1052158 1043488 1133110 939626 919274
8020I19274L7243j83560L7682j8925J3942r2800j4895O7358m3985J42029k39640
$$ 919274 956517 772957 810639 791714 805656 712856 697961 765319 721334 863363 623723
8009F23723q0097J05619R1163j8877J01619j6772J25628N1613Q7707M5877j88693
$$ 623723 543626 649245 740408 721531 823150 806378 932006 983619 1071326 1117203 928510
7998I28510k59403Q6200J48335m1749j28780J08680R9527l0661j91287K19730
$$ 928510 669107 755307 903642 861893 733113 841793 941320 910659 719372 939102
7988I39102r327j81410r3534K55795J07242k83172O5503N9751P8839r3792o7541
$$ 939102 929775 748365 654831 910626 1017868 734696 800199 859950 938789 844997 777456
7977G77456M1849l2480o7930M31791J34711p846j59617k5737j04960J7007m7588
$$ 777456 819305 786825 718895 1150686 1285397 1277551 1117934 1092197 987237 1004244 956656
7966I56656k24207Q3797L53381k4242l66498r6861J20813n4827J39753K92567
$$ 956656 732449 816246 1169627 1145385 778887 682026 802839 748012 887765 1180332
7956A180332k3742K3664O1743k63627N8082J06163K76134M5834l83304p1267q3526
$$ 1180332 1156590 1180254 1241997 978370 1036452 1142615 1418749 1464583 1081279 1010012 926486
7945I26486j89669P9762J18443m4187K0692r927J9205P9784j20588j8079q1744
$$ 926486 736817 816579 935022 890835 911527 901600 920805 1000589 880001 861922 780178
7934G80178M33067J37758J2987l56993j75321Q9190K10807J31193l5593Q0070
$$ 780178 1213245 1351003 1363990 1006997 831676 920866 1131673 1262866 1227273 1307343
7924A307343q1193r6716k83344k7431J8114L8952K4879J73959k73016q0790J15736
$$ 1307343 1226150 1129434 846090 818659 836773 875725 900604 1074563 801547 720757 836493
7913H36493L60801M38699j28772m80287k10396r4834K39702J87306m805Q1554
$$ 836493 1197294 1635993 1507221 1026934 816538 721704 961406 1148712 1143907 1225461
7903A225461M4716j25357j52264j59352m9397O3288M10543J8563j32630o0987
$$ 1225461 1270177 1144820 992556 833204 783807 847095 1257638 1276201 1143571 1082584
7893A082584k3192n9780j86324J26457N3385K2210j10849j35920J6970K5083K08873
$$ 1082584 1059392 999612 813288 939745 993130 1015340 904491 768571 785541 810624 1019497
7882A019497J65685n555q8471k55455j29213J37137J39976Q5362q041j92340j87987
$$ 1019497 1185182 1179627 1091156 835701 706488 843625 983601 1068963 1060922 868582 680595
7871F80595m1810j84336J88403K15853J72410K45450j43202q8700q4207J65253
$$ 680595 638785 454449 642852 858705 1031115 1276565 1133363 1044663 960456 1125709
7861A125709r8948J73349L18455k22964k54146j7105k50000k7123L06314L69512
$$ 1125709 1026761 1200110 1518565 1295601 1041455 1024350 774350 747227 1053541 1423053
7851A423053k7772j70530j33634R286l6760J02476j20426R8519M27684k80900
$$ 1423053 1395281 1224751 1091117 1100403 1063643 1166119 1045693 1144212 1571896 1290996
7841A290996k07453r5954j15181k31069K97328J22305K6238j81261j98491J19023
$$ 1290996 1083543 987589 872408 641339 938667 1060972 1087210 905949 707458 826481
7831H26481J81547J42444K89766q3336k57425k70615k03211L53779P7007J9420
$$ 826481 1008028 1150472 1440238 1356902 1099477 828862 625651 979430 1056437 1075857
7821A075857O8574L516j62359l604j31085m686K86201J47128K399k57786l3529
$$ 1075857 1144431 1147947 985588 981984 850899 846213 1132414 1279542 1281941 1024155 990626
7810I90626j7876j54654J38114q0824l03269J20039m75573K41315K36544K80128
$$ 990626 972750 818096 956210 875386 572117 692156 216583 457898 694442 974570
7800I74570J97486k37607j73639J28461K7694O7207K62079o3639j37595J7459
$$ 974570 1172056 934449 760810 889271 916965 984172 1246251 1182612 1045017 1062476
7790A062476l4718j16457j87494O7262K87979K31259J13750l06128r9389J52721
$$ 1062476 1027758 911301 723807 791069 1079048 1310307 1424057 1117929 1018540 1171261
7780A171261j765j73425Q6384k1197m8696j87605k4745j9811K03199R6898k66880
$$ 1171261 1169496 996071 1082455 1061258 1012562 824957 800212 780401 983600 1080498 813618
7769H13618N3233K68091r1694j4346J39343r0316K90448j76589p7135j6906J05336
$$ 813618 866851 1134942 1043248 1028902 1168245 1077929 1368377 1191788 1114653 1097747 1203083
7758A203083N9780j86986O7078j29087L23728J14053k64382l89027K35807J03377
$$ 1203083 1262863 1075877 1142955 1013868 1337596 1451649 1187267 798240 1034047 1137424
7748A137424j43610N7329j13318Q0370K34147l35683p7498N0177K61705q8613
$$ 1137424 993814 1051143 937825 1018195 1252342 916659 839161 889338 1151043 1062430
7738A062430m4680R2503R6023o1058k16650j60445M09500J64242Q9732N1045l61050
$$ 1062430 1017750 1110253 1206276 1145218 928568 768123 1177623 1341865 1431597 1482642 1121592
7727A121592j13908R0814J77506J01206o9008j39439L9793N5768Q7126o7560j92328
$$ 1121592 1007684 1098498 1276004 1377210 1308202 1168763 1208556 1264324 1351450 1283890 1091562
7716A091562L2178J83365j93254l3397P2606j99487K52395J85638Q3194j49729
$$ 1091562 1123740 1307105 1113851 1080454 1153060 953573 1205968 1391606 1474800 1325071
7706A325071j71277j61252q4605L11946O2677j86309N4199J25118J24026l50562
$$ 1325071 1153794 992542 907937 1219883 1282560 1096251 1150450 1275568 1399594 1049032
7696A049032o1815L6159n2200K58198L62946j74132L7268j94464k40182m816M1367
$$ 1049032 987217 1023376 971176 1229374 1592320 1418188 1455456 1260992 1020810 1015994 1057361
7685A057361J4471k16294J34957j63162k5383M26457J01228j75603o6994k12090
$$ 1057361 1071832 855538 990495 827333 801950 1228407 1329635 1154032 1087038 874948
7675H74948J22011k7389K18214J34614j72763m6816O3696k54437K30224j8097
$$ 874948 996959 969570 1187784 1322398 1149635 1102819 1166515 912078 1142302 1124205
7665A124205k5246R3095K71826K4185j09334j82208K30442j63469j09483P2317
$$ 1124205 1098959 1192054 1463880 1488065 1378731 1196523 1426965 1263496 1154013 1226330
7655A226330l0841J46928q6369j06990J76954J03783j59303k04369j21808O0033
$$ 1226330 1195489 1342417 1256048 1149058 1326012 1429795 1270492 1066123 944315 1004348
7645A004348K39396M5738j68494R107L25580l974j98801m6304m10256j19577K71754
$$ 1004348 1243744 1289482 1120988 1130095 1455675 1451701 1252900 1206596 796340 676763 948517
7634I48517j25208K21947J50627K06915l30151m30267K00503L68824L02826J17641
$$ 948517 823309 1045256 1195883 1402798 1072647 642380 842883 1211707 1514533 1632174
7624A632174m338l10164k46146j37350o4089J10403L06866K20567J656n9261j96501
$$ 1632174 1627836 1317672 1071526 934176 870087 980490 1287356 1507923 1509579 1450318 1253817
7613A253817j82312j08436N8768J45524n158K34417j93949p6545O1665R954N4857
$$ 1253817 1071505 963069 1021837 1167361 1162203 1396620 1202671 1126126 1187791 1197745 1252602
7602A252602Q881J15099O666K1407j56226M9717K11392j53118p2761J67884j45391
$$ 1252602 1261483 1376582 1383248 1404655 1248429 1298146 1509538 1356420 1283659 1451543 1306152
7591A306152k33010J7939K66070K53412k7334j57805j5821N8706k61957M7616
$$ 1306152 1073142 1091081 1357151 1610563 1583229 1425424 1409603 1468309 1206352 1253968
7581A253968L13472K68142j30662m79363j287q4949p283L22789J7835Q717K63378
$$ 1253968 1567440 1835582 1704920 1225557 1224270 1139321 1132038 1454827 1472662 1481379 1744757
7570A744757k70320j15213k028q0517J86755J23582n9376O0483k25007j97103
$$ 1744757 1474437 1359224 1357196 1276679 1463434 1587016 1527640 1588123 1363116 1166013
7560A166013J26857O5738L9169J25564K19245k95063o4987M5888j30560J63481
$$ 1166013 1292870 1358608 1397777 1523341 1742586 1447523 1382536 1428424 1297864 1461345
7550A461345J90303N4622J53182m86636j62588K39744L09691K46985K75323l0375
$$ 1461345 1651648 1706270 1859452 1372816 1210228 1449972 1759663 2006648 2281971 2251596
7540B251596R1626M33768P05170J334072J080849j4339o27859j182135l52703
$$ 2251596 2343222 2776990 3482160 4816232 5897081 5882742 5254883 4072748 3720045
7531C720045p02454m10554j91388L6111l11867k30793l70353k95796P7736J50654
$$ 3720045 3017591 2607037 2415649 2451760 2139893 1909100 1538747 1242951 1320687 1471341
7521A471341P6446R0188n2600J16383j36954l24228j25610N14908J23641r6302
$$ 1471341 1547787 1637975 1585375 1701758 1564804 1240576 1114966 1629874 1753515 1657213
7511A657213J20373k70378j96329p8288K68701N8396J765l0264p3239l19772K61210
$$ 1657213 1777586 1507208 1310879 1232591 1501292 1559688 1561453 1531189 1457950 1138178 1399388
7500A399388J16204J63799k36991J07662q3109k43017j02406N6324K14049K56396
$$ 1399388 1515592 1679391 1442400 1550062 1466953 1223936 1121530 1177854 1391903 1648299
7490A648299J647q1945j99059P5560j61630n3606L13441K70050J73976k89086
$$ 1648299 1649946 1568001 1368942 1444502 1282872 1229266 1542707 1812757 1986733 1697647
7480A697647k64401j38200m1015K27672J76775L6953R1004l00674L962J40838
$$ 1697647 1433246 1295046 1254031 1481703 1658478 1695431 1786435 1485761 1489723 1630561
7470A630561k93409P9476K94030J02369j61603k9466k9820l10613O0295J77052
$$ 1630561 1337152 1416628 1710658 1813027 1651424 1621958 1592138 1281525 1341820 1518872
7460A518872m550j94064q3246k5191K28192j41941j78729K80973L9504L7003n0357
$$ 1518872 1514322 1320258 1237012 1211821 1440013 1298072 1119343 1400316 1439820 1476823 1426466
7449A426466k6415j05774j38042L36695O1540l69549K25222j18587L5062O2323
$$ 1426466 1400051 1294277 1156235 1492930 1554470 1184921 1410143 1291556 1326618 1388941
7439A388941P8079J45823j45048N0347R3624j35292l0011q7148M66257J4091K166
$$ 1388941 1467020 1612843 1467795 1518142 1611766 1476474 1446463 1359315 1825572 1839663 1841829
7428A841829j56869k14209n7900p271j15698N3747L03020O173N317J02184k37742
$$ 1841829 1684960 1470751 1412851 1405580 1289882 1343629 1646649 1652822 1658139 1760323 1522581
7417A522581o7983J37171j0873p5287l3189j57002J89857L3562j21324K05276
$$ 1522581 1454598 1591769 1580896 1505609 1472420 1315418 1505275 1538837 1417513 1622789
7407A622789J61340O166k9646k9078n4036l2937L7181j63124o1988l6872k28636
$$ 1622789 1784129 1790295 1760649 1731571 1677535 1644598 1681779 1518655 1456667 1419795 1191159
7396A191159J28234N16360P1515m5693j44067k31446J59161r4133J03718r7406
$$ 1191159 1319393 1835753 1907268 1861575 1717508 1486062 1645223 1551090 1654808 1557402
7386A557402K6014K18988J14288m5677j3845K7675j10741j59873J57510k81724
$$ 1557402 1583416 1802404 1916692 1871015 1857170 1884845 1774104 1614231 1771741 1490017
7376A490017q4716L2267K6362O6233K88228k4563j61385Q2101R7408l10545l5167
$$ 1490017 1405301 1437568 1463930 1530163 1818391 1793828 1632443 1714544 1811952 1501407 1466240
7365A466240K85694M5857q8964r8260k05177J74301m883q9613P2351j35441J66221
$$ 1466240 1751934 1797791 1708827 1610567 1405390 1579691 1574808 1485195 1557546 1422105 1588326
7354A588326j72482r9453j4089K28662J24660L2236j80073k0445J47195l88254
$$ 1588326 1415844 1316391 1302302 1530964 1655624 1687860 1507787 1487342 1634537 1246283
7344A246283J01950J14745N5681l7129P7359Q2098O4454R3881r7615l16926N6937
$$ 1246283 1348233 1462978 1518659 1481530 1558889 1640987 1705441 1799322 1701707 1384781 1441718
7333A441718M1028j03841N0065K03243K23992l49909p0777J05429j08319J13242
$$ 1441718 1482746 1378905 1428970 1632213 1856205 1506296 1435519 1540948 1432629 1545871
7323A545871J43620N8314p4625O4471j75762k49418k66915L84895n7065K05735
$$ 1545871 1689491 1747805 1673180 1737651 1561889 1312471 1045556 1430451 1373386 1579121
7313A579121j60738J16283J61785j07197j42155K66022J44656j80975n4602J66913
$$ 1579121 1418383 1534666 1696451 1589254 1447099 1713121 1857777 1676802 1622200 1789113
7303A789113J54428j57528L7865j11094J72557l8587n902N884j8242o1952R4167
$$ 1789113 1943541 1786013 1823878 1712784 1885341 1846754 1840852 1846736 1828494 1766542 1860709
7292A860709m07337J28526k04837J99508K04786k89228r8722M18016q074k78008
$$ 1860709 1453372 1581898 1377061 1576569 1781355 1492127 1393405 1811421 1803347 1525339
7282A525339L1973j12565k691L71757n9049L4912M3563j78640j39698R1934J70595
$$ 1525339 1557312 1444747 1442056 1813813 1754764 1789676 1833239 1654599 1514901 1606835 1777430
7271A777430j32322J46963q0463j23736j33375m3266n6500J90458J0640J55025
$$ 1777430 1645108 1792071 1711608 1587872 1454497 1411231 1354731 1545189 1555829 1710854
7261A710854o8417j10239P4719J98163J45265k75576J82308k162o9133J19734
$$ 1710854 1642437 1532198 1606917 1805080 1950345 1674769 1857077 1854915 1785782 1905516
7251A905516j08246N4670k7925j08028J37388k76436J186J17977j28721k0411
$$ 1905516 1797270 1851940 1824015 1715987 1853375 1576939 1578125 1696102 1567381 1546970
7241A546970N08185J76119j56898q3433j35154j50127j25040K15794r6084J91901
$$ 1546970 2055155 2231274 2074376 1990943 1855789 1705662 1580622 1796416 1700332 1892233
7231A892233Q5576r9455o0421j03359J32800J26346P0749p6263l3206m01314L8608
$$ 1892233 1977809 1878354 1817933 1714574 1847374 1973720 2044469 1968206 1935000 1533686 1572294
7220A572294N04651Q8440r303j18577k57409P8376j17148k29925L33223J49634
$$ 1572294 2076945 2165385 2156082 2037505 1780096 1858472 1741324 1511399 1844622 1994256
7210A994256p1473J21060M9366n5710l35564M65078M5921k07665K52783J87764
$$ 1994256 1922783 2043843 2093209 2037499 1701935 2167013 2212934 2005269 2258052 2445816
7200B445816m72326k78195M339J06311P3217L32028k66079k70419r5229l12032
$$ 2445816 1973490 1695295 1699634 1805945 1879162 2211190 1945111 1674692 1579463 1267431
7190A267431L52004M29478P4342m7770j30600J235k08500j00367J9081L34580
$$ 1267431 1619435 2048913 2123255 2075485 1944885 1946120 1737620 1637253 1656334 1990914
7180A990914J41383m1782j7805l06413J90686N4158L04487r485K484o19386k27270
$$ 1990914 2132297 2090515 2072710 1766297 1956983 2011141 2315628 2306143 2308627 1689241 1461971
7169A461971J3709L51090K54216J52156J38323k15694k57251j86510P1725M6947
$$ 1461971 1475680 1826770 2080986 2233142 2371465 2155771 1898520 1712010 1783735 1830682
7159A830682J38747K72190k13865j52710j7570o7782l2701L16592Q5788j41248
$$ 1830682 1969429 2241619 2027754 1875044 1857474 1789692 1756991 2073583 2159371 2018123
7149B018123n9038j42016M1635K8130M44788j88539N685l2211m17580r1981K64224
$$ 2018123 1959085 1817069 1858704 1886834 2331622 2143083 2148768 2116557 1698977 1606996 1871220
7138A871220J68105j10731J01162j55730k76252j04747L03445j77169L15133J01131
$$ 1871220 2039325 1928594 2029756 1874026 1597774 1493027 1796472 1619303 1934436 2035567
7128B035567J46814P2623j49970j20193q7764m2416L7379M94330R5400j74972
$$ 2035567 2182381 2255004 2105034 1984841 1897077 1854661 1892040 2386370 2481770 2306798
7118B306798k34103k22801r288J47510L62195r9581r7164j25336l26102N1663
$$ 2306798 2072695 1849894 1840606 1988116 2350311 2250730 2153566 2028230 1702128 1753791
7108A753791K76983J50301L43320l3996j97930J25044k25748q9736K43083r2080
$$ 1753791 2030774 2181075 2524395 2490399 2292469 2417513 2191765 2102029 2345112 2253032
7098B253032K0386j99869L2403J1021k72114L1986K08735L97378k90637j00491
$$ 2253032 2273418 2073549 2105952 2116973 1844859 1876845 2085580 2482958 2192321 2091830
7088B091830k25058J86897L2566k09658K24021J6184N6480q8412j13179J36060
$$ 2091830 1866772 2053669 2086235 1876577 2100598 2116782 2173262 2084850 1971671 2107731
7078B107731J22396R7564M9997L4119l54189j65836J70716L8272n327J73414J19194
$$ 2107731 2230127 2327691 2377688 2411807 2057618 1891782 2062498 2100770 2095443 2268857 2388051
7067B388051M2841K91287m21324k16499L9165K9249L61477J24447j85647k31395
$$ 2388051 2430892 2722179 2300855 2084356 2123521 2152770 2514247 2638694 2453047 2221652
7057B221652l16258R963K44436P8099j2001m6743J61761k33844j959j1772J36160
$$ 2221652 1905394 1915357 2159793 2237892 2225891 2179148 2340909 2107065 2105106 2093334 2229494
7046B229494k18528K0524P5096Q0641m5152P1234K51432J4797k07116N7257p2179
$$ 2229494 2010966 2031490 2106586 2187227 2142075 2213309 2464741 2479538 2272422 2329679 2257500
7035B257500P5092k45136k01039K58729m1642n8659J47004j22734O7644R0593
$$ 2257500 2332592 2087456 1886417 2145146 2103504 2044845 2191849 2069115 2136759 2227352
7025B227352L437M1369N1543p652k1115K8382J55264J1620l50582l46168J76206
$$ 2227352 2230789 2272158 2323701 2316049 2294934 2323316 2478580 2490200 2139618 1793450 1969656
7014A969656K94927J16549m6005l81959L81971O9027M0306k6232J5397j59545
$$ 1969656 2264583 2381132 2335127 1953168 2335139 2404166 2444472 2418240 2433637 2274092
7004B274092K45036J47407k12979K84173K07541p8211j31565k16024n0278p1598
$$ 2274092 2519128 2666535 2453556 2737729 2945270 2867059 2735494 2519470 2469192 2397594
6994B397594m5792r4444K39744k3915q9167K7513J02812L9473j14252O9163l5193
$$ 2397594 2351802 2257358 2497102 2473187 2384020 2411533 2514345 2553818 2439566 2508729 2473536
6983B473536J62085K3442M4420j68963k21604M9152j86955L3107J01883J3906
$$ 2473536 2635621 2659063 2703483 2534520 2312916 2362068 2175113 2208220 2310103 2324009
6973B324009k9303m1770j305L46055r41j1052j84629K7713j40742l4825J44606
$$ 2324009 2294706 2252936 2251631 2597686 2596745 2585693 2401064 2428777 2288035 2253210 2397816
6962B397816j4043j35667K82477M7488o7856j12027j146N33952l79677k0197j01512
$$ 2397816 2383773 2248106 2530583 2578071 2510215 2398188 2397042 2930994 2551317 2531120 2429608
6951B429608K51824L395j91720K5784R6290J11134R5430k89998j00000N5136J47684
$$ 2429608 2681432 2684827 2493107 2518891 2615181 2726315 2821745 2531747 2431747 2486883 2634567
6940B634567l2008J85438J37402j88047k14179J76759J09474l39208Q3712O7564
$$ 2634567 2602559 2787997 2925399 2737352 2523173 2699932 2809406 2470198 2553910 2621474
6930B621474J98964l4936j76293r7191J8656p3689P9118J81691K76512k86735
$$ 2621474 2820438 2785502 2609209 2512018 2530674 2456985 2536103 2717794 2994306 2707571
6920B707571k24163P6260k03753j61163K06253K09111R1854o2120m002R9677j03537
$$ 2707571 2483408 2559668 2355915 2194752 2401005 2610116 2701970 2639850 2635848 2735525 2631988
6909B631988N216J23796l8731k38325O2481K78618J55130k160m1657j31247P5140
$$ 2631988 2637204 2761000 2722269 2483944 2546425 2825043 2980173 2978013 2936356 2805109 2880249
6898B880249l17227L1462K35571K17570k06584J11380k55220o3853N294J03273
$$ 2880249 2563022 2594484 2830055 3047625 2841041 2952421 2697201 2633348 2638642 2741915
6888B741915k8790M5839M31320k80223j94843j77617m5K20487J73720n2669P7103
$$ 2741915 2713125 2758964 3190284 2910061 2715218 2537601 2537556 2758043 2931763 2879094 2956197
6877B956197r2806j44023Q1086J30014k15083j94447O1955J02449R3000q3893
$$ 2956197 2863391 2719368 2800454 2930468 2715385 2520938 2582893 2685342 2778342 2694449
6867B694449J322J49129j08497K67066j08945j6956L3161j18033n9139J06745
$$ 2694449 2695771 2844900 2736403 3003469 2894524 2877568 2910729 2792696 2733557 2840302
6857B840302p2581J46581O0962k3172j25808r4504j19461N4242l0329O9132K77304
$$ 2840302 2767721 2914302 2975264 2952092 2826284 2731780 2612319 2666561 2636232 2705364 2982668
6846B982668j42963J2197N4524J16319P5699j95159j26936j04293J20877m7675
$$ 2982668 2839705 2851902 2906426 3022745 3098444 2903285 2776349 2672056 2792933 2745258
6836B745258J32353J78437j12182K29028j56945j54079j19210P5948J85399J31688
$$ 2745258 2877611 3056048 2943866 3172894 3015949 2861870 2742660 2818608 3004007 3135695
6826C135695J55983j08286m5197m0859j86995R6120o8904J27140K11944k54590
$$ 3135695 3291678 3183392 3138195 3097336 2910341 3006461 2937557 3064697 3276641 3022051
6816C022051k0918r2573J5672J35111j1437m9874k00563j94299l1944K01806N4644
$$ 3022051 3001133 2908560 2924232 3059343 3047906 2998032 2797469 2603170 2571226 2773032 2827676
6805B827676J39134R5758j53317K9350l0081q9374R648O1173O2101J00133J19951
$$ 2827676 2966810 3062568 2909251 2938601 2908520 2819146 2828794 2889967 2952068 3052201 3172152
6794C172152l1304k26710k09804K63041P4401J05113J35532J03537o7593j12062
$$ 3172152 3140848 2914138 2704334 2967375 3041776 3146889 3282421 3385958 3318365 3206303
6784C206303k02167K18315k16329N62M35501m9618k10702l13652R1997J79180
$$ 3206303 3004136 3222451 3006122 3006684 3442185 3392567 3181865 2868213 2960210 3139390
6774C139390L26143j60058j42318R3078n4212k23417N8905J25408r2444J23843
$$ 3139390 3465533 3305475 3163157 3256235 3202023 2978606 3037511 3162919 3070475 3194318
6764C194318O7383m23741r7732N07126K46167j31158O1482K0400j25869q1705
$$ 3194318 3261701 2837960 2740228 3247354 3493521 3362363 3423845 3444245 3318376 3236671
6754C236671p6275J9428J27915j20156J75500J96425j53810j96336L4348J35385
$$ 3236671 3160396 3179824 3307739 3187583 3363083 3559508 3405698 3209362 3243710 3379095
6744C379095j10747J04159k4365j61685k57183R9499J77416K03116L3235K8678
$$ 3379095 3268348 3372507 3348142 3186457 2929274 3028773 3206189 3409305 3442540 3471218
6734C471218j37651J82325l0215p9046J73498k30612r5459J96302j09173q3873
$$ 3471218 3333567 3515892 3485677 3406631 3580129 3349517 3254058 3450360 3341187 3257314
6724C257314j81891K15114K95720m2815j02370J37206k81935m0831L43873J90432
$$ 3257314 3075423 3290537 3586257 3543442 3441072 3578278 3296343 3255512 3599385 3789817
6714C789817J91978j13124p0894l42282P4684O0866J01485j11693P6744j74340
$$ 3789817 3981795 3868671 3797777 3455495 3530179 3591045 3692530 3580837 3657581 3483241
6704C483241j05827l0523N7598j37086r3259N03919p1424j05744j7610L08395
$$ 3483241 3377414 3346891 3404489 3267403 3174144 3678063 3606639 3500895 3483285 3791680
6694C791680K6549k42462P7716j06173j91874Q4304L31227k50522j5207L47855
$$ 3791680 3818229 3575767 3653483 3547310 3355436 3439740 3770967 3520445 3505238 3853093
6684C853093R2070J8987l13805k08770L0219J65304J09768N8485L2201j44657
$$ 3853093 3945163 3964150 3650345 3441575 3471794 3637098 3746866 3805351 3837552 3692895
6674C692895k03879J3689p1208J52270Q7871j10317Q6593K71067K02989j56286
$$ 3692895 3489016 3502705 3431497 3583767 3671638 3561321 3647914 3918981 4121970 3965684
6664C965684o3108k00500K9099j96061R4805J64660m4765m4956K70897K672K10793
$$ 3965684 3902576 3702076 3731175 3535114 3629919 3794579 3749814 3704858 3975755 3978427 4189220
6653D189220n9708l02219q7047J78461n245J8575j32249J80034k2729q3142K08962
$$ 4189220 4129512 3827293 3740246 3918707 3913462 3932037 3799788 3979822 3957093 3873951 4082913
6642D082913j02650k43359J86638j9974p3996L07997j02609J27849j59715J74527
$$ 4082913 3980263 3736904 3923542 3903568 3829572 4137569 4034960 4162809 4003094 4177621
6632D177621J7153j6551K3611K1239R9364k12333P0877K44034m42608N2537k4175
$$ 4177621 4194774 4178223 4201834 4223073 4322437 4110104 4180981 4425015 3982407 4034944 4010769
6621D010769q8164K0011q0460j92819P1029J53415L96143l08093o3335L77001
$$ 4010769 3922605 3942616 3862156 3669337 3740366 3893781 4289924 3981831 3918496 4295497
6611D295497K39611J04749k29799j33658m7355K6382K59461m9059j72057l5416
$$ 4295497 4535108 4639857 4410058 4276400 4229045 4255427 4514888 4465829 4293772 4258356
6601D258356O8743J15752K84996M5340l60457m0758j0717o850o3398O3300n705
$$ 4258356 4327099 4442851 4727847 4773187 4412730 4371972 4361255 4354405 4291007 4354307 4348602
6590D348602K27696k06388J0376j4997J48609j9277l70715J23422J37169j34341
$$ 4348602 4576298 4369910 4380286 4365289 4513898 4494621 4123906 4247328 4384497 4250156
6580D250156J25657R6009k59358K75258K1645j38857j04214m6853K04469K93101
$$ 4250156 4375813 4471822 4212464 4487722 4509367 4370510 4266296 4219443 4423912 4717013
6570D717013n6430l99240J95394L94724m68807l07041L95415J91037m6718p4788
$$ 4717013 4660583 4261343 4456737 4851461 4382654 4075613 4471028 4662065 4615347 4540559
6560D540559J11627j62601j64939J06474J31253o2517R5626O4371l6989K35819
$$ 4540559 4652186 4489585 4324646 4431120 4562373 4499856 4595482 4659853 4622864 4858683
6550D858683k1738r4010J74924l17372l7377N4410J14520r1943J32824r7761j86117
$$ 4858683 4836945 4742935 4917859 4600487 4563110 4617520 4732040 4640097 4772921 4675160 4489043
6539D489043l1856L43935N3437k77254J45414j88241J04115J36916J42897o1600
$$ 4489043 4457187 4801122 4854559 4577305 4722719 4534478 4638593 4775509 4918406 4856806
6529D856806m5594n2020n5054L9974l4695K07148J80197n7261L57468P0758k66294
$$ 4856806 4811212 4759192 4704138 4744112 4709417 4916565 5096762 5039501 5396969 5467727 5201433
6518E201433k81314M4168o6326j98049j22080j9076L22598L1321j49508J70647
$$ 5201433 4920119 4964287 4897961 4699912 4577832 4558756 4881354 4912675 4763167 4933814
6508D933814J04949m126m1564j67129j52797Q44L71137N010j99112o5191L12713
$$ 4933814 5038763 5034637 4993073 4825944 4673147 4673991 5045128 5050138 4851026 4785835 5098548
6497E098548l1251j66236J3553J12732M5190k87020K17405K4917J82553K97796
$$ 5098548 5067297 4901061 4914614 5027346 5072536 4785516 5002921 5027838 5210391 5508187
6487E508187n32090r822M49525m32107m7891r4861P3288j74848n3436J92783K35654
$$ 5508187 4976097 4966275 5415800 4983693 4935802 4840941 4914229 4739381 4685945 4878728 5114382
6476E114382J36270J14978o7723J06778K2053j50214j66993j59412J07187J6566
$$ 5114382 5250652 5365630 5297907 5404685 5426738 5276524 5109531 4950119 5057306 5073872
6466E073872J48675J16542m8268j95699k16694j31045M1576L03193K16791j00063
$$ 5073872 5222547 5339089 5290821 5095122 4878428 4747383 4788959 5092152 5308943 5208880
6456E208880N9376J13013k1115j75463J08488k1333J21419K32702P6833L8466
$$ 5208880 5268256 5381269 5360154 5184691 5293179 5271846 5393265 5625967 5702800 5741266
6446E741266q6061o6292k31708j31654J72840J69624j09221j02440L92617k12825
$$ 5741266 5655205 5588913 5357205 5225551 5398391 5568015 5458794 5356354 5748971 5536146
6436E536146q4733K59576J38472j38271J47573j6151J9143k5493o7697l0703j06779
$$ 5536146 5451413 5710989 5849461 5711190 5858763 5842612 5861755 5836262 5768565 5737862 5631083
6425E631083J02501L02146m34015j62701K9368K80804o0919K5004K85390j22212
$$ 5631083 5733584 6035730 5601715 5439014 5468382 5749186 5688267 5713271 5998661 5876449
6415E876449L33359j97433j0289j34839M9756Q8472j317k90735J9839K34916O1348
$$ 5876449 6209808 6012375 6002086 5867247 5917003 6005475 6004158 5713423 5733262 5968178 6029526
6404F029526J08967r9165k06566L3456J71685j06498J87700L83743n59181j55386
$$ 6029526 6138493 6039328 5832762 5866218 6037903 5931405 6119105 6502848 5943667 5788281
6394E788281K38023J8879l6667P3460J32033j66953J34318l13554J50911K29732
$$ 5788281 6026304 6045183 6008516 6081976 6214009 6047056 6181374 5867820 6018731 6248463
6384F248463k657m0995j37255K57920n3853K7258R2341m1855K9005j98676q083
$$ 6248463 6245806 6204811 6067556 6325476 6271623 6298881 6391222 6349367 6378372 6179696 6171613
6373F171613l9776j42830L58007K73313p0099j76318j07958l04787K54218J09744
$$ 6171613 6131837 5989007 6347014 6620327 6550228 6373910 6265952 5961165 6215383 6325127
6363F325127N0060J58391J53829j7892l5042j07478m26291J87453J92056J03733
$$ 6325127 6375187 6533578 6687407 6669515 6634473 6526995 6100704 6288157 6480213 6583946
6353F583946O4013k12565K52873O0488q1306m1505J0760j3227q6443J48508p1224
$$ 6583946 6647959 6435394 6688267 6748755 6667449 6625944 6636704 6623477 6537034 6685542 6614318
6342F614318j32650J28907n9042p9953J24222r649l6056k9187K17732l3555Q4032
$$ 6614318 6481668 6610575 6551533 6471580 6595802 6586153 6550097 6520910 6738642 6705087 6789119
6331F789119R7801j26886o4144o5134R039L29353j18226R4691P0193J92474p6985
$$ 6789119 6886920 6760034 6695890 6630756 6639795 6969148 6850922 6945613 7015806 7208280 7131295
6320G131295j51851J30761J823K34183j53367q1530k9786Q8490J65004l05118
$$ 7131295 6979444 7110205 7112028 7346211 7192844 7111314 7081528 7170018 7335022 7029904
6310G029904J18085r0290p7081K66534K96816N0935J26509k26503r3835o0808
$$ 7029904 7147989 7057699 6980618 7247152 7543968 7594903 7721412 7494909 7401074 7340266
6300G340266J21649N1388j33172k63014O6856N21311k63585j39486J16886L8393
$$ 7340266 7461915 7513303 7380131 7117117 7183973 7705284 7441699 7302213 7419099 7457492
6290G457492J65284J33216k97289m8431p0809j50367J94922L47252o727J56624
$$ 7457492 7622776 7755992 7458703 7410272 7339463 7189096 7384018 7731270 7724543 7881167
6280G881167k3776j47791j63120j18284J27622K658M8096K3118l0686P5279K61441
$$ 7881167 7857391 7709600 7546480 7428196 7555818 7558476 7606572 7629690 7599004 7674283 7935724
6269G935724k8462l5296J69645j0055K7258j35607O2506j52105Q9104q3601L23678
$$ 7935724 7907262 7871966 8041611 8031556 8058814 7923207 7985713 7833608 7922712 7839111 8162789
6258H162789M1975m00362Q7960K79639J44673j50937R3966L88676J4603j47595
$$ 8162789 8204764 7804402 7892362 8172001 8316674 8165737 8259703 8648379 8662982 8515387
6248H515387l38028K74927j42471j75617r3013K04479K61863P6330M2530j37951
$$ 8515387 8177359 8452286 8309815 8134198 8041185 8245664 8507527 8583857 8626387 8488436
6238H488436J82089r8387K1220M3642p4878J70121q8714O0205j9254j71335K06850
$$ 8488436 8670525 8572138 8593358 8637000 8562122 8732243 8643529 8703734 8684480 8513145 8719995
6227H719995q6246K57588n6329k69157J50413l2494K37489J8108P1344K4256j05568
$$ 8719995 8633749 8891337 8835008 8565851 8716264 8683770 8921259 8939367 9010711 9034967 8929399
6216H929399l8585R93K49302L4490J14782J41775J04503K6650p1586k01159K73272
$$ 8929399 8890814 8891807 9141109 9175599 9290381 9432156 9536659 9563309 9491723 9290564 9563836
6205I563836N1910J5310o3701j27742k19272M6056O1291n1341K17766K19953j37875
$$ 9563836 9615746 9631056 9567355 9439613 9220341 9266397 9327688 9276347 9494113 9714066 9576191
6194I576191j34440K43840K75551n3057l6009J7997n5199m52916K62075L61911
$$ 9576191 9441751 9685591 9961142 9908085 9872076 9890073 9834874 9381958 9644033 10005944
6184A0005944J63013j97929O1202J5215K7668r0535O8733P3175j80441K20045
$$ 10005944 10168957 9971028 10032230 10047445 10075113 9984578 10053311 10126486 9946045 10166090
6174A0166090n0631j06937p2033K15122j43567j03844K54815J19224k46965Q998
$$ 10166090 10115459 10008522 9936489 10151611 10008044 9904200 10159015 10278239 10031274 10040272
6164A0040272K40586j10797q172J06761L51481J4109L37035J78783l57464l05160
$$ 10040272 10280858 10170061 10161889 10268650 10620131 10634240 10971275 11150058 10792594 10487434
6154A0487434N1849K05251k64421P2662n8378J531J63610j03668j22365K10842
$$ 10487434 10539283 10744534 10480113 10552775 10494397 10495928 10659538 10555870 10433505 10644347
6144A0644347r0069K13513J36715R7025R4479m0716j7314J39087Q0038J0159k3999
$$ 10644347 10554278 10767791 10904506 11001531 11096010 11055294 11037980 11177067 11257105 11267264 11243265
6133A1243265N3634K76741j36579j72650J90335J09925J84827n761K7679O9006
$$ 11243265 11296899 11573640 11437061 11264411 11454746 11564671 11749498 11743737 11771416 11840422
6123A1840422P7295J18378k79337J20022K56463o9215k55182Q05l9571J94941
$$ 11840422 11917717 12036095 11756758 11876780 12133243 12064028 11808846 11809651 11770080 11965021
6113A1965021L4453n6530J75964K97242j44645N2472J91567N9884N0573N5109
$$ 11965021 11999474 11942944 12118908 12416150 12271505 12323977 12515544 12575428 12626001 12681110
6103A2681110l07642k30436L04783k965J95991J51874J52565J70925L5054K47432
$$ 12681110 12373468 12143032 12447815 12444850 12640841 12792715 12945280 13116205 13151259 13398691
6093A3398691M36345K02091r5962J28382K04368n2889P1561j82032j1777j8225
$$ 13398691 13835036 14037127 13941165 14069547 14273915 14221026 14292587 14110555 14098778 14080553
6083A4080553N4865P6131k83669j54747L16059j19123L068L52239L25557J18657
$$ 14080553 14135418 14211549 13927880 13773133 14089192 13970069 13973137 14325376 14650933 14769590
6073A4769590M9056q0458p151K90465L88143L78681L21425Q85681M31424M62434
$$ 14769590 14818646 14738188 14731037 15021502 15409645 15788326 16109751 16995432 17426856 17889290
6063A7889290M36831N20779L53185j68099k07556n67750m73183l28653m32892
$$ 17889290 18326121 18846900 19200085 19031986 18824430 18256680 17783497 17454844 17021952
6054A7021952j22757j1436j60452k59648j74885j2642k4224L79211L5890K43553
$$ 17021952 16899195 16887759 16727307 16467659 16292774 16280132 16255908 16635119 16671009 16914562
6044A6914562j2360K74507L91547L55405N70403M28626P31771J025341P56649
$$ 16914562 16902202 17176709 17568256 17923661 18494064 18922690 19654461 20679802 21436451
6035B1436451J170767P82173K92163j07074n99786m06784p09824j040453r12003
$$ 21436451 22607218 23389391 23681554 23574480 22974694 22567910 21858086 20817633 19905630
6026A9905630m63390k02647j56917j52127l11826L365l69748l06570J22962J60202
$$ 19905630 19442240 19239593 19082676 18930549 18618723 18622088 18252340 17945770 18068732 18228934
6016A8228934L92429L83145M74042k01404M7246N35995O96460N15053O35219N61505
$$ 18228934 18621363 19004508 19478550 19277146 19324392 19860387 20556847 21071900 21707119 22268624
6006B2268624L01937K37465K60690m50156r20658l82967l50890l46966l40096
$$ 22268624 22570561 22808026 23068716 22618560 21697902 21314935 20964045 20617079 20276983
5997B0276983k10855j41155M0049l8416p2262L35553n2869j28735j92140O3872
$$ 20276983 20066128 19924973 19965022 19926606 19854344 20189897 20137028 20008293 19816153 19880025
5987A9880025L32741J06075R2310K01218O9841J84758M47271R5632O4867J36206
$$ 19880025 20212766 20318841 20411151 20612369 20682210 20866968 21314239 21409871 21474738 21610944
5977B1610944k12552J79786J44182K814j38023o6718L5j62682k87303k26072k32699
$$ 21610944 21398392 21578178 21722360 21725174 21587151 21520433 21520468 21357786 21070483 20844411 20611712
5966B0611712R1399L23433K71503R0055m953j30546k30306o9094J62982K99340
$$ 20611712 20703111 21026544 21298047 21388102 21383149 21252603 21022297 20953203 21116185 21415525
5956B1415525M6729J70013o350l23749j62236Q1647L96200J49513J20242P9095
$$ 21415525 21462254 21632267 21625917 21302168 21139932 21221579 21617779 21767292 21887534 21966629
5946B1966629J11838k71363J5101K73982R7446K61581J56574K39433N9375J10014
$$ 21966629 22078467 21807104 21822205 22096187 22193633 22455214 22611788 22851221 22910596 23020610
5936B3020610q6390O8777J58191m0379O3677Q820l00697J24917J78054J92745
$$ 23020610 22934220 23002997 23161188 23120809 23184486 23193306 22892609 23017526 23195580 23388325
5926B3388325K29137j48364l12049j86331L98797K64388L71623K09608J34918
$$ 23388325 23617462 23469098 23157049 22970718 23369515 23633903 24005526 24215134 24350052
5917B4350052J85091L77619R91k37919J46413N1587J57430J36622K05799l35758
$$ 24350052 24535143 24912762 24913753 24675834 24822247 24873834 25031264 25167886 25373685 25037927
5907B5037927l15776P8486l8836J24537J94637J59266L4577k80703J04058M24864
$$ 25037927 24722151 24800637 24761801 24886338 25080975 25240241 25274818 24994115 25098173 25523037
5897B5523037L71582r3296P8932K60202j70478j24094R2691J78039K23880L59936
$$ 25523037 25894619 25801323 25880255 26140457 25969979 25845885 25938576 26116615 26340495 26700431
5887B6700431M2155L07686K5227J07652L70245K36494L85513L08833J1651K1674
$$ 26700431 26742586 27050272 27075499 27183151 27553396 27789890 28175403 28484236 28495887 28517561
5877B8517561j54243n1594R6905L07648P8779N2119J1881j5546j37344J72792
$$ 28517561 28363318 28311724 28408629 28716277 28795056 28847175 28859056 28843510 28706166 28878958
5867B8878958M31222K34084P1104l37564L47941M1472L17584L08010K58956J93324
$$ 28878958 29310180 29544264 29615368 29277804 29625745 29667217 29984801 30292811 30551767 30745091
5857C0745091K22135L11367K71327M11378k51741J1858Q1384k45116K70954j11075
$$ 30745091 30967226 31278593 31549920 31961298 31709557 31721415 31802799 31557683 31828637 31717562
5847C1717562K6310J77842K97437J81272j32054J65903N4461R8583K14683m2680
$$ 31717562 31743872 31921714 32219151 32400423 32268369 32434272 32488733 32587316 32801999 32759319
5837C2759319K89525K11787K28455K73245M73089q0405L17245J55232Q9623K47885
$$ 32759319 33048844 33260631 33489086 33762331 34235420 34155015 34472260 34627492 34717115 34965000
5827C4965000K06070j87915N16203o6837Q0909L27932J98700L37455q6050P304
$$ 34965000 35171070 34983155 35499358 35432521 35513430 35841362 36040062 36377517 36291467 36298771
5817C6298771O1743N50418L48637J98294J64942K31593J13359K14719J31568J23976
$$ 36298771 36360514 36910932 37259569 37457863 37622805 37854398 37967757 38182476 38314044 38438020
5807C8438020M26172L36298K88661k5623M1339K31096J9835K15072M73815M18255
$$ 38438020 38864192 39200490 39489151 39463528 39504867 39735963 39755798 39970870 40444685 40862940
5797D0862940K36872M07614K36432K22088K64193M19792N8359K67324q8666O4135
$$ 40862940 41099812 41507426 41743858 41965946 42230139 42649931 42708290 42975614 42886948 42951083
5787D2951083K21625R1395L04846L76594J90707N77887O8157P0262L81014M66404
$$ 42951083 43172708 43264103 43568949 43945543 44136250 44714137 44782294 44852556 45233570 45699974
5777D5699974m9408N05089J98691M98518N40151J07950O20608N65574P73122J007415
$$ 45699974 45650566 46155655 46354346 46852864 47393015 47500965 48121573 48687147 49460269 50467684
5767E0467684P00251L15233j63801J36619J4885J93229J86276p2569O9406K29634
$$ 50467684 51167935 51483168 51319367 51455986 51470871 51664100 51850376 51777807 51847213 52076847
5757E2076847j1838J31032P08303N83863M48445K27702L74970R3110L66693K19858
$$ 52076847 52065009 52196041 52904344 53488207 53936652 54164354 54539324 54632434 54999127 55218985
5747E5218985P10625R42416N67471P49487O32174P26888J217855J051411R29185
$$ 55218985 55929610 56872026 57439497 58188984 58821158 59548046 60765901 61817312 62746497
5738F2746497P46976L57822J53361m8509J24615L93099J14864M97674P23665Q91518
$$ 62746497 63493473 63851295 64004656 63956147 64080762 64473861 64588725 65086399 65810064 66701582
5728F6701582R81631O48541P62165J197875J640030J516147J732592K057969K280130
$$ 66701582 67683213 68331754 69093919 70291794 71931824 73447971 75180563 77238532 79518662
5719G9518662K823206L185867L498555L669748L637832K656596J392850R18209
$$ 79518662 82341868 85527735 89026290 92696038 96333870 98990466 100383316 101301525
5711A01301525r5515q56061j085957r54383r0401r1856N67190J683777J883594
$$ 101301525 101206010 100349949 99263992 98309609 98219208 98127352 98694542 100378319 102261913
5702A02261913K172953K943248M056562M863241N855947O826291Q186167R036252
$$ 102261913 104434866 107378114 111434676 116297917 122153864 128980155 137166322 146202574
5694A46202574Q835467P997927P222934N500736L792683K347319M52255k39762
$$ 146202574 155038041 163035968 170258902 175759638 179552321 181899640 182351895 182112133
5686A82112133j272443k378300l093632l388098l385383l311011k349834q19583
$$ 182112133 180839690 178461390 175367758 171979660 168594277 165283266 162933432 162113849
5678A62113849Q45654K350069M054383O359006Q440752R878930J1437033J1753246
$$ 162113849 162959503 165309572 169363955 175722961 184163713 194042643 205479676 217232922
5670B17232922J2054187J1787217J0086423Q362477N706325K639257j19554k994836
$$ 217232922 229287109 241074326 251160749 259523226 265229551 267868808 267749254 264754418
5662B64754418n676665p751231q918503q930753q609226o997448m787225k064680
$$ 264754418 259077753 251326522 242408019 233477266 224868040 217870592 213083367 211018687
5654B11018687J8144L089206O048376Q864815J2493668J6401686K0257166K4522077
$$ 211018687 211036831 214126037 220174413 229039228 241532896 257934582 278191748 302713825
5646C02713825K7897852K9477933K8285817K3518774J5060761L719639q159457
$$ 302713825 330611677 360089610 388375427 411894201 426954962 430674601 422515144
5639D22515144j7145651k3010197k4199296k1759206j7152066j0900890n363237
$$ 422515144 405369493 382359296 358160000 336400794 319248728 308347838 302984601
5632C02984601o33259K168797J026304k528615o989814j1189911j4008729j4527788
$$ 302984601 302351342 304520139 305546443 303017828 296028014 284838103 270829374 256301586
5624B56301586j3790991j2823806j1746237j0749879r006253p361826n963549
$$ 256301586 242510595 229686789 217940552 207190673 198184420 190822594 184859045
5617A84859045m372070k451523j180785k01115J021360K088434K492507K893500
$$ 184859045 180486975 178035452 176854667 176653552 177674912 179763346 182255853 185149353
5609A85149353K991024L079204K845358L334077M730931O550660Q855575J2102398
$$ 185149353 188140377 191219581 194064939 197399016 202129947 208680607 217536182 229638580
5601B29638580J6531741K2210952L0021248L8683376M4102068M0342187K4085127
$$ 229638580 246170321 268381273 298402521 337085897 381187965 421530152 445615279
5594D45615279K236120j7855588l1059294l6652369l5313209k9845952k3773407
$$ 445615279 447851399 429995811 398936517 362284148 326970939 297124987 273351580
5587B73351580j7427472j2135641q349987n680011k548547N16636L434153P300779
$$ 273351580 255924108 243788467 235438480 229758469 227209922 227726558 231160711 238461490
5579B38461490J1527215J7204877K2556120K4671592K0568712R031466m910097
$$ 238461490 249988705 267193582 289749702 314421294 334990006 344021472 339111375
5572C39111375j6430445k3214526k5169745k3010913j9538098j5133514j1263151
$$ 339111375 322680930 299466404 274296659 251285746 231747648 216614134 205350983
5565B05350983q466035n940771m050858l121743k728735j459119l90281L42470
$$ 205350983 196884948 190944177 186893319 183771576 181042841 179583722 179193441 179535911
5557A79535911N29881O52086M41602P49777J365952K530044L931723N249931P007096
$$ 179535911 180065792 180717878 181159480 181909257 183275209 185805253 189736976 194986907 201994003
5548B01994003Q763414J0213926J1357858J1858688J2244781J3128088J5033922
$$ 201994003 210757417 220971343 232329201 244187889 256432670 269560758 284594680
5541B84594680J7262386J9071622J7208177J1543980K267693q129853j5813795
$$ 284594680 301857066 320928688 338136865 349680845 351948538 343818685 328004890
5534C28004890j9855254k0557198j8974574j5807937j2315437r001307o820269
$$ 328004890 308149636 287592438 268617864 252809927 240494490 231493183 224672914
5527B24672914m964684m123245l555543k553341j532933R4727J991837L797602
$$ 224672914 219708230 215584985 212029442 209476101 207943168 208037895 210029732 213827334
5519B13827334O628205J0757345J5498637K1306266K6127993K6013307J8047777
$$ 213827334 220455539 231212884 246711521 268017787 294145780 320159087 338206864
5512C38206864L935279j0625598k1273275k5854316k5753137k2701539j8639702
$$ 338206864 342142143 331516545 310243270 284388954 258635817 235934278 217294576
5505B17294576j4218519j0679124q203275o387185m855833k895303j665277K45316
$$ 217294576 203076057 192396933 184193658 177806473 172950640 170055337 168390060 168635376
5497A68635376K170072M402744O822699J0562208J5000091J6840707J3625704
$$ 168635376 170805448 175208192 182030891 192593099 207593190 224433897 238059601
5490B38059601N803681l672647j0810946j5300900j5832879j4028235j1144665
$$ 238059601 243863282 240190635 229379689 214078789 198245910 184217675 173073010
5483A73073010q439115o030602m612205l753865k588910k272369j555774r50400
$$ 173073010 164633895 158603293 153991088 150237223 147648313 145375944 143820170 142869770
5475A42869770k55433K65968P82671J428140K640528L872724N770741O690477
$$ 142869770 142614337 142880305 143662976 145091116 147731644 151604368 157375109 164065586
5467A64065586O867527N155889K411225r40273m114356o176816o560105o696876
$$ 164065586 170933113 176089002 178500227 177559954 173445598 167268782 160708677 154011801
5459A54011801n797394n491853n124953m999495m940640m122857l450820k928127
$$ 154011801 148214407 142722554 137597601 132598106 127657466 123534609 120083789 117155662
5451A17155662k618161j867864j706334j272990m41855k68246o6326j69208K80373
$$ 117155662 114537501 112669637 110963303 109690313 109248458 108980212 108913886 108744678 109025051
5442A09025051M83474k46553n54355r68287p33323j103003j360814o94529n71687
$$ 109025051 109508525 109261972 108707617 107739330 107006007 105903004 104542190 103847661 103275974
5433A03275974j29863m41879q92235j511629j611953j853692k240077j807625
$$ 103275974 103146111 102704232 101811997 100300368 98688415 96834723 94594646 92787021
5425I2787021j607282j546102j413531m34274m41811q60426n82631j25111k73068
$$ 92787021 91179739 89633637 88220106 87785832 87344021 86483595 85900964 85775853 85502785
5416H5502785J8114J70619r241l94881r73271q17586m27552p0753m03492P4846
$$ 85502785 85520899 85691518 85682277 85287396 84314125 83496539 83068987 82998234 82594742 82669588
5406H2669588M07319J762r01771j163031j070285j540660j160141j084578j054011
$$ 82669588 83076907 83078669 82176898 81013867 79943582 78402922 77242781 76158203 75104192
5397G5104192j035126j021339q44036q79683o57435m99491k25247o04430o60909
$$ 75104192 74069066 73047727 72203691 71324008 70666573 70167082 69941835 69337405 68676496
5388F8676496n27170o73626m40784j38222j86379j92214n60772m67489m78063
$$ 68676496 68149326 67475700 67034916 66896694 66710315 66518101 65957329 65489840 65011777
5379F5011777m01343m21815m66434K9886n82612n00057k99152m32347o38713m24831
$$ 65011777 64610434 64188619 63722185 63752071 63169459 62669402 62370250 61937903 61299190 60874359
5369F0874359l43190m43219p9861j82820n15329n04238l06495j5413q1086k46086
$$ 60874359 60531169 60087950 60008089 59825269 59309940 58805702 58499207 58483794 58402708 58156622
5359E8156622n42264j35273l54077j90646j48269o81248m18572m65610m96338
$$ 58156622 57614358 57479085 57125008 56934362 56786093 56104845 55686273 55220663 54724325
5350E4724325k04312k77548J2307k02145l87269m88761l33789k63609m39011l9765
$$ 54724325 54520013 54242465 54254772 54052627 53665358 53176597 52842808 52579199 52140188 52100423
5340E2100423l75107l34580k30792l05294r7669k30944j63370k17851j89105m23964
$$ 52100423 51725316 51390736 51159944 50854650 50756981 50526037 50362667 50144816 49955711 49531747
5330D9531747k98616m16587j28282j32311o14924m31753k97221m48348k82501
$$ 49531747 49233131 48816544 48688262 48555951 47941027 47509274 47212053 46763705 46481204
5321D6481204m15353r6448l70018o9466p6852q274l50750n0284l59087j81539
$$ 46481204 46065851 45969403 45599385 45529919 45453067 45444793 45094043 45043759 44684672 44503133
5311D4503133k1729l15657j86187o17573l1279k54223l40862n4132q2427m18700
$$ 44503133 44481404 44165747 43979560 43361987 43330708 43076485 42735623 42681491 42599064 42180364
5301D2180364k48694m37343l02971l69975l25057j97514n8474k81875p2200l77508
$$ 42180364 41931670 41494327 41191356 40821381 40496324 40298810 40240336 39958461 39886261 39508753
5291C9508753k23807l50098o60071L3658J25021j96093k83583j99044k7660j06908
$$ 39508753 39284946 38934848 38274777 38308435 38433456 38237363 37953780 37754736 37727076 37620168
5281C7620168k06866l01245l69573k29411j44768k10128o9719j94704n06810J2726
$$ 37620168 37413302 37112057 36742484 36513073 36368305 36158177 36088458 35893754 35386944 35399670
5271C5399670J5902l44829j50562j84652l25759j15732k04685n04641j99325j05714
$$ 35399670 35415572 35070743 34920181 34735529 34409770 34294038 34089353 33584712 33385387 33279673
5261C3279673K60089M6389k30778o2209k09104j18290J14468O9166K40657k32024
$$ 33279673 33539762 33586151 33355373 33293164 33084060 32965770 33080238 33149404 33390061 33158037
5251C3158037m10849n05023k30345j76335l01009k62832j25443j79483k02817
$$ 33158037 32747188 32242165 32011820 31835485 31534476 31271644 31146201 30966718 30763901
5242C0763901j99661l23340r4639j06348k9681j0054l38787j01807N8480j99230
$$ 30763901 30564240 30240900 30146261 30039913 30010232 30000178 29661391 29559584 29618064 29418834
5232B9418834O8405K1531k20511j42762j49444l03392m63391l14442j18516k3664
$$ 29418834 29487239 29508770 29288259 29145497 28996053 28692661 28229270 27914828 27796312 27772648
5222B7772648n1285j13548k75971l79600k06773J5497j28972k15806J7899k92265
$$ 27772648 27721363 27607815 27331844 26952244 26745471 26760968 26631996 26416190 26434089 26141824
5212B6141824o0317O8901j08384k14731j39208k19393l68585j17835M768J86389
$$ 26141824 26081507 26150408 26042024 25827293 25688085 25468692 25100107 24982272 24987040 25173429
5202B5173429P4988j9719P4210J47096o0414r2465j7861m26473k46522Q2811k65825
$$ 25173429 25248417 25228698 25302908 25450004 25389590 25297125 25279264 24852791 24606269 24689080 24423255
5191B4423255l27714l00969J05000j07359k22442q8449Q8348l26733l92898M9051
$$ 24423255 24095541 23794572 23899572 23792213 23569771 23481322 23569670 23242937 22850039 22899090
5181B2899090k52015m1038J54552j14181j96022j72985l32428J87150K37618J04308
$$ 22899090 22647075 22606037 22760589 22646408 22450386 22277401 21944973 22132123 22369741 22474049
5171B2474049J9362r334j71417j73409k83784k33283l60242k14422j03202O2325
$$ 22474049 22493411 22484077 22312660 22139251 21855467 21622184 21261942 21047520 20944318 21006643
5161B1006643j05124j90518l6983l43532J97624o5723k40222m394j44203p1677
$$ 21006643 20901519 20711001 20674018 20330486 20528110 20462387 20222165 20217771 20073568 20001891
5151B0001891j58417j32169J80998J00691l54104m9015l7981J27720l10713j35379
$$ 20001891 19843474 19711305 19892303 19992994 19638890 19589875 19551894 19679614 19368901 19233522
5141A9233522L2821j29156j76330l03998j15522l10957Q4866J01365M0915k37816
$$ 19233522 19266343 19137187 18960857 18656859 18541337 18230380 18315246 18416611 18457526 18219710
5131A8219710j20176O3713n4963n5311n1212q7097k14091k13468J47191N7282
$$ 18219710 18099534 18163247 18108284 18052973 18001761 17914664 17700573 17487105 17634296 17691578
5121A7691578J07374O4264k15513o4268j14855N3152j97765l35634k72809K58588
$$ 17691578 17798952 17863216 17647703 17583435 17468580 17521732 17323967 16988333 16715524 16974112
5111A6974112k02408k45566j87679J02290l29936J8205K98512k50723m5113J02788
$$ 16974112 16771704 16526138 16338459 16440749 16110813 16129018 16427530 16176807 16131694 16234482
5101A6234482j70437j01460k34729j46487L0160K0158J30204r4779j1783j93989
$$ 16234482 16064045 15962585 15727856 15581369 15611529 15631687 15761891 15667112 15655329 15461340
5091A5461340m9985l31555k64831m8834J99783P9728k64773m4577n6376J87878
$$ 15461340 15411355 15079800 14814969 14766135 14965918 15045646 14780873 14736296 14679920 14867798
5081A4867798q1433k02008r7727O3355j66040K7145L25092j89264R0651K6838
$$ 14867798 14786365 14584357 14486630 14549985 14383945 14411090 14736182 14546918 14637569 14664407
5071A4664407l1244Q092j2442r0636J63314k6313m56777k46097N3055k361k1103
$$ 14664407 14633163 14641255 14628813 14538177 14701491 14675178 14218401 13972304 14025359 14022998 14001895
5060A4001895r9810J74372N4606k73056j84196m1J47484K7207j90183J68161M4699
$$ 14001895 13902085 14076457 14131063 13858007 13673811 13673770 13821254 13848461 13658278 13826439 13871138
5049A3871138j32107l61203k47167p2072L70409J46929j5117j72394K0140p7701
$$ 13871138 13739031 13377828 13130661 13058589 13428998 13575927 13560810 13388416 13408556 13330855
5039A3330855P6285K3052j03263r3297K09569l7178k63312K0730q1163j28083
$$ 13330855 13407140 13430192 13326929 13233632 13443201 13406023 13142711 13163441 13082278 12954195
5029A2954195P4594p2871l38972k60474n2845J71007l9719L50059k24129J33294
$$ 12954195 13028789 12955918 12616946 12356472 12303627 12474634 12434915 12784974 12560845 12694139
5019A2694139O7436k39311K04183K58400j85663r2731L47832r8912K3472J33537
$$ 12694139 12761575 12522264 12726447 12984847 12799184 12706453 13054285 12955373 12978845 13112382
5009A3112382k94099M8790K64141O801j46008j68187L8569j09572j28291k2593
$$ 13112382 12818283 12867073 13131214 13138015 12992007 12823820 12862389 12752817 12624526 12601933
4999A2601933o4368j60711l5067L00161l18156j31435K00545J03872k63779j5005
$$ 12601933 12537565 12376854 12341787 12641948 12323792 12192357 12392902 12496774 12232995 12217990
4989A2217990J30890j3296j15552m6776O3825Q1559o0834k02330j19180j60189
$$ 12217990 12348880 12335584 12220032 12173256 12237081 12318640 12257806 12055476 11936296 11776107
4979A1776107J40982k08894j0095j40098m4555m7046j8923J04558j40020K96341
$$ 11776107 11917089 11708195 11698100 11558002 11513447 11466401 11447478 11552036 11412016 11708357
4969A1708357j42736k22096r4029P9172j04615J19877M31057N8818p7724J3425
$$ 11708357 11565621 11343525 11249496 11328668 11224053 11343930 11774987 11833805 11756081 11769506
4959A1769506J25299j01843j40484m1009K48163N6548r8022O1583L41663J00644
$$ 11769506 11894805 11792962 11652478 11611469 11859632 11916180 11818158 11879741 12221404 12322048
4949A2322048k08081m8135K12049M16035N88402O56041Q32016J449644J922101
$$ 12322048 12113967 12065832 12277881 12693916 13282318 13938359 14770375 16220019 18142120
4940A8142120J497021O10800j32562q47020j710270j435353j191346p87825o86916
$$ 18142120 19639141 20249941 20117379 19270359 17560089 16124736 14933390 14145565 13458649
4931A3458649m22073O43l02652l61292j51006k24831m16016m20711j832m9736
$$ 13458649 13036576 13037219 12734567 12373275 12222269 11997438 11581422 11160711 11158879 11109143
4921A1109143k01467j5297j88884N1075M5419J12382p5457o2339K78008m2187
$$ 11109143 10907676 10892379 10703495 10754570 10799989 10912371 10836914 10774575 11052583 11010396
4911A1010396q0730j31323j84713N1232L5158K18007J28959K2574J18709J3798
$$ 11010396 10929666 10798343 10613630 10664862 10700020 10918027 11046986 11069560 11188269 11202067
4901A1202067j80023O9771J31057k0854l74528o938Q9565K2049p1934j47932J42305
$$ 11202067 11022044 11091815 11222872 11202018 10827490 10820552 10910117 10932166 10860232 10712300 10854605
4890A0854605J8182k70560m22146K08817J23927M5080k98651m793K24817l60978
$$ 10854605 10872787 10602227 10180081 10388898 10512825 10557905 10259254 10254461 10479278 10118300
4880A0118300L13231P700j15770l09739J25353N7224Q0440N3240J10428k56100
$$ 10118300 10431531 10439231 10323461 10013722 10139075 10196299 10276739 10329979 10440407 10184307
4870A0184307j25504o9124K37277R9660P2288p4295k0477j2680M4379k44322J18611
$$ 10184307 10058803 9989679 10226956 10326616 10398904 10324609 10304132 10291452 10335831 10091509 10210120
4859A0210120L22992j63506K6564o6892M0980J13452K96175j68931m4954j86692
$$ 10210120 10533112 10369606 10396170 10329278 10370258 10483710 10779885 10610954 10566000 10379308
4849A0379308M5155K7619K62164K62772K2176J8490K30168K4241l65573P6099
$$ 10379308 10424463 10452082 10714246 10977018 10999194 11017684 11247852 11272093 10906520 10982619
4839A0982619N4758J51431L27982j74521k64495O7108J74591M2791N71396L1874
$$ 10982619 11037377 11188808 11516790 11342269 11077774 11144882 11319473 11362264 11933660 11965534
4829A1965534j00834o9726J62206J98334o5635K95403O8950k22982J42850K08515
$$ 11965534 11864700 11794974 11957180 12155514 12089879 12385282 12454232 12231250 12374100 12582615
4819A2582615L13157j05619K4171J26487K68496K11865L30242J11240l1285n3561
$$ 12582615 12895772 12790153 12814324 12940811 13209307 13421172 13751414 13862654 13831369 13777808
4809A3777808R8388K47561M51501M58059J60140N73640O30930M13188L42617P59135
$$ 13777808 13876196 14123757 14575258 15033317 15193457 15767097 16398027 16811215 17153832 17912967
4799A7912967R59297J472459J704935J685961J583638Q57404K17766p73851j070392
$$ 17912967 18872264 20344723 22049658 23735619 25319257 26176661 26394427 25620576 24550184
4790B4550184j159696p57098m53624r6561k5863J78904P18123M27438L06413O10871
$$ 24550184 23390488 22633390 22179766 22083205 22057342 22236246 22954369 23381807 23688220 24299091
4780B4299091P25994Q24841R52180J107593J617309J743556J932035K674809K933567
$$ 24299091 25025085 25849926 26802106 27909699 29527008 31270564 33202599 35877408 38810975
4771C8810975L513041L727816L881292M662692N052913O041859P148504P573234
$$ 38810975 42324016 46051832 49933124 54595816 59648729 65690588 72839092 80412326
4763H0412326O651770L879156Q06533j867032m037153m330530m089694k887147
$$ 80412326 87064096 90943252 91749785 89882753 85845600 81515070 77425376 74538229
4755G4538229j602186n73007K83461Q54502J107613O33515j46728n6990L20296
$$ 74538229 72936043 72363036 72646497 73500999 74608612 75242127 75095399 75038409 75358705
4746G5358705N85285K061005L738691N363748N974453N978573L989309N73935
$$ 75358705 75943990 78004995 81743686 87107434 93081887 99060460 103049769 103623704
4738A03623704k352592m365217n367696n560879m435350l866205k929362k336832
$$ 103623704 101271112 96905895 91538199 85977320 81541970 77675765 74746403 72409571
4730G2409571j849343j743450j103191o51841j5666O74815J136995J677615K776978
$$ 72409571 70560228 68816778 67713587 67061746 67046080 67720895 68857890 70535505 73312483
4721G3312483L826405N146605N796119P294119Q966246J0976662J3886705J7025690
$$ 73312483 77138888 82285493 88081612 95375731 104341977 115318639 129205344 146231034
4713A46231034K1200806K4964828K7832324K6375510J9876829R582273k225922
$$ 146231034 167431840 192396668 220228992 246604502 266481331 276063604 273837682
4706B73837682j1292560j7853154k0269815j9734117j7726771j4468098j1523610
$$ 273837682 262545122 244691968 224422153 204688036 186961265 172493167 160969557
4699A60969557p782148n273658k285870K24957K673106N171906P627331J0915856
$$ 160969557 153187409 147913751 145627881 145852838 148525944 153697850 161325181 172241037
4691A72241037J4744029J8268873K1149897K1347921J6387824P041330l212182
$$ 172241037 186985066 205253939 226403836 247751757 264139581 271180911 267968729
4684B67968729j2572911j8566270k0637284k0436532j8010618j4466393j1308857
$$ 267968729 255395818 236829548 216192264 195755732 177745114 163278721 151969864
4677A51969864r110075p348895n849591l756173k446401j137671M44949J901161
$$ 151969864 142859789 135510894 129661303 125905130 123458729 122321058 122766007 124667168
4669A24667168L490310N319460O524106P250637Q451542R866162J1510578J3494751
$$ 124667168 128157478 133476938 140001044 147251681 155703223 165569385 177079963 190574714
4661A90574714J5072086J5799062J3858823Q648578J568394n726337j1454585
$$ 190574714 205646800 221445862 235304685 243953263 245521657 239795320 228340735
4654B28340735j4513819j4836238j3094857j0865403q909015o020274l776681
$$ 228340735 213826916 198990678 185895821 175030418 166121403 160101129 156324448
4647A56324448k298812j299426p27980j664N52899K15643j15216l54056q00407
$$ 156324448 154025636 152726210 151998230 151996566 152549465 152765108 152649892 152295836 151495429
4638A51495429n44931J74829J913592M143279P013304J0615809J4626633J8187499
$$ 151495429 150950498 151125327 153038919 157182198 164195502 174811311 189437944 207625443
4630B07625443K0004264J9520998J6787681J3706633N956316p930149j6895513
$$ 207625443 227629707 247150705 263938386 277645019 283601335 275671186 258775673
4623B58775673k2515736k4604050k2275806j8897395j5656444j2571245r478231
$$ 258775673 236259937 211655887 189380081 170482686 154826242 142254997 132776766
4616A32776766p371624m927393l031355j536738Q11487L307469O109030R667817
$$ 132776766 125405142 120477749 117446394 115909656 116721143 120028612 126137642 135805459
4608A35805459J2173501J4044727J3654198J1271187P441698L319944J267933
$$ 135805459 147978960 162023687 175677885 186949072 194390770 197710714 198978647
4601A98978647O25903J222949J756771k90286k707584m548925m951099k738299
$$ 198978647 199604550 200827499 202584270 202293984 199586400 195037475 190086376 187348077
4593A87348077J598395N562457P677676N955800J264912m335632p190366p465475
$$ 187348077 188946472 194508929 202186605 208142405 209407317 205071685 197881319 190415844
4585A90415844n997114j708480K048531L375713K084419P5445j629626j928484
$$ 190415844 184418730 182710250 184758781 188134494 190218913 190294358 188664732 186736248
4577A86736248q50933o86770j553810m387078r004237j2540304j4919239j5984718
$$ 186736248 185885315 185198545 183644735 179257657 170253420 157713116 142793877 126809159
4569A26809159j4883554j2914974j0839884q671086o889608n898855m338490l724170
$$ 126809159 111925605 99010631 88170747 79499661 72610053 66711198 62372708 58648538
4561E8648538l393220l013721k183298j844029j870790j740845j705515j624803
$$ 58648538 55255318 52241597 50058299 48214270 46343480 44602635 42897120 41272317
4553D1272317j029489q06208r25791p22116k83247p67292j090618l77543m35153
$$ 41272317 40242828 39436620 38510829 37788713 37505466 36738174 35647556 35270013 34834860
4544C4834860n83628l77613p10654m61904k0093m96311m75198l44144l15479k31572
$$ 34834860 34251232 33873619 33162965 32701061 32680968 32184657 31709459 31365315 31049836 30818264
4534C0818264L1807k31290j18750j53621l17024k51110o925j69359q963K87769
$$ 30818264 30850071 30618781 30500031 30346410 30029386 29778276 29771351 29601992 29593029 29880798
4524B9880798L56118N00471L51983L69488N31430P48582P10626O09127J311235
$$ 29880798 30236916 30737387 31089370 31458858 31990288 32738870 33449496 34058623 35369858
4515C5369858J481720J801523K136013K269183K827629L300201L103228L086583
$$ 35369858 36851578 38653101 40789114 43058297 45885926 49186127 52289355 55375938
4507E5375938K726799J722418R44873L67734l79899n15270n54624n5318L85777
$$ 55375938 58102737 59825155 60770028 61137762 60757863 60242593 59687969 59632651 60018428
4498F0018428J046003J972921K929875L358961M102855M551753M350521L834897
$$ 60018428 61064431 63037352 65967227 69326188 73429043 77980796 82331317 86166214
4490H6166214K853298J283201k26319j475734k404884k394145k682348k434573
$$ 86166214 89019512 90302713 90076394 88600660 86195776 83801631 81119283 78684710
4482G8684710k187606j274116n10231k71686L11505J124580J578014J834077J622178
$$ 78684710 76497104 75222988 74712757 74441071 74752576 75877156 77455170 79289247 80911425
4473H0911425J107908Q39592P96433N62266J046167J827837K879282L972470M877501
$$ 80911425 82019333 82858925 83655358 84217624 85263791 87091628 89970910 93943380 98820881
4464I8820881O127149O132128N155144L769497J542750l99586k224070k778853
$$ 98820881 104948030 111080158 116235302 120004799 121547549 121147963 118923893 116145040
4456A16145040k427218j798852k15000J441846L317198N024776O934297Q314922
$$ 116145040 113717822 111918970 111703970 113145816 116463014 121487790 128422087 136737009
4448A36737009R180082R261121Q063720N050294J507663j875933n084875p339144
$$ 136737009 145917091 155178212 163241932 168292226 169799889 167923956 162839081 155499937
4440A55499937q196970q274390p446554n926136m685271l502853j637178l29871
$$ 155499937 147302967 139028577 131582023 125655887 120970616 117467763 115830585 115500714
4432A15500714M60928Q95092O21984J41645r98907k515701l181844l752594l898179
$$ 115500714 115961642 116856734 117478718 117620363 116621456 114105755 110923911 107171317 103273138
4423A03273138l498598k750252j783760j268741j73668P29198P59048L04834q51621
$$ 103273138 99774540 97024288 95240528 93971787 93798119 94527317 95286365 95591199 94739578
4414I4739578j905049k582292k937191l170928k324976j382989j88738Q21357
$$ 94739578 92834529 90252237 87315046 84144118 81819142 80436153 80247415 81068772
4406H1068772K233341L265853M084254M751639M294983L693549J658225j10944
$$ 81068772 83302113 86567966 90652220 95403859 99698842 103392391 105050616 104939672
4398A04939672k742564m401198n497355n981676n295196m786832l849310l033492
$$ 104939672 102197108 97795910 92298555 86316879 81021683 76234851 72385541 69352049
4390F9352049k183183j209247q49622n26416l0106l44390j333146j718902k650204
$$ 69352049 67168866 65959619 65109997 64583581 64553475 64209085 62875939 61157037 58506833
4381E8506833l300972l210893l613331l773127l359262k817095l053943k543503
$$ 58506833 55205861 51994968 48381637 44608510 41249248 38432153 35378210 32834707
4373C2834707k142435j931552j441579j398766j423828j018919r90884r88065
$$ 32834707 30692272 28760720 27319141 25920375 24496547 23477628 22486744 21498679
4365B1498679p86631p62892l97224p08962p08360n07249l78551n75261k48081
$$ 21498679 20712048 19949156 19551932 18842970 18134610 17627361 17248810 16673549 16425468
4356A6425468r1531k42724k04046m26473m60271m33740n50962k21696k40455j67427
$$ 16425468 16333937 16091213 15887167 15460694 15000423 14566683 14015721 13794025 13553570 13386143
4346A3386143n34120j92736k54520l27429l64617o2977R2913j45523j12383m77486
$$ 13386143 12852023 12659287 12404767 12077338 11712721 11649744 11742657 11597134 11484751 11007265
4336A1007265j42437l4510k37486M7840K28015l84776j05670J61057k88321j95901
$$ 11007265 10864828 10830318 10592832 10640672 10868687 10483911 10378241 10539298 10250977 10055076
4326A0055076l75494l04148L1149J66023k48124k74610k16199j53541n1938Q55
$$ 10055076 9679582 9375434 9406583 9572606 9324482 9049872 8833673 8680132 8628194 8629049
4316H629049N4612P7899k55406j28550l02691j03643k54415J6561L3520j95102
$$ 8629049 8683661 8761560 8506154 8377604 8074913 7971270 7716855 7733416 7766936 7571834
4306G571834j26470m8830k26650K55283j87204k01399K79779J10631j47810K3664
$$ 7571834 7445364 7396534 7169884 7425167 7237963 7036564 7316343 7426974 7279164 7302828
4296G302828N1146l29196J12056k06430l4395o9045M4801Q6938j7258l22045J52811
$$ 7302828 7353974 7024778 7136834 6930404 6896009 6826964 6871765 6958703 6941445 6619400 6772211
4285F772211k43726j63069K51872Q7664j35408K40616J53702l835k83820p232
$$ 6772211 6528485 6365416 6617288 6704952 6569544 6810160 6963862 6960027 6676207 6668975
4275F668975M1380J32298N8104n9563j55130o8478n2641K10541j52105j01667
$$ 6668975 6710355 6842653 6900757 6841194 6686064 6617586 6564945 6775486 6623381 6521714
4265F521714j30768J77837k7302j69866j75598l9465J13757K62550j93888k91674
$$ 6521714 6390946 6568783 6541481 6371615 6196017 6156552 6270309 6532859 6338971 6047297
4255F047297o5168p6823q6033R4640J29358J14942k3980o6320m35020j86338l4150
$$ 6047297 5982129 5905306 5819273 5913913 6043271 6158213 6134233 6067913 5632893 5446555 5412405
4244E412405m9238J41319o9478k272J90643M6120j05733m5891J12424k62734K1216
$$ 5412405 5363167 5504486 5435008 5432736 5623379 5669499 5563766 5517875 5630299 5367565 5388781
4233E388781N2977m02864K11886J92966J59399J9295j38822q5968K31366q5105
$$ 5388781 5441758 5038894 5250780 5443746 5603145 5622440 5483618 5397650 5629016 5543911
4223E543911K23655n9237m6587j21020l687J27956j01409P2268k9075K8869J73420
$$ 5543911 5767566 5708329 5661742 5540722 5537035 5664991 5563582 5635850 5606775 5635644 5809064
4212E809064j73560Q3323J47296j49256k40295M09594k08485K36923K63689l5804
$$ 5809064 5635504 5718827 5866123 5716867 5476572 5886166 5677681 5914604 6178293 6142489
4202F142489J48752l06181k826K47073k50545j48116K15387k5483P5410k55271
$$ 6142489 6291241 5985060 5982234 6229307 5978762 5830646 6046033 6020550 6095960 5840689
4192E840689o2219J10811n5063N9419j04732j22729r0096K66193L0908l07137
$$ 5840689 5778470 5889281 5834218 5893637 5788905 5666176 5576080 5842273 5873181 5566044
4182E566044r0868J11120Q3202n6575L0125j6285J90255k746k34435q1048j52361
$$ 5566044 5475176 5586296 5669498 5612923 5643048 5626763 5817018 5814272 5579837 5498789 5346428
4171E346428P9809R0516j10464k3450K14909P4300j08419L97659o411O2663K08847
$$ 5346428 5426237 5516753 5406289 5382839 5597748 5672048 5563629 5961288 5954877 6017540 6226387
4160F226387J41668j65769l26072J06511j99132J49698k01348n5289K58968o2562
$$ 6226387 6368055 6202286 5876214 5982725 5783593 5933291 5731943 5676654 5935622 5873060
4150E873060Q7380K15102J29584P1791j26496K56473J34116l34693k07052K64868
$$ 5873060 5960440 6175542 6305126 6376917 6250421 6506894 6641010 6306317 6099265 6364133
4140F364133J35162l09698J03311K71331j07857j23762N2793K65409J00470M1854
$$ 6364133 6499295 6189597 6292908 6564239 6456382 6332620 6385413 6650822 6751292 6793146
4130F793146q4795L5643m55709K95626K94320l03905J54769K9016m7813j06910
$$ 6793146 6708351 6743994 6288285 6583911 6878231 6574326 6729095 6758111 6710298 6603388
4120F603388J49197n080P2265K81281J63696j11888k62430k9064P9699K25647
$$ 6603388 6752585 6747505 6819770 7101051 7264747 7152859 6890429 6861365 6941064 7166711
4110G166711N7448N6960M0687K13760J1144P160j5992M2701L40830o9122Q7299
$$ 7166711 7224159 7281119 7321806 7535566 7546710 7553870 7537878 7580579 7921409 7852287 7939586
4099G939586J97883m558o5716j80357j37463K77269J46002J21908P0053R5543
$$ 7939586 8137469 8132911 8067195 7886838 7749375 8026644 8172646 8294554 8364607 8460150
4089H460150K25307J07349L77738K04900l25772J18936L02268J46806M4302J28437
$$ 8460150 8685457 8792806 9170544 9375444 9049672 9168608 9470876 9617682 9661984 9790421
4079I790421m2187L38932L45026J46351j37115K64409L33187J08692n5506L480
$$ 9790421 9748234 10087166 10432192 10578543 10441428 10705837 11039024 11147716 11092210 11095690
4069A1095690K83912M78752K26420K14988N3L15001M5320K5482M61061J19448
$$ 11095690 11379602 11858354 12084774 12299762 12299815 12614816 12660136 12685618 13146679 13266127
4059A3266127j90047m2561L14877K78308j17326R3793L64896K75707L22886r8699
$$ 13266127 13076080 13033519 13348396 13626704 13509378 13603171 13968067 14243774 14566660 14467961
4049A4467961k3420L18041K11485L9762J03092M63733L80168L29145K43091K41697
$$ 14467961 14444541 14762582 14974067 15013829 15116921 15580654 15960822 16289967 16533058 16774755
4039A6774755O58370L66025J94567O93983L22534K53245L62316N18946O56432
$$ 16774755 17433125 17799150 17993717 18687700 19010234 19263479 19625795 20144741 20801173
4030B0801173K04764K56309N71775O02349P04382R68659Q71253J007363P33330
$$ 20801173 21005937 21262246 21834021 22436370 23140752 24109411 24980664 25988027 26721357
4021B6721357P41299N10964O66665Q97196M82420M78689R05667Q62597P23640
$$ 26721357 27462656 27973620 28640285 29537481 30019901 30498590 31404257 32266854 32990494
4012C2990494R13305Q29681J105841J527062J530516J854394J929634K103770
$$ 32990494 33903799 34733480 35839321 37366383 38896899 40751293 42680927 44784697
4004D4784697K328702K143613K795678K874485L164018L487597L878122M439802
$$ 44784697 47113399 49257012 52052690 54927175 58091193 61578790 65456912 69896714
3996F9896714M788106M746277N466886N985946O009348O247597O351113O875452
$$ 69896714 74684820 79431097 84897983 90883929 96893277 103140874 109491987 116367439
3988A16367439P298170P666038P819747Q068381Q184449P840051P713399Q123748
$$ 116367439 123665609 131331647 139151394 147219775 155404224 163244275 170957674 179081422
3980A79081422P561971O927735O432395N678406N138703N076778L963865L990471
$$ 179081422 186643393 193571128 200003523 205681929 210820632 215897410 219861275 223851746
3972B23851746L857722L520923L551698L288341L186557L049962K702161J823845
$$ 223851746 227709468 231230391 234782089 238070430 241256987 244306949 247009110 248832955
3964B48832955P91989m64667j835855k742310l431276l807511m182752m380529
$$ 248832955 249624944 249160277 247324422 244582112 241150836 237343325 233160573 228780044
3956B28780044m125988m115996l880061l344870k973547k470910j861655j842764
$$ 228780044 224654056 220538060 216657999 213313129 210339582 207868672 206007017 204164253
3948B04164253j391451j373018j217597r60382p24205n10747m38681m4234J83112
$$ 204164253 202772802 201399784 200182187 199221805 198497600 197986853 197548172 197503938 197687050
3939A97687050N21793R19588J316496J176265J640981J935462J949586K315208
$$ 197687050 198208843 199128431 200444927 201621192 203262173 205197635 207147221 209462429
3931B09462429K569465K992163K989875L437178L948732M144598M704237L921760
$$ 209462429 212031894 215024057 218013932 221451110 225399842 229544440 234248677 238170437
3923B38170437L846214L835387M068643L720325L291177L334683K859057K790271
$$ 238170437 242016651 245852038 249920681 253641006 256932183 260266866 263125923 265916194
3915B65916194K413444J812605K199927J516496Q67882P23202K87038p55612j643694
$$ 265916194 268329638 270142243 272342170 273858666 274726548 275449750 275736788 274981176 273337482
3906B73337482k346625l019929l627524m685447m954957n081458n487881n655371
$$ 273337482 270990857 267970928 264343404 259657957 254703000 249621542 244133661 238478290
3898B38478290n422005n103579m919712m625803m638282m640134m383462m398114
$$ 238478290 233056285 227952706 223032994 218407191 213768909 209128775 204745313 200347199
3890B00347199m209741m610388m574599m201489m460843m295991m118912l579182
$$ 200347199 196137458 191527070 186952471 182750982 178290139 173994148 169875236 166296054
3882A66296054l348641l073030l007667k823616k751683k509053j710748j337130
$$ 166296054 162947413 159874383 156866716 154043100 151291417 148782364 147071616 145734486
3874A45734486n22950k33299N67975J254850J871471K119501K895959L306459
$$ 145734486 145211536 144978237 145546212 146801062 148672533 150792034 153687993 156994452
3866A56994452L229840L260869L131159L159854L012260K395382K438570J995939
$$ 156994452 160224292 163485161 166616320 169776174 172788434 175183816 177622386 179618325
3858A79618325J844806J638242J232925J118452J266956J970754K235280J917557
$$ 179618325 181463131 183101373 184334298 185452750 186719706 188690460 190925740 192843297
3850A92843297K412697K318018J834978J467437R59229L67623P02700M36001L63247
$$ 192843297 195255994 197574012 199408990 200876427 201835656 202203279 202905979 203341980 203705227
3841B03705227P38862R86114R90620O81892J010610J089808O29978P68846M17185
$$ 203705227 204444089 205430203 206420823 207102715 208113325 209203133 209833111 210601957 211019142
3832B11019142M14894M59731R74260R30035R07219J365849J118622J088589J449832
$$ 211019142 211434036 211893767 212868027 213798062 214705281 216071130 217189752 218278341 219728173
3823B19728173J726804J882068K058699K571519L274390L188556L793031M188540
$$ 219728173 221454977 223337045 225395744 227967263 231241653 234430209 238223240 242411780
3815B42411780M175822M138976M514898N042772N675801N613342N763377N945119
$$ 242411780 246587602 250726578 255241476 260284248 265960049 271573391 277336768 283281887
3807B83281887N804677N565005M722402M146792L095732K383096J620582P23427
$$ 283281887 289086564 294651569 299373971 303520763 306616495 308999591 310620173 311343600
3799C11343600K14722k59402o31130j116021o72750r63503q29287m81566q51443
$$ 311343600 311558322 311298920 310667790 309551769 308879019 307915516 307086229 306604663 305753220
3790C05753220j490040k574836l898842m975633o343720p503723p864727q850853
$$ 305753220 304263180 301688344 297789502 292813869 286470149 278966426 271101699 262250846
3782B62250846q987454q495740p959642p421831o709803n707010n714443n162511
$$ 262250846 253263392 244767652 236808010 229386179 222676376 216969366 211254923 206092412
3774B06092412n010915m659513m960588m749684m538688m865784m447012m047539
$$ 206092412 201081497 196421984 191461396 186711712 182173024 177307240 172860228 168812689
3766A68812689l869680l865406l596579l171013k632965j916278j830264j249929
$$ 168812689 164943009 161077603 157481024 154310011 151677046 149760768 147930504 146680575
3758A46680575j37347k7975M65610P45884J231913J930788K090046K280665J683071
$$ 146680575 146543228 146515253 146980863 147726747 148958660 150889448 152979494 155260159 156943230
3749A56943230J846946K043159K491533K516363K432420K968200K437628J822623
$$ 156943230 158790176 160833335 163324868 165841231 168273651 171241851 173679479 175502102
3741A75502102J757926J129530Q61653K16947k54637o20351r43905n09015l17756
$$ 175502102 177260028 178389558 179251211 179468158 179213521 178593170 177649265 177140250 176822494
3732A76822494m00653m14344k54993l30444o74279o79397q33128j168537j740617
$$ 176822494 176421841 176007497 175752504 175422060 174747781 174068384 173235256 172066719 170326102
3723A70326102j719454k014681k337355k785397k777695k046111k157579k001317
$$ 170326102 168606648 166591967 164254612 161469215 158691520 156645409 154487830 152486513
3715A52486513k037449k098631j761376j312871q75028m40900j40855k74081j03692
$$ 152486513 150449064 148350433 146589057 145276186 144401158 143960258 143819403 143545322 143441630
3706A43441630k9709o0945k77826j75465q5648m42680m60412j018759j499975
$$ 143441630 143411921 143350976 143073150 142897685 142812037 142369357 141908945 140890186 139390211
3697A39390211j938353j907902j876876j544054j934088j657651j601783j092474
$$ 139390211 137451858 135543956 133667080 132123026 130188938 128531287 126929504 125837030
3689A25837030j177040j214214j050237j002260j134422j019034j091369j250426
$$ 125837030 124659990 123445776 122395539 121393279 120258857 119239823 118148454 116898028
3681A16898028j158318j285703r49790j130326j429846j703791k242955k406373
$$ 116898028 115739710 114454007 113504217 112373891 110944045 109240254 106997299 104590926
3673A04590926k539477k554889k579619l138946l323979k943185l035551l032405
$$ 104590926 102051449 99496560 96916941 93777995 90454016 87510831 84475280 81442875
3665H1442875k358510k323775j955075j961037j728602j539531j753322j262726
$$ 81442875 79084365 76760590 74805515 72844478 71115876 69576345 67823023 66560297
3657F6560297j438193j801933j818344j822562j843633k164666k229114k250600
$$ 66560297 65122104 63320171 61501827 59679265 57835632 55670966 53441852 51191252
3649E1191252k270178j774096k152794j901248j482717j489559j227763j236749
$$ 51191252 48921074 47146978 44994184 43092936 41610219 40120660 38892897 37656148
3641C7656148q15470j113982j192908n49119p49959r68770q94340l75342o18644
$$ 37656148 36840678 35726696 34533788 33984669 33234710 32265940 31371600 30996258 30377614
3632C0377614p26616m54281o03692l55109n59808m93446l73250l67835n63083
$$ 30377614 29650998 29196717 28593025 28237916 27678108 27184662 26811412 26443577 25880494
3623B5880494k35531m92117o53678l57725n78691l72900l84664l10774l31882
$$ 25880494 25644963 25152846 24499168 24141443 23562752 23189852 22805188 22494414 22162532
3614B2162532o32724m06134k07823o4259j43537o03517o18982k58218l9046l9814
$$ 22162532 21529808 21123674 20915851 20851592 20708055 20104538 19485556 19227338 19188292 19148478
3604A9148478l65590k88853n82729k26179j55527j37619j31541m64084j75779
$$ 19148478 18782888 18494035 17911306 17685127 17529600 17391981 17260440 16796356 16620577
3595A6620577l0526Q6150k99405j32877k38280k03480M7413k8121j78132j50858
$$ 16620577 16590051 16676201 16376796 16243919 16005639 15802159 15849572 15821451 15643319 15492461
3585A5492461J98762k28469j3006K04409K18044j47430J93376l2255k07236J5878
$$ 15492461 15691223 15462754 15449748 15654157 15872201 15724771 15918147 15885892 15678656 15694534
3575A5694534j52127k27605m8251j83041k28679J95498R1691J47066p1146j43145
$$ 15694534 15542407 15314802 15266551 15083510 14854831 15050329 15142020 15289086 15217940 15074795
3565A5074795j78840m6940M9306k76744k4007R6566j35054J38566Q5510J3230
$$ 15074795 14895955 14849015 14898321 14621577 14597570 14694136 14559082 14697648 14783158 14796388
3555A4796388P3001k75997j38282M11761K13636l4993n1072K56592k01350j30313
$$ 14796388 14869389 14593392 14455110 14866871 15080507 15045514 14994442 15251034 15049684 14919371
3545A4919371j43245r66J69457J17712J93762o8033j1220N31671J56185J44262
$$ 14919371 14776126 14775160 14944617 15062329 15256091 15188058 15176838 15708509 15864694 16008956
3535A6008956K30164J75388J69610J6203J41249K25300R236K93629J23376J54592
$$ 16008956 16239120 16414508 16584118 16600321 16741570 16966870 16976106 17269735 17393111 17547703
3525A7547703O7487L40107N18141K54691L58273k634J67390M59742K06867L69173
$$ 17547703 17615190 17955297 18473438 18728129 19086402 19083768 19251158 19710900 19917767 20286940
3515B0286940M23938M92355P05194O47567R34299R03610J186037J480942J746211
$$ 20286940 20710878 21203233 21908427 22555994 23490293 24393903 25579940 27060882 28807093
3506B8807093K023062K008234K204833K704297K871092K617214K128294K042040
$$ 28807093 30830155 32838389 35043222 37747519 40618611 43235825 45364119 47406159
3498D7406159J480415J501970J097076R47967O50458R56476R22551R43001J145871
$$ 47406159 48886574 50388544 51485620 52433587 53084045 54040521 54963072 55906073 57051944
3489E7051944J204621J370668P87427L41432J0328j33009n15445j120865j000389
$$ 57051944 58256565 59627233 60414660 60756092 60766420 60633411 60117966 58997101 57996712
3480E7996712j067009j025554j183201q40244q31392p45689o09778o56549l08521
$$ 57996712 56929703 55904149 54720948 53880704 53049312 52303623 51693845 51037296 50728775
3471E0728775k69089l85567J83513P47058Q03246Q54543P54191J191129J445343
$$ 50728775 50459686 50074119 50257632 51004690 51807936 52662479 53416670 54607799 56053142
3462E6053142K143602K253927K449952K800522L204046M158907M702009N509632
$$ 56053142 58196744 60450671 62900623 65701145 68905191 73064098 77766107 83275739
3454H3275739N818561O337715P236772P033398O742174O342539N827944M773924
$$ 83275739 89094300 95432015 102668787 109702185 116444359 122786898 128614842 133388766
3446A33388766L646862K730251K060033J700711J894359J922379K015338K712456
$$ 133388766 137035628 139765879 141825912 143526623 145420982 147343361 149358699 152071155
3438A52071155L161226L241972K293047J479858Q86779O2839r39066j865801k100410
$$ 152071155 155232381 158474353 160767400 162247258 163134037 163196876 162257810 160392009 158291599
3429A58291599k686587k881720k903864k945851l157751k279937k498283k170336
$$ 158291599 155605012 152723292 149819428 146873577 143715826 141435889 138937606 136767270
3421A36767270k077671k322204k141771k269710k250638j823588j209518j113345
$$ 136767270 134689599 132367395 130225624 127955914 125705276 123881688 122672170 121558825
3413A21558825o51457L8052O14388J228438J530257J967554L135098L309060L801784
$$ 121558825 120907368 120945420 121559808 122788246 124318503 126286057 129421155 132730215 136531999
3404A36531999M434553N255873N697367O756131P584059Q201692R285107R660299
$$ 136531999 140966552 146222425 151919792 158675923 166259982 174461674 183746781 193407080
3396A93407080R249051R418173J0157224J0363902R901724R615736R504019Q909168
$$ 193407080 202656131 212074304 222231528 232595430 242497154 252112890 261616909 270526077
3388B70526077Q836634Q433553Q097145P344270O513024N534881M051808L026529
$$ 270526077 279362711 287796264 295893409 303237679 309750703 315285584 319337392 322363921
3380C22363921J746275O10004o12156j391719j887477k487825l341243m221075
$$ 322363921 324110196 324720200 324108044 322716325 320828848 318341023 314999780 310778705
3372C10778705m766253m877997m852108m148329l355105k381540j216862J34092
$$ 310778705 306012452 301134455 296282347 292134018 288778913 286397373 285180511 285314603
3364B85314603Q32025J223920J162937N00639N23432N45659M59967O49445J147910
$$ 285314603 286146628 287370548 288533485 289034124 289557556 290103215 290563182 291212627 292360537
3355B92360537J190618J610120J806887K085140K147634K305163K364741K707740
$$ 292360537 293551155 295161275 296968162 299053302 301200936 303506099 305870840 308578580
3347C08578580L134150K930829L057603K821123K087083J627422J560396R32615
$$ 308578580 311712730 314643559 317701162 320522285 322609368 324236790 325797186 326729801
3339C26729801j06480N4958M08221J62484J75189j22165p77709j355646k114765
$$ 326729801 326623321 326678279 327086500 327248984 327424173 327302008 326524299 325168653 323053888
3330C23053888l092315m123734m641675n501193o185327o394878o750631p174352
$$ 323053888 319961573 315837839 311196164 305694971 299509644 293114766 286364135 279189783
3322B79189783p261805p608526p814560p294446p094795o782008o888945o761984
$$ 279189783 271927978 264319452 256504892 249210446 242115651 235333643 228444698 221682714
3314B21682714o140760o199060o382404n841518m880394m492356l292991k997935
$$ 221682714 215541954 209342894 202960490 197118972 192238578 187746222 184453231 181455296
3306A81455296k096571j272586j016001r9556R44496J583621K491892K772492
$$ 181455296 179358725 178086139 177070138 176970582 177915078 179498699 181990591 184763083
3298A84763083K894922L126439L073433K701187K420262K033864J641182J633494
$$ 184763083 187658005 190784444 193857877 196559064 198979326 201013190 202654372 204287866
3290B04287866J295571J463946J561937J895788K141400K197501K225990K214066
$$ 204287866 205583437 207047383 208609320 210505108 212646508 214844009 217069999 219284065
3282B19284065J235292R47929J72272p90922j570438k335891l126460l440909
$$ 219284065 220519357 221467286 221639558 220848636 219278198 216942307 213815847 210374938
3274B10374938l179811k073234l2940K678743L955546O80509l862696o674688
$$ 210374938 207195127 205121893 205088953 207767696 211723242 212403751 208541055 201866367
3266B01866367q471158q014624o555653m902787l965895k638531j491991m27032
$$ 201866367 193395209 185380585 178824932 173922145 169956250 167317719 165825728 165398696
3258A65398696K67563R62192K109168K780633L406559M735307M904477N088860
$$ 165398696 165666259 166628451 168737619 171518252 174924811 179660118 184564595 189653455
3250A89653455N867040O072003O305366O541472P561626R135317J1362022J3659260
$$ 189653455 195520495 201592498 207897864 214439336 222000962 231136279 242498301 256157561
3242B56157561J2785836P671970K863963q93138l183901l228932k564208j528710
$$ 256157561 268943397 276615367 279479330 278586192 275402291 272173359 269609151 268080441
3234B68080441j076106n84361m43692j030542j573062k773339l945248m983679
$$ 268080441 267004335 266419974 265976282 264945740 263372678 260599339 256654091 251670412
3226B51670412o103542o995249q065868q588576q610200q963345r091669q374489
$$ 251670412 245566870 238571621 230505753 221917177 213306977 204343632 195251963 186877474
3218A86877474q014279p526114o754520n970292n117202m731024l544309l121849
$$ 186877474 178863195 171337081 164582561 158612269 153495067 148764043 145219734 142097885
3210A42097885k525503j694317j535100o17864L29827J028618K045840K602466
$$ 142097885 139572382 137878065 136342965 135725101 136054928 137083546 139129386 141731852
3202A41731852K976476L935952M928260N061654M942354M880347M626153M156412
$$ 141731852 144708328 148644280 153572540 158634194 163576548 168456895 173083048 177239460
3194A77239460L929054L493103K936780K832166K365378K231669K708414K334531
$$ 177239460 181168514 184661617 187598397 190430563 192795941 195027610 197736024 200070555
3186B00070555K136227J700991J094248K08821r33437j316204k594409l831409
$$ 200070555 202206782 203907773 205002021 205210842 204277405 202961201 200366792 196535383
3178A96535383m162171n169970n787166p103837p689171q262491q342677q732800
$$ 196535383 192373212 187203242 181416076 174312239 166623068 158360577 150017900 141285100
3170A41285100q159381p716386p342198o875942o098525n124116m867971m301513
$$ 141285100 133125719 125409333 118067135 111191193 105092668 99968552 95100581 90799068
3162I0799068m054499l791176k686085k126262k062902j668739j036139r39947
$$ 90799068 86744569 82953393 80267308 78141046 76078144 74409405 73373266 72433319
3154G2433319q44281l31474K03749O75141O32602J109700J070056J537992J234694
$$ 72433319 71589038 71257564 71461313 72136454 72769056 73878756 74948812 76486804 77721498
3145G7721498Q79493M63829N94191N87881K70356n92026q94371o99668p43801
$$ 77721498 78600991 79064820 79659011 80246892 80517248 79925222 79030851 78331183 77587382
3136G7587382p57983o38010l32486J55911l06779k78986o95632j089162j668789
$$ 77587382 76829399 76191389 75858903 76014814 75708035 75429049 74733417 73644255 71975466
3127G1975466k208187k596373l096701l270648l164731l029225l067150k694109
$$ 71975466 69767279 67170906 64074205 60803557 57638826 54609601 51542451 48848342
3119D8848342k592560k095698k101538k184891j834156j623997j306788j378074
$$ 48848342 46255782 44160084 42058546 39873655 38039499 36415502 35108714 33730640
3111C3730640q82353r68183j167639p59447p01807n21849n09379l80085p45781
$$ 33730640 32848287 31880104 30712465 29953018 29251211 28729362 28219983 27839898 27094117
3102B7094117l83914j42903k61660o92648l66336k13516k34686m12685m29000
$$ 27094117 26710203 26567300 26305640 25612992 25246656 25033140 24798454 24385769 23956769
3093B3956769j93539k19626m05370j52796r3382n06597m11750m68595p26139n60926
$$ 23956769 23763230 23543604 23138234 22985438 22892056 22385459 21973709 21505114 20778975 20218049
3083B0218049J06933n0625m54608j14852j38741l29437n02354l7043R8299l38313
$$ 20218049 20324982 20274357 19819749 19704897 19566156 19236719 18734365 18697322 18795621 18457308
3073A8457308k22338l82195k00266k13171l96075l68342r8705m28947n18216m78528
$$ 18457308 18234970 17852775 17652509 17439338 17043263 16674921 16576216 16147269 15629053 15150525
$$ [...]
##END NTUPLES=NMR SPECTRUM
##END=
